{"text_format":"1","workbook":"xlsx","n_sheets":14,"sheets":["Read First - Introduction","1. Location","2. Water Supply","3. Rates","4. Site Level Data","5. Water End-Use Data","Output Form","output_calcs","config","clear_inputs","input_validation","Irrigation Zones","template","Help"],"not_rendered":{"charts":0,"images":20,"macros":1,"external_links":0,"defined_names":203,"comments":0,"pivot_tables":0},"unopened":[],"bounds":{"document_bytes":16777216,"sheet_cells":100000,"rows_first":2000,"rows_last":500,"rows_between":2000,"halvings":0,"cell_chars":16384,"cell_head_chars":4096},"cells_cut":0,"cells_raw":0,"read":"whole","date_system":"1900"}

{"sheet":"Read First - Introduction","index":0,"n_rows":57,"n_cols":16,"rows_kept":57,"cut":false,"hidden":false,"merged":[[0,1,0,27],[1,7,1,28],[2,26,2,27],[4,1,7,27],[9,1,10,27],[51,1,54,27],[56,9,57,13],[56,15,57,19],[50,26,50,27],[12,1,14,27],[39,1,44,27],[46,11,47,17],[26,1,27,27],[24,1,25,27],[18,1,22,27],[28,1,35,27],[36,1,38,27]]}
[" "]
[null,null,null,null,null,null,null,"WATER PROJECT SCREENING TOOL"]
[null,"Introduction"]
[]
[null,"The Federal Energy Management Program (FEMP) developed this water project screening tool to enable federal agencies to quickly screen sites for water efficiency opportunities. General information related to a site’s water use is entered into the tool in the input tabs and the tool provides qualitative recommendations on potential water efficiency projects."]
[]
[]
[]
[]
[null,"Before you start: if a gold banner appears at the top of the workbook, click the “Enable Content” button. This will allow the tool to function properly."]
{"$rows_left_out":48}
{"sheet":"1. Location","index":1,"n_rows":13,"n_cols":30,"rows_kept":13,"cut":false,"hidden":false,"merged":[[0,0,0,28],[12,15,13,21],[1,29,1,16383],[5,16,5,27],[8,23,8,27],[1,7,1,28],[5,1,5,14],[8,1,8,10],[8,16,8,21],[8,12,8,14],[10,23,10,27],[2,26,2,27],[12,7,13,13]]}
[]
[null,null,null,null,null,null,null,"WATER PROJECT SCREENING TOOL",null,null,null,null,null,null,null,null,null,null,null,null,null,null,null,null,null,null,null,null,null,"Instructions"]
[null,"Location"]
[]
[null,"1. Name of person entering data",null,null,null,null,null,null,null,null,null,null,null,null,null,null,"2. Site name"]
[]
[]
[null,"3. City",null,null,null,null,null,null,null,null,null,null,"4. State",null,null,null,"5. Zip code (5-digit)",null,null,null,null,null,null,"6. Irrigation zone (1-11)"]
[]
[]
{"$rows_left_out":4}
{"sheet":"2. Water Supply","index":2,"n_rows":22,"n_cols":30,"rows_kept":22,"cut":false,"hidden":false,"merged":[[0,0,0,28],[1,29,1,16383],[1,7,1,28],[8,1,8,8],[8,10,8,17],[8,19,8,27],[21,7,22,13],[21,15,22,21],[14,19,14,27],[13,19,13,27],[13,10,13,17],[13,1,13,8],[18,19,18,27],[18,1,18,8],[18,10,18,17],[17,19,17,27],[17,10,17,17],[17,1,17,8],[14,1,14,8],[14,10,14,17]]}
[]
[null,null,null,null,null,null,null,"WATER PROJECT SCREENING TOOL",null,null,null,null,null,null,null,null,null,null,null,null,null,null,null,null,null,null,null,null,null,"Instructions"]
[null,"Water Supply"]
[]
[null,"1. What types of water are supplied to your site? Select all check boxes that apply."]
[null,null,"Potable Water",null,null,null,null,"Non-potable freshwater",null,null,null,null,null,null,"Alternative  water (water not sourced from freshwater)"]
[null,true,null,null,null,null,false,null,null,null,null,null,null,false]
[null,"What are the sources of water supplied to your site? Select all check boxes that apply for applicable water types."]
[null,"Potable water",null,null,null,null,null,null,null,null,"Non-potable freshwater",null,null,null,null,null,null,null,null,"Alternative water"]
[null,null,"Purchased",null,null,null,null,null,false,null,null,"Purchased",null,null,null,null,null,false,null,null,"Purchased",null,null,null,null,null,null,false]
{"$rows_left_out":13}
{"sheet":"3. Rates","index":3,"n_rows":17,"n_cols":30,"rows_kept":17,"cut":false,"hidden":false,"merged":[[0,0,0,28],[1,29,1,16383],[1,7,1,28],[5,22,5,27],[14,22,14,27],[5,1,5,8],[14,1,14,8],[2,29,18,41],[8,1,8,8],[8,22,8,27],[11,1,11,8],[11,22,11,27],[16,7,17,13],[16,15,17,21]]}
[]
[null,null,null,null,null,null,null,"WATER PROJECT SCREENING TOOL",null,null,null,null,null,null,null,null,null,null,null,null,null,null,null,null,null,null,null,null,null,"Instructions"]
[null,"Rates",null,null,null,null,null,null,null,null,null,null,null,null,null,null,null,null,null,null,null,null,null,null,null,null,null,null,null,"Flat monthly fee: site only pays a flat fee that does not change with volume of water/wastewater treated.\n\nVolumentric rate: water/wastewater is charged for the volume used."]
[]
[null,"1. What is your potable water rate structure? Select from drop-down list."]
[null,null,null,null,null,null,null,null,null,null,null,null,null,null,null,null,null,null,null,null,null,{"$f":"IF(B6=\"Flat monthly fee\",\"What is the monthly fee?  \",IF(B6=\"Volumetric rate\",\"What is the rate in $ per thousand gallons?  \",\"\"))","v":""}]
[]
[null,"1a. What is your non-potable water rate structure? Select from drop-down list."]
[null,null,null,null,null,null,null,null,null,null,null,null,null,null,null,null,null,null,null,null,null,{"$f":"IF(B9=\"Flat monthly fee\",\"What is the monthly fee?  \",IF(B9=\"Volumetric rate\",\"What is the rate in $ per thousand gallons?  \",\"\"))","v":""}]
[]
{"$rows_left_out":8}
{"sheet":"4. Site Level Data","index":4,"n_rows":29,"n_cols":30,"rows_kept":29,"cut":false,"hidden":false,"merged":[[0,0,0,28],[21,23,21,27],[28,7,29,13],[28,15,29,21],[25,20,25,27],[19,1,19,6],[19,8,19,13],[19,22,19,27],[19,15,19,20],[16,22,16,27],[18,1,18,6],[18,7,18,14],[18,22,18,27],[12,23,12,27],[23,23,23,27],[1,29,1,16383],[18,15,18,20],[1,7,1,28],[6,1,6,11],[6,18,6,27],[8,1,8,10],[8,18,8,27],[10,18,10,27],[15,1,15,6],[15,8,15,13],[15,15,15,20],[15,22,15,27],[16,1,16,6],[16,8,16,13],[16,15,16,20]]}
[]
[null,null,null,null,null,null,null,"WATER PROJECT SCREENING TOOL",null,null,null,null,null,null,null,null,null,null,null,null,null,null,null,null,null,null,null,null,null,"Instructions"]
[null,"Site Level Data"]
[]
[null,"1. What is the total population of your site?"]
[]
[null,"Average daily onsite tenants (live onsite)"]
[]
[null,"Average daily personnel (live offsite)"]
[]
{"$rows_left_out":20}
{"sheet":"5. Water End-Use Data","index":5,"n_rows":49,"n_cols":30,"rows_kept":49,"cut":false,"hidden":false,"merged":[[0,0,0,28],[1,29,1,16383],[1,7,1,28],[4,20,4,27],[10,20,10,27],[7,22,7,27],[4,1,5,18],[7,1,8,18],[21,20,21,27],[21,1,22,18],[18,1,19,18],[18,20,18,27],[29,1,30,18],[29,20,29,27],[24,20,24,27],[45,20,45,27],[40,20,40,27],[32,20,32,27],[48,7,49,13],[48,15,49,21],[37,1,38,18],[37,20,37,27]]}
[]
[null,null,null,null,null,null,null,"WATER PROJECT SCREENING TOOL",null,null,null,null,null,null,null,null,null,null,null,null,null,null,null,null,null,null,null,null,null,"Instructions"]
[null,"Water End-Use Data"]
[]
[null,"1. Have high efficiency fixture retrofits been installed in any of the site's restrooms? (Yes/No)"]
[]
[]
[null,"What is the estimated % of restrooms that have been upgraded with high efficiency fixtures?"]
[]
[]
{"$rows_left_out":40}
{"sheet":"Output Form","index":6,"n_rows":64,"n_cols":7,"rows_kept":64,"cut":false,"hidden":true,"merged":[[48,2,48,3],[1,6,1,27],[8,1,12,1],[13,1,24,1],[22,2,22,3],[18,2,18,3],[19,2,19,3],[21,2,21,3],[20,2,20,3],[12,2,12,3],[49,2,49,3],[63,1,64,4],[24,2,24,3],[35,1,41,1],[31,2,31,3],[27,2,27,3],[61,1,62,1],[25,1,27,1],[42,1,45,1],[46,1,49,1],[50,1,53,1],[58,2,58,3],[57,2,57,3],[52,2,52,3],[28,1,34,1],[53,2,53,3],[0,1,0,4],[41,2,41,3],[40,2,40,3],[59,2,59,3],[10,2,10,3],[54,1,60,1],[60,2,60,3],[34,2,34,3],[33,2,33,3],[23,2,23,3],[11,2,11,3],[32,2,32,3],[38,2,38,3],[39,2,39,3],[44,2,44,3],[45,2,45,3]]}
[" "]
[null,null,"   WATER PROJECT SCREENING TOOL | RESULTS",null,null,null,"Water Project Screening Tool"]
[]
[null,"Site name:",{"$f":"IF(loc_inpt_2=\"\",\"\",loc_inpt_2)","v":""}]
[null,"Site location:",{"$f":"IF(loc_inpt_3=\"\",\"\",loc_inpt_3&\", \"&loc_inpt_4)","v":""}]
[null,"POC:",{"$f":"IF(loc_inpt_1=\"\",\"\",loc_inpt_1)","v":""}]
[]
[null,"EQUIPMENT","PROJECT POTENTIAL SCORE","WHAT YOUR SCORE MEANS","TECHNOLOGY OPTIONS"]
[null,"PLUMBING",null,{"$f":"IF(wed_inpt_11>=0.9,\"Most or all of the site's plumbing fixtures have been retrofitted with high efficiency fixtures so there is minimal savings potential with plumbing fixture upgrades.\",INDIRECT(\"'output_calcs'!\"&ADDRESS(ROW(out_lookup)+MATCH(\"pl\",out_lookup,0)+MATCH(1,out_pl_ary,0)-2,COLUMN(out_lookup_exp))))","v":"Plumbing fixture upgrades likely represent a relatively low potential for water savings."},{"$f":"IF(wed_inpt_11>=0.9,\"\",INDIRECT(\"'output_calcs'!\"&ADDRESS(ROW(out_lookup)+MATCH(\"pl\",out_lookup,0)+MATCH(1,out_pl_ary,0)-2,COLUMN(out_lookup_opt))))","v":"Confirm that high efficiency fixtures have been installed in new and renovated buildings.  For buildings with standard or old plumbing fixtures, consider installing high efficiency toilets, urinals, faucets, and showerheads."}]
[null,null,"Resources:"]
{"$rows_left_out":55}
{"sheet":"output_calcs","index":7,"n_rows":148,"n_cols":20,"rows_kept":148,"cut":false,"hidden":true,"merged":[[69,0,69,2],[81,0,81,2],[12,0,12,2],[1,0,1,2],[28,0,28,2],[48,0,48,2],[62,0,62,2],[93,0,93,2],[100,0,100,2],[113,0,113,2],[128,0,128,2],[135,0,135,2]]}
["element","input","output",null,null,"Output text lookup",null,null,null,null,null,null,"CE Outdoor lookup",null,null,null,"Output table footer","include","cumulative"]
["cost effectiveness indoor",null,null,"ci",null,"code","level","explanation","options","resources","add1",null,"zone","min","max",null,"irrigation",{"$f":"IF(config_level_ir=5,1,0)","v":1},{"$f":"R2","v":1},{"$f":"IF(R2=0,\"\",IF(S2=1,\"have \",\"\")&IF(S2=$R$7,IF($R$7>1,\"or \"&Q2,Q2),IF(S2<$R$7,IF($R$7>2,Q2&\", \",Q2&\" \"),\"ERR\")))","v":"have irrigation, "}]
["rt_inpt_11",{"$f":"rt_inpt_11","v":0},{"$f":"IF(B3=\"Flat monthly fee\",0/0,0)","v":0},null,null,"ci",1,{"$f":"IF(rt_inpt_11=\"Flat monthly fee\",\"The site has a flat fee\" & \" for potable water and there is no marginal volumetric cost.  Therefore, water projects will be difficult to justify based on cost effectiveness unless they include other savings streams such as energy and operations and maintenance costs.\",\"The marginal cost of potable water \" & IF(rt_inpt_21=\"Volumetric rate\",\"and sewer \",\"\")& \"($\" & out_ci_combrt &\"/kgal) is inexpensive, which may make it difficult to justify indoor water efficiency projects unless they include other savings streams such as energy and operations and maintenance costs.\")","v":"The marginal cost of potable water ($0/kgal) is inexpensive, which may make it difficult to justify indoor water efficiency projects unless they include other savings streams such as energy and operations and maintenance costs."}," "," "," ",null,{"$f":"loc_inpt_6","v":0},{"$f":"IFERROR(INDIRECT(ADDRESS(MATCH(loc_inpt_6,out_co_zones,0)+ROW(out_co_zones)-1,COLUMN())),1)","v":1},{"$f":"IFERROR(INDIRECT(ADDRESS(MATCH(loc_inpt_6,out_co_zones,0)+ROW(out_co_zones)-1,COLUMN())),1)","v":1},null,"cooling towers",{"$f":"IF(config_level_ct=5,1,0)","v":1},{"$f":"R3+S2","v":2},{"$f":"IF(R3=0,\"\",IF(S3=1,\"have \",\"\")&IF(S3=$R$7,IF($R$7>1,\"or \"&Q3,Q3),IF(S3<$R$7,IF($R$7>2,Q3&\", \",Q3&\" \"),\"ERR\")))","v":"cooling towers, "}]
["rt_inpt_12",{"$f":"rt_inpt_12","v":0},{"$f":"IF(B3=\"Volumetric Rate\",rt_inpt_12,0)","v":0},null,null,"ci",2,{"$f":"\"The marginal cost of potable water \" & IF(rt_inpt_21=\"Volumetric rate\",\"and sewer \",\"\")& \"($\" & out_ci_combrt &\"/kgal) will likely produce fairly favorable, cost effective indoor water efficiency projects.\"","v":"The marginal cost of potable water ($0/kgal) will likely produce fairly favorable, cost effective indoor water efficiency projects."}," "," "," ",null,1,6.5,7.5,null,"a steam system",{"$f":"IF(config_level_ss=5,1,0)","v":1},{"$f":"R4+S3","v":3},"a steam system, "]
["rt_inpt_21",{"$f":"rt_inpt_21","v":0},null,null,null,"ci",3,{"$f":"\"The marginal cost of potable water \" & IF(rt_inpt_21=\"Volumetric rate\",\"and sewer \",\"\")& \"($\" & out_ci_combrt &\"/kgal) will likely produce very favorable, cost effective indoor water efficiency projects.\"","v":"The marginal cost of potable water ($0/kgal) will likely produce very favorable, cost effective indoor water efficiency projects."}," "," "," ",null,2,4,5,null,"a central vehicle wash facility",{"$f":"IF(config_level_vw=5,1,0)","v":1},4,"a central vehicle wash facility, "]
["rt_inpt_22",{"$f":"rt_inpt_22","v":0},{"$f":"IF(B3=\"Volumetric Rate\",IF(B5=\"Volumetric Rate\",rt_inpt_22,0),0)","v":0},null,null,"ci",4," "," "," "," ",null,3,3,4,null,"single-pass cooling",{"$f":"IF(config_level_sp=5,1,0)","v":1},5,"or single-pass cooling"]
["combined rate",null,{"$f":"SUM(C3:C6)","v":0},null,null,"ci","NA",{"$f":"\"No rate data entered.\"","v":"No rate data entered."}," "," "," ",null,4,1.5,2,null,"total",{"$f":"SUM(R2:R6)","v":5}]
["threshold 1","combined rate  >0 AND <=3 OR Flat rate",{"$f":"IF(NOT(ISERROR(out_ci_combrt)),IF(AND(out_ci_combrt>0,out_ci_combrt<=3),1,0),1)","v":0},null,null,"co",1,{"$f":"IF(out_co_combrt=\"flat rate\",\"The site has a flat fee for water\" & \" and there is no marginal volumetric cost. Therefore, landscape irrigation efficiency projects will be difficult to justify based on cost effectiveness unless they include other savings streams are included such as operations and maintenance costs.\",\"The marginal cost of \" &B23& \" water ($\" & out_co_combrt &\"/kgal) is inexpensive, which may make it difficult to justify landscape irrigation efficiency projects unless they include other savings streams such as operations and maintenance costs.\")","v":"The site has a flat fee for water and there is no marginal volumetric cost. Therefore, landscape irrigation efficiency projects will be difficult to justify based on cost effectiveness unless they include other savings streams are included such as operations and maintenance costs."}," "," "," ",null,5,2.25,3.25]
["threshold 2","combined rate >3 AND <6",{"$f":"IF(AND(NOT(ISERROR(out_ci_combrt)),out_ci_combrt>3,out_ci_combrt<6),1,0)","v":0},null,null,"co",2,{"$f":"\"The marginal cost of \" &B23& \" water ($\" & out_co_combrt &\"/kgal) will likely produce fairly favorable, cost effective landscape irrigation efficiency projects.\"","v":"The marginal cost of  water ($flat rate/kgal) will likely produce fairly favorable, cost effective landscape irrigation efficiency projects."}," "," "," ",null,6,6,7,null,"distribution system",{"$f":"IF(config_level_ds=5,1,0)","v":1},null,{"$f":"IF(R9=0,\".\",IF(R7>0,\". This site also does not \",\"\")&\"operate or maintain the potable water distribution system.\")","v":". This site also does not operate or maintain the potable water distribution system."}]
["threshold 3","combined rate >=6",{"$f":"IF(AND(NOT(ISERROR(out_ci_combrt)),out_ci_combrt>=6),1,0)","v":0},null,null,"co",3,{"$f":"\"The marginal cost of \" &B23& \" water ($\" & out_co_combrt &\"/kgal) will likely produce very favorable, cost effective landscape irrigation efficiency projects.\"","v":"The marginal cost of  water ($flat rate/kgal) will likely produce very favorable, cost effective landscape irrigation efficiency projects."}," "," "," ",null,7,3,4.5]
{"$rows_left_out":139}
{"sheet":"config","index":8,"n_rows":89,"n_cols":4,"rows_kept":89,"cut":false,"hidden":true,"merged":[]}
["plumbing",{"$f":"MATCH(1,out_pl_ary,0)","v":1}]
["irrigation",{"$f":"MATCH(1,out_ir_ary,0)","v":5}]
["irrigation adv controls",{"$f":"IF(wed_inpt_28=\"Advanced controls\",5,5)","v":5},null,"map_output_state"]
["irrigation conv controls",{"$f":"IF(wed_inpt_28=\"Conventional clock timers\",4,5)","v":5},null,true]
["irrigation alt water",{"$f":"IF(AND(wed_inpt_2=\"Yes\",wed_inpt_23=FALSE),4,5)","v":5}]
["distribution system",{"$f":"MATCH(1,out_ds_ary,0)","v":5},null,"app_enableevents"]
["cooling towers",{"$f":"MATCH(1,out_ct_ary,0)","v":5},null,true]
["ct alt water",{"$f":"IF(AND(wed_inpt_3=\"Yes\",wed_inpt_33=FALSE),4,5)","v":5}]
["steam system",{"$f":"MATCH(1,out_ss_ary,0)","v":5}]
["ss alt water",{"$f":"IF(AND(wed_inpt_4=\"Yes\",wed_inpt_43=FALSE),4,5)","v":5}]
{"$rows_left_out":80}
{"sheet":"clear_inputs","index":9,"n_rows":35,"n_cols":1,"rows_kept":35,"cut":false,"hidden":true,"merged":[]}
["loc_inpt_1"]
["loc_inpt_2"]
["loc_inpt_3"]
["loc_inpt_4"]
["loc_inpt_5"]
["loc_inpt_6"]
["ws_inpt_11"]
["ws_inpt_12"]
["ws_inpt_13"]
["rt_inpt_11"]
{"$rows_left_out":26}
{"sheet":"input_validation","index":10,"n_rows":72,"n_cols":12,"rows_kept":72,"cut":false,"hidden":true,"merged":[[5,8,8,8]]}
["level","worksheet","text","name","value","type","check",null,"error",null,"msg_type","msg_text"]
["worksheet","Location","the name of the person entering data","loc_inpt_1",{"$f":"INDIRECT(D2)","v":0},"text field",{"$f":"IF(E2=0,FALSE,TRUE)","v":false},null,{"$f":"MATCH(FALSE,validate_check_col,0)","v":2},null,"text field",{"$f":"\"Not all inputs are complete. Please enter a value for \" & INDIRECT(ADDRESS(validate_cur_err,COLUMN(validate_text_col)))  & \" in the \" & INDIRECT(ADDRESS(validate_cur_err,COLUMN(validate_ws_col))) & \" form.\"","v":"Not all inputs are complete. Please enter a value for the name of the person entering data in the Location form."}]
["worksheet","Location","your site name","loc_inpt_2",0,"text field",false,null,"type",null,"check box",{"$f":"\"Not all inputs are complete. Please select \" & INDIRECT(ADDRESS(validate_cur_err,COLUMN(validate_text_col))) & \" in the \" & INDIRECT(ADDRESS(validate_cur_err,COLUMN(validate_ws_col))) & \" form.\"","v":"Not all inputs are complete. Please select the name of the person entering data in the Location form."}]
["worksheet","Location","your city","loc_inpt_3",0,"text field",false,null,{"$f":"INDIRECT(ADDRESS(validate_cur_err,COLUMN(validate_type_col)))","v":"text field"},null,"multi text field",{"$f":"\"Not all inputs are complete. Please enter values \" & INDIRECT(ADDRESS(validate_cur_err,COLUMN(validate_text_col)))  & \" in the \" & INDIRECT(ADDRESS(validate_cur_err,COLUMN(validate_ws_col))) & \" form.\"","v":"Not all inputs are complete. Please enter values the name of the person entering data in the Location form."}]
["worksheet","Location","your state","loc_inpt_4",0,"text field",false,null,"message",null,"boolean",{"$f":"\"Not all inputs are complete. Please indicate whether \" & INDIRECT(ADDRESS(validate_cur_err,COLUMN(validate_text_col)))  & \" in the \" & INDIRECT(ADDRESS(validate_cur_err,COLUMN(validate_ws_col))) & \" form.\"","v":"Not all inputs are complete. Please indicate whether the name of the person entering data in the Location form."}]
["worksheet","Location","your zip code (5-digit)","loc_inpt_5",0,"text field",false,null,{"$f":"INDIRECT(ADDRESS(MATCH(validate_cur_type,validate_msg_type,0),COLUMN(validate_msg_text)))","v":"Not all inputs are complete. Please enter a value for the name of the person entering data in the Location form."},null,"water supply",{"$f":"\"Not all inputs are complete. You have indicated that the site uses \"& INDIRECT(ADDRESS(validate_cur_err,COLUMN(validate_text_col))) &\" for one or more water end-uses. Please select \"& INDIRECT(ADDRESS(validate_cur_err,COLUMN(validate_text_col))) &\" in the Water Supply form and complete the associated inputs in that form and the Rates form.\"","v":"Not all inputs are complete. You have indicated that the site uses the name of the person entering data for one or more water end-uses. Please select the name of the person entering data in the Water Supply form and complete the associated inputs in that form and the Rates form."}]
["worksheet","Location","your climate zone (1-11)","loc_inpt_6",0,"text field",false]
["worksheet","Water Supply",null,"ws_inpt_11",true,"check box","NA"]
["worksheet","Water Supply",null,"ws_inpt_12",false,"check box","NA"]
["worksheet","Water Supply",null,"ws_inpt_13",false,"check box","NA"]
{"$rows_left_out":63}
{"sheet":"Irrigation Zones","index":11,"n_rows":32,"n_cols":17,"rows_kept":32,"cut":false,"hidden":true,"merged":[[31,16,32,22]]}
[]
[null,null,null,null,null,null,null,"WATER PROJECT SCREENING TOOL | IRRIGATION ZONE MAP"]
[]
[]
[]
[]
[]
[]
[]
[]
{"$rows_left_out":23}
{"sheet":"template","index":12,"n_rows":0,"n_cols":0,"rows_kept":0,"cut":false,"hidden":true,"merged":[[1,0,1,20]]}

{"sheet":"Help","index":13,"n_rows":121,"n_cols":25,"rows_kept":121,"cut":false,"hidden":false,"merged":[[1,7,1,28],[4,1,7,27],[11,1,18,27],[70,1,72,27],[73,1,75,27],[20,1,22,27],[25,1,33,27],[37,1,39,27],[2,23,2,27],[9,21,9,27],[35,24,35,27],[53,21,53,27],[41,1,44,27],[55,1,56,27],[58,1,62,27],[46,1,51,27],[64,1,68,27],[116,1,118,27],[120,1,123,27],[76,1,77,27],[81,1,85,27],[92,1,102,27],[104,1,108,27],[110,1,114,27],[79,20,79,27],[86,1,89,27]]}
[]
[null,null,null,null,null,null,null,"WATER PROJECT SCREENING TOOL | HELP"]
[" ","Location",null,null,null,null,null,null,null,null,null,null,null,null,null,null,null,null,null,null,null,null,null,"Back to Location"]
[]
[null,"In fields 1 through 5, enter your name and site information. In field 6, select the irrigation zone for your location. To find your irrigation zone, click the “Show Map” button and find the appropriate irrigation zone for your site, then click the “Close” button and select the zone number from the dropdown list."]
[]
[]
[]
[]
[" ","Water Supply",null,null,null,null,null,null,null,null,null,null,null,null,null,null,null,null,null,null,null,"Back to Water Supply"]
{"$rows_left_out":111}