{"text_format":"1","workbook":"xlsx","n_sheets":15,"sheets":["Instructions","Max Input Data","Reduced Input Data","Optional Test Data","General Info & Test Results","Instrumentation","Test Conditions","Max Test","Reduced Test","Photos","Test Data Inputs & Calculations","Comments","Report Sign-Off Block","Drop-Downs and Tables","Version Control"],"not_rendered":{"charts":0,"images":0,"macros":1,"external_links":0,"defined_names":29,"comments":0,"pivot_tables":0},"unopened":[],"bounds":{"document_bytes":16777216,"sheet_cells":100000,"rows_first":2000,"rows_last":500,"rows_between":2000,"halvings":0,"cell_chars":16384,"cell_head_chars":4096},"cells_cut":0,"cells_raw":0,"read":"whole","date_system":"1900"}

{"sheet":"Instructions","index":0,"n_rows":67,"n_cols":3,"rows_kept":67,"cut":false,"hidden":false,"merged":[[39,1,41,2],[42,1,43,2],[44,1,45,1],[44,2,45,2],[1,1,1,2],[30,1,30,2],[31,1,32,1],[33,1,36,1],[10,1,10,2]]}
[]
[null,"Title Block"]
[null,"Test Report Template Name:",{"$f":"'Version Control'!C3","v":"Residential Condensing Gas Furnace"}]
[null,"Version Number:",{"$f":"'Version Control'!C4","v":"v1.6"}]
[null,"Latest Template Revision: ",{"$f":"'Version Control'!C5","v":"2017-07-06"}]
[null,"Tab Name:",{"$f":"MID(CELL(\"filename\",A1), FIND(\"]\", CELL(\"filename\", A1))+ 1, 255)","v":"Instructions"}]
[null,"File Name:",{"$f":"'Version Control'!C7","v":"Residential Condensing Gas Furnace - v1.6.xlsm"}]
[]
[]
[null,"Reference Test Procedures"]
[null,"10 CFR 430 Subpart B Appendix N:  Uniform Test Method for Measuring the Energy Consumption of Furnaces and Boilers"]
[]
[null,"Table of Contents"]
[null,"Tab","Contents"]
[null,"Instructions","Instructions and Table of Contents"]
[null,"Max Input Data","Raw data for the Max Test"]
[null,"Reduced Input Data","Raw data for the Reduced Test"]
[null,"Optional Test Data","Raw data for the Optional Test"]
[null,"General Info & Test Results","Lab information, product information and test results"]
[null,"Instrumentation","Instrumentation requirements and space for sensor placement descriptions"]
{"$rows_left_out":48}
{"sheet":"Max Input Data","index":1,"n_rows":9,"n_cols":10,"rows_kept":9,"cut":false,"hidden":false,"merged":[[1,1,1,2]]}
[]
[null,"Title Block",null,null,null,null,null,null,null,"Input raw data from the max input efficiency tests into this tab."]
[null,"Test Report Template Name:",{"$f":"'Version Control'!C3","v":"Residential Condensing Gas Furnace"},null,"Back to Instructions tab",null,null,null,null,"Include the following as a function of time for at least the duration of the steady state period and all test periods:"]
[null,"Version Number:",{"$f":"'Version Control'!C4","v":"v1.6"},null,null,null,null,null,null,"• Watts"]
[null,"Latest Template Revision: ",{"$f":"'Version Control'!C5","v":"2017-07-06"},null,null,null,null,null,null,"• Watt-hours"]
[null,"Tab Name:",{"$f":"MID(CELL(\"filename\",A1), FIND(\"]\", CELL(\"filename\", A1))+ 1, 255)","v":"Max Input Data"},null,null,null,null,null,null,"• Volts"]
[null,"File Name:",{"$f":"'Version Control'!C7","v":"Residential Condensing Gas Furnace - v1.6.xlsm"},null,null,null,null,null,null,"• Amps"]
[null,"Test Completion Date: ",{"$f":"'Version Control'!C8","v":"[MM/DD/YYYY]"},null,null,null,null,null,null,"• Temperatures from thermocouple grid"]
[null,null,null,null,null,null,null,null,null,"• Temperatures from ambient thermocouples"]

{"sheet":"Reduced Input Data","index":2,"n_rows":9,"n_cols":10,"rows_kept":9,"cut":false,"hidden":false,"merged":[[1,1,1,2]]}
[]
[null,"Title Block",null,null,null,null,null,null,null,"Input raw data from the reduced input efficiency tests into this tab."]
[null,"Test Report Template Name:",{"$f":"'Version Control'!C3","v":"Residential Condensing Gas Furnace"},null,"Back to Instructions tab",null,null,null,null,"Include the following as a function of time for at least the duration of the steady state period and all test periods:"]
[null,"Version Number:",{"$f":"'Version Control'!C4","v":"v1.6"},null,null,null,null,null,null,"• Watts"]
[null,"Latest Template Revision: ",{"$f":"'Version Control'!C5","v":"2017-07-06"},null,null,null,null,null,null,"• Watt-hours"]
[null,"Tab Name:",{"$f":"MID(CELL(\"filename\",A1), FIND(\"]\", CELL(\"filename\", A1))+ 1, 255)","v":"Reduced Input Data"},null,null,null,null,null,null,"• Volts"]
[null,"File Name:",{"$f":"'Version Control'!C7","v":"Residential Condensing Gas Furnace - v1.6.xlsm"},null,null,null,null,null,null,"• Amps"]
[null,"Test Completion Date: ",{"$f":"'Version Control'!C8","v":"[MM/DD/YYYY]"},null,null,null,null,null,null,"• Temperatures from thermocouple grid"]
[null,null,null,null,null,null,null,null,null,"• Temperatures from ambient thermocouples"]

{"sheet":"Optional Test Data","index":3,"n_rows":9,"n_cols":10,"rows_kept":9,"cut":false,"hidden":false,"merged":[[1,1,1,2]]}
[]
[null,"Title Block",null,null,null,null,null,null,null,"Input raw data from optional jacket loss test and/or draft factor test"]
[null,"Test Report Template Name:",{"$f":"'Version Control'!C3","v":"Residential Condensing Gas Furnace"},null,"Back to Instructions tab",null,null,null,null,"Include the following as a function of time for at least the duration of the steady state period and all test periods:"]
[null,"Version Number:",{"$f":"'Version Control'!C4","v":"v1.6"},null,null,null,null,null,null,"• Surface Temperature"]
[null,"Latest Template Revision: ",{"$f":"'Version Control'!C5","v":"2017-07-06"},null,null,null,null,null,null,"• Group Area"]
[null,"Tab Name:",{"$f":"MID(CELL(\"filename\",A1), FIND(\"]\", CELL(\"filename\", A1))+ 1, 255)","v":"Optional Test Data"},null,null,null,null,null,null,"• Coefficient of Radiation"]
[null,"File Name:",{"$f":"'Version Control'!C7","v":"Residential Condensing Gas Furnace - v1.6.xlsm"},null,null,null,null,null,null,"• Coefficient of Convection"]
[null,"Test Completion Date: ",{"$f":"'Version Control'!C8","v":"[MM/DD/YYYY]"},null,null,null,null,null,null,"• Room Temperature"]
[null,null,null,null,null,null,null,null,null,"• Hourly Heat Loss"]

{"sheet":"General Info & Test Results","index":4,"n_rows":51,"n_cols":8,"rows_kept":51,"cut":false,"hidden":false,"merged":[[1,1,1,2],[29,4,29,5],[21,4,23,7],[24,4,24,5],[25,4,25,5],[26,4,26,5],[27,4,27,5],[28,4,28,5],[20,4,20,7]]}
[]
[null,"Title Block"]
[null,"Test Report Template Name:",{"$f":"'Version Control'!C3","v":"Residential Condensing Gas Furnace"}]
[null,"Version Number:",{"$f":"'Version Control'!C4","v":"v1.6"},null,"Back to Instructions tab"]
[null,"Latest Template Revision: ",{"$f":"'Version Control'!C5","v":"2017-07-06"}]
[null,"Tab Name:",{"$f":"MID(CELL(\"filename\",A1), FIND(\"]\", CELL(\"filename\", A1))+ 1, 255)","v":"General Info & Test Results"}]
[null,"File Name:",{"$f":"'Version Control'!C7","v":"Residential Condensing Gas Furnace - v1.6.xlsm"}]
[null,"Test Completion Date: ",{"$f":"'Version Control'!C8","v":"[MM/DD/YYYY]"}]
[]
[]
[null,"Lab Information ",null,null,"Test Results"]
[null,"Lab Name:",null,null,"Variable","Result","Units"]
[null,"Lab Location:",null,null,"Steady State Efficiency",{"$f":"IF(C49=\"Single Stage\",'Test Data Inputs & Calculations'!H36,IF(C49=\"Two-Stage Modulating\",'Test Data Inputs & Calculations'!H51,IF(C49=\"Step Modulating\",'Test Data Inputs & Calculations'!H52,\"\")))","v":""},"% (0-100)"]
[null,null,null,null,"Heating Seasonal Efficiency",{"$f":"IF(C49=\"Single Stage\",'Test Data Inputs & Calculations'!G134,IF(C49=\"Two-Stage Modulating\",'Test Data Inputs & Calculations'!G135,IF(C49=\"Step Modulating\",'Test Data Inputs & Calculations'!G136,\"\")))","v":""},"% (0-100)"]
[null,"Test Information",null,null,"Annual Fuel Utilization Efficiency",{"$f":"IF(C49=\"Single Stage\",AFUEONE_round,IF(C49=\"Two-Stage Modulating\",AFUETWO_round,IF(C49=\"Step Modulating\",AFUEMOD_round,\"\")))","v":""},"% (0-100)"]
[null,"Date Test Started:","[MM/DD/YYYY]",null,"Furnace Fan Efficiency",{"$f":"IF('Test Data Inputs & Calculations'!G147<>\"\",'Test Data Inputs & Calculations'!G147*100,\"\")","v":""},"% (0-100)"]
[null,"Date Test Finished:","[MM/DD/YYYY]"]
[]
[null,"Product Information"]
[null,"Brand: ",null,null,"NOTE: This is only a copy; sign off is done in the Report Sign-Off Block tab"]
{"$rows_left_out":32}
{"sheet":"Instrumentation","index":5,"n_rows":40,"n_cols":8,"rows_kept":40,"cut":false,"hidden":false,"merged":[[34,1,37,7],[40,1,44,7],[1,1,1,2]]}
[]
[null,"Title Block"]
[null,"Test Report Template Name:",{"$f":"'Version Control'!C3","v":"Residential Condensing Gas Furnace"}]
[null,"Version Number:",{"$f":"'Version Control'!C4","v":"v1.6"},null,"Back to Instructions tab"]
[null,"Latest Template Revision: ",{"$f":"'Version Control'!C5","v":"2017-07-06"}]
[null,"Tab Name:",{"$f":"MID(CELL(\"filename\",A1), FIND(\"]\", CELL(\"filename\", A1))+ 1, 255)","v":"Instrumentation"}]
[null,"File Name:",{"$f":"'Version Control'!C7","v":"Residential Condensing Gas Furnace - v1.6.xlsm"}]
[null,"Test Completion Date: ",{"$f":"'Version Control'!C8","v":"[MM/DD/YYYY]"}]
[]
[]
[null,"Setup (This table should include instrumentation, sensors, and all equipment used during testing)"]
[null,"Instrument Type","Brand","Model #","Sensor Location","Accuracy","Date of Last Calibration","Deadline for Next Calibration"]
[]
[]
[]
[]
[]
[]
[]
[]
{"$rows_left_out":21}
{"sheet":"Test Conditions","index":6,"n_rows":73,"n_cols":7,"rows_kept":73,"cut":false,"hidden":false,"merged":[[1,1,1,2],[54,1,54,4],[11,1,11,3],[46,1,46,3],[19,1,19,2],[25,1,25,2],[32,1,32,3],[39,1,39,2]]}
[]
[null,"Title Block"]
[null,"Test Report Template Name:",{"$f":"'Version Control'!C3","v":"Residential Condensing Gas Furnace"}]
[null,"Version Number:",{"$f":"'Version Control'!C4","v":"v1.6"},null,null,null,"Back to Instructions tab"]
[null,"Latest Template Revision: ",{"$f":"'Version Control'!C5","v":"2017-07-06"}]
[null,"Tab Name:",{"$f":"MID(CELL(\"filename\",A1), FIND(\"]\", CELL(\"filename\", A1))+ 1, 255)","v":"Test Conditions"}]
[null,"File Name:",{"$f":"'Version Control'!C7","v":"Residential Condensing Gas Furnace - v1.6.xlsm"}]
[null,"Test Completion Date: ",{"$f":"'Version Control'!C8","v":"[MM/DD/YYYY]"}]
[]
[]
[null,"1. Gas Supply Pressure"]
[null,"Maintain gas supply pressure between the normal and increased values shown in Table 1 of ASHRAE 103"]
[null,null,"Normal","Increased"]
[null,"Required Test Pressure Range (in. water)",{"$f":"IF('General Info & Test Results'!C51=\"Natural Gas\",'Drop-Downs and Tables'!E20,IF('General Info & Test Results'!C51=\"Manufactured Gas\",'Drop-Downs and Tables'!E21,IF('General Info & Test Results'!C51=\"Butane\",'Drop-Downs and Tables'!E22,IF('General Info & Test Results'!C51=\"Propane\",'Drop-Downs and Tables'!E23,\"\"))))","v":""},{"$f":"IF('General Info & Test Results'!C51=\"Natural Gas\",'Drop-Downs and Tables'!F20,IF('General Info & Test Results'!C51=\"Manufactured Gas\",'Drop-Downs and Tables'!F21,IF('General Info & Test Results'!C51=\"Butane\",'Drop-Downs and Tables'!F22,IF('General Info & Test Results'!C51=\"Propane\",'Drop-Downs and Tables'!F23,\"\"))))","v":""}]
[null,null,"Maximum Test","Reduced Test"]
[null,"Measured Test Pressure (in. water)"]
[null,"Condition Met?",{"$f":"IF(OR(C16=\"\"),\"\",IF(AND(C16>=C14,C16<=D14),\"Yes\",\"No\"))","v":""},{"$f":"IF(OR(D16=\"\"),\"\",IF(AND(D16>=C14,D16<=D14),\"Yes\",\"No\"))","v":""}]
[]
[null,"2. Higher Heating Value"]
[null,"Determine the actual Higher Heating Value (HHV) in Btu per lb for  the gas to be used in the test with an error no greater than 1%"]
{"$rows_left_out":54}
{"sheet":"Max Test","index":7,"n_rows":79,"n_cols":6,"rows_kept":79,"cut":false,"hidden":false,"merged":[[11,1,11,2],[49,1,49,4],[18,1,18,4],[1,1,1,2]]}
[]
[null,"Title Block"]
[null,"Test Report Template Name:",{"$f":"'Version Control'!C3","v":"Residential Condensing Gas Furnace"}]
[null,"Version Number:",{"$f":"'Version Control'!C4","v":"v1.6"},null,null,"Back to Instructions tab"]
[null,"Latest Template Revision: ",{"$f":"'Version Control'!C5","v":"2017-07-06"}]
[null,"Tab Name:",{"$f":"MID(CELL(\"filename\",A1), FIND(\"]\", CELL(\"filename\", A1))+ 1, 255)","v":"Max Test"}]
[null,"File Name:",{"$f":"'Version Control'!C7","v":"Residential Condensing Gas Furnace - v1.6.xlsm"}]
[null,"Test Completion Date: ",{"$f":"'Version Control'!C8","v":"[MM/DD/YYYY]"}]
[]
[]
[null,"Steady State Temperature Requirement"]
[null,"Operate the burner and the circulation air blower or water pump until steady-state conditions are attained."]
[null,"Time (Minutes)","Flue Gas Temperature (°F)"]
[null,0]
[null,15]
[null,30]
[]
[null,"Steady State Conditions"]
[null,"Measure and record the steady-state gas input rate, including pilot gas, corrected to standard conditions of 60F and 30 in HG. Use measured values of gas temperature and pressure at the meter and barometric pressure to correct the metered gas flow rate to the above standard conditions.  Measure the steady-state electric power to the burner (PE) on units so equipped, and measure the steady-state electrical power to the conditioned air blowers (BE)"]
[null,"Measurements","Value","Unit","Variable"]
{"$rows_left_out":60}
{"sheet":"Reduced Test","index":8,"n_rows":78,"n_cols":6,"rows_kept":78,"cut":false,"hidden":false,"merged":[[18,1,18,4],[48,1,48,4],[1,1,1,2]]}
[]
[null,"Title Block"]
[null,"Test Report Template Name:",{"$f":"'Version Control'!C3","v":"Residential Condensing Gas Furnace"}]
[null,"Version Number:",{"$f":"'Version Control'!C4","v":"v1.6"},null,null,"Back to Instructions tab"]
[null,"Latest Template Revision: ",{"$f":"'Version Control'!C5","v":"2017-07-06"}]
[null,"Tab Name:",{"$f":"MID(CELL(\"filename\",A1), FIND(\"]\", CELL(\"filename\", A1))+ 1, 255)","v":"Reduced Test"}]
[null,"File Name:",{"$f":"'Version Control'!C7","v":"Residential Condensing Gas Furnace - v1.6.xlsm"}]
[null,"Test Completion Date: ",{"$f":"'Version Control'!C8","v":"[MM/DD/YYYY]"}]
[]
[]
[null,"Steady State Temperature Requirement"]
[null,"Operate the burner and the circulation air blower or water pump until steady-state conditions are attained."]
[null,"Time (Minutes)","Flue Gas Temperature (°F)"]
[null,0]
[null,15]
[null,30]
[]
[null,"Steady State Conditions"]
[null,"Measure and record the steady-state gas input rate, including pilot gas, corrected to standard conditions of 60F and 30 in HG. Use measured values of gas temperature and pressure at the meter and barometric pressure to correct the metered gas flow rate to the above standard conditions.  Measure the steady-state electric power to the burner (PE) on units so equipped, and measure the steady-state electrical power to the conditioned air blowers (BE)"]
[null,"Measurements","Value","Unit","Variable"]
{"$rows_left_out":59}
{"sheet":"Photos","index":9,"n_rows":176,"n_cols":9,"rows_kept":176,"cut":false,"hidden":false,"merged":[[1,1,1,2],[176,1,197,14],[35,1,56,14],[107,1,127,6],[107,8,127,14],[59,1,80,14],[83,1,104,14],[130,1,150,6],[130,8,150,14],[3,7,3,9],[2,3,2,5],[11,1,32,14],[153,1,173,6],[153,8,173,14]]}
[]
[null,"Title Block"]
[null,"Test Report Template Name:",{"$f":"'Version Control'!C3","v":"Residential Condensing Gas Furnace"}]
[null,"Version Number:",{"$f":"'Version Control'!C4","v":"v1.6"},null,null,null,null,"Back to Instructions tab"]
[null,"Latest Template Revision: ",{"$f":"'Version Control'!C5","v":"2017-07-06"}]
[null,"Tab Name:",{"$f":"MID(CELL(\"filename\",A1), FIND(\"]\", CELL(\"filename\", A1))+ 1, 255)","v":"Photos"}]
[null,"File Name:",{"$f":"'Version Control'!C7","v":"Residential Condensing Gas Furnace - v1.6.xlsm"}]
[null,"Test Completion Date: ",{"$f":"'Version Control'!C8","v":"[MM/DD/YYYY]"}]
[]
[]
[null,"1. Nameplate showing model number and serial number (if applicable)"]
[]
[]
[]
[]
[]
[]
[]
[]
[]
{"$rows_left_out":157}
{"sheet":"Test Data Inputs & Calculations","index":10,"n_rows":149,"n_cols":12,"rows_kept":149,"cut":false,"hidden":false,"merged":[[2,3,2,4],[142,1,148,1],[3,6,3,7],[10,1,10,11],[1,1,1,2]]}
[]
[null,"Title Block"]
[null,"Test Report Template Name:",{"$f":"'Version Control'!C3","v":"Residential Condensing Gas Furnace"}]
[null,"Version Number:",{"$f":"'Version Control'!C4","v":"v1.6"},null,null,null,"Back to Instructions tab"]
[null,"Latest Template Revision: ",{"$f":"'Version Control'!C5","v":"2017-07-06"}]
[null,"Tab Name:",{"$f":"MID(CELL(\"filename\",A1), FIND(\"]\", CELL(\"filename\", A1))+ 1, 255)","v":"Test Data Inputs & Calculations"}]
[null,"File Name:",{"$f":"'Version Control'!C7","v":"Residential Condensing Gas Furnace - v1.6.xlsm"}]
[null,"Test Completion Date: ",{"$f":"'Version Control'!C8","v":"[MM/DD/YYYY]"}]
[]
[]
[null,"Table 7: Fuel Characteristics and Parameters for Calculating Steady-State Sensible Heat Loss{LS,SS} and Steady-State Efficiency {EffySS}"]
[null,"Fuel","HHVA","A/F","LL,A","A","B","CF(1)","CF(2)","CF(3)","CF(4)","CF(5)"]
[null,{"$f":"IF('General Info & Test Results'!C51=\"\",\"\", 'General Info & Test Results'!C51)","v":""},{"$f":"IF($B$13=\"\",\"\",IF($B$13='Drop-Downs and Tables'!$B$36,'Drop-Downs and Tables'!C36,IF($B$13='Drop-Downs and Tables'!$B$37,'Drop-Downs and Tables'!C37,IF($B$13='Drop-Downs and Tables'!$B$38,'Drop-Downs and Tables'!C38,IF($B$13='Drop-Downs and Tables'!$B$39,'Drop-Downs and Tables'!C39)))))","v":""},{"$f":"IF($B$13=\"\",\"\",IF($B$13='Drop-Downs and Tables'!$B$36,'Drop-Downs and Tables'!D36,IF($B$13='Drop-Downs and Tables'!$B$37,'Drop-Downs and Tables'!D37,IF($B$13='Drop-Downs and Tables'!$B$38,'Drop-Downs and Tables'!D38,IF($B$13='Drop-Downs and Tables'!$B$39,'Drop-Downs and Tables'!D39)))))","v":""},{"$f":"IF($B$13=\"\",\"\",IF($B$13='Drop-Downs and Tables'!$B$36,'Drop-Downs and Tables'!E36,IF($B$13='Drop-Downs and Tables'!$B$37,'Drop-Downs and Tables'!E37,IF($B$13='Drop-Downs and Tables'!$B$38,'Drop-Downs and Tables'!E38,IF($B$13='Drop-Downs and Tables'!$B$39,'Drop-Downs and Tables'!E39)))))","v":""},{"$f":"IF($B$13=\"\",\"\",IF($B$13='Drop-Downs and Tables'!$B$36,'Drop-Downs and Tables'!F36,IF($B$13='Drop-Downs and Tables'!$B$37,'Drop-Downs and Tables'!F37,IF($B$13='Drop-Downs and Tables'!$B$38,'Drop-Downs and Tables'!F38,IF($B$13='Drop-Downs and Tables'!$B$39,'Drop-Downs and Tables'!F39)))))","v":""},{"$f":"IF($B$13=\"\",\"\",IF($B$13='Drop-Downs and Tables'!$B$36,'Drop-Downs and Tables'!G36,IF($B$13='Drop-Downs and Tables'!$B$37,'Drop-Downs and Tables'!G37,IF($B$13='Drop-Downs and Tables'!$B$38,'Drop-Downs and Tables'!G38,IF($B$13='Drop-Downs and Tables'!$B$39,'Drop-Downs and Tables'!G39)))))","v":""},{"$f":"IF($B$13=\"\",\"\",IF($B$13='Drop-Downs and Tables'!$B$36,'Drop-Downs and Tables'!H36,IF($B$13='Drop-Downs and Tables'!$B$37,'Drop-Downs and Tables'!H37,IF($B$13='Drop-Downs and Tables'!$B$38,'Drop-Downs and Tables'!H38,IF($B$13='Drop-Downs and Tables'!$B$39,'Drop-Downs and Tables'!H39)))))","v":""},{"$f":"IF($B$13=\"\",\"\",IF($B$13='Drop-Downs and Tables'!$B$36,'Drop-Downs and Tables'!I36,IF($B$13='Drop-Downs and Tables'!$B$37,'Drop-Downs and Tables'!I37,IF($B$13='Drop-Downs and Tables'!$B$38,'Drop-Downs and Tables'!I38,IF($B$13='Drop-Downs and Tables'!$B$39,'Drop-Downs and Tables'!I39)))))","v":""},{"$f":"IF($B$13=\"\",\"\",IF($B$13='Drop-Downs and Tables'!$B$36,'Drop-Downs and Tables'!J36,IF($B$13='Drop-Downs and Tables'!$B$37,'Drop-Downs and Tables'!J37,IF($B$13='Drop-Downs and Tables'!$B$38,'Drop-Downs and Tables'!J38,IF($B$13='Drop-Downs and Tables'!$B$39,'Drop-Downs and Tables'!J39)))))","v":""},{"$f":"IF($B$13=\"\",\"\",IF($B$13='Drop-Downs and Tables'!$B$36,'Drop-Downs and Tables'!K36,IF($B$13='Drop-Downs and Tables'!$B$37,'Drop-Downs and Tables'!K37,IF($B$13='Drop-Downs and Tables'!$B$38,'Drop-Downs and Tables'!K38,IF($B$13='Drop-Downs and Tables'!$B$39,'Drop-Downs and Tables'!K39)))))","v":""},{"$f":"IF($B$13=\"\",\"\",IF($B$13='Drop-Downs and Tables'!$B$36,'Drop-Downs and Tables'!L36,IF($B$13='Drop-Downs and Tables'!$B$37,'Drop-Downs and Tables'!L37,IF($B$13='Drop-Downs and Tables'!$B$38,'Drop-Downs and Tables'!L38,IF($B$13='Drop-Downs and Tables'!$B$39,'Drop-Downs and Tables'!L39)))))","v":""}]
[null,null,null,null,null,null,null,"CA(1)","CA(2)","CA(3)","CA(4)","CA(5)"]
[null,null,null,null,null,null,null,0.25462120999999999,-3.0260126E-5,2.7608571000000001E-8,-7.4253321000000006E-12,6.4307377000000003E-16]
[null,null,null,null,null,null,null,"i"]
[null,null,null,null,null,null,null,1,2,3,4,5]
[]
[null,"Steady State Efficiency Calculation"]
[null,"ANSI/ASHRAE Section","Variable Name","Equation / Instructions","Variable","Equation Section","Value","Calculated Result (rounded per significant figures conventions and instrumentation resolution)","Unit"]
{"$rows_left_out":130}
{"sheet":"Comments","index":11,"n_rows":11,"n_cols":8,"rows_kept":11,"cut":false,"hidden":false,"merged":[[1,1,1,2],[47,1,50,11],[10,1,10,11],[12,1,15,11],[17,1,20,11],[22,1,25,11],[27,1,30,11],[2,3,2,5],[3,7,3,9],[32,1,35,11],[37,1,40,11],[42,1,45,11]]}
[]
[null,"Title Block"]
[null,"Test Report Template Name:",{"$f":"'Version Control'!C3","v":"Residential Condensing Gas Furnace"}]
[null,"Version Number:",{"$f":"'Version Control'!C4","v":"v1.6"},null,null,null,null,"Back to Instructions tab"]
[null,"Latest Template Revision: ",{"$f":"'Version Control'!C5","v":"2017-07-06"}]
[null,"Tab Name:",{"$f":"MID(CELL(\"filename\",A1), FIND(\"]\", CELL(\"filename\", A1))+ 1, 255)","v":"Comments"}]
[null,"File Name:",{"$f":"'Version Control'!C7","v":"Residential Condensing Gas Furnace - v1.6.xlsm"}]
[null,"Test Completion Date: ",{"$f":"'Version Control'!C8","v":"[MM/DD/YYYY]"}]
[]
[]
[null,"Enter all anomalies with the test."]

{"sheet":"Report Sign-Off Block","index":12,"n_rows":18,"n_cols":5,"rows_kept":18,"cut":false,"hidden":false,"merged":[[1,1,1,2],[17,1,17,2],[10,1,10,4],[11,1,12,4],[13,1,13,2],[14,1,14,2],[15,1,15,2],[16,1,16,2]]}
[]
[null,"Title Block"]
[null,"Test Report Template Name:",{"$f":"'Version Control'!C3","v":"Residential Condensing Gas Furnace"}]
[null,"Version Number:",{"$f":"'Version Control'!C4","v":"v1.6"},null,"Back to Instructions tab"]
[null,"Latest Template Revision: ",{"$f":"'Version Control'!C5","v":"2017-07-06"}]
[null,"Tab Name:",{"$f":"MID(CELL(\"filename\",A1), FIND(\"]\", CELL(\"filename\", A1))+ 1, 255)","v":"Report Sign-Off Block"}]
[null,"File Name:",{"$f":"'Version Control'!C7","v":"Residential Condensing Gas Furnace - v1.6.xlsm"}]
[null,"Test Completion Date: ",{"$f":"'Version Control'!C8","v":"[MM/DD/YYYY]"}]
[]
[]
[null,"Test Report Sign-Off Block "]
[null,"By signing in the space below, we certify that the information and data in this report: (1) were obtained from the specific test unit under test; (2) were obtained during the specific test being reported; (3) were not copied from any other source, except where instructed to do so; and (4) were not altered or modified in any way. "]
[]
[null,"Role",null,"Date","Entity"]
[null,"Test Completion",null,{"$f":"'General Info & Test Results'!C17","v":"[MM/DD/YYYY]"},"[Test Lab Name]"]
[null,"Template Completion",null,"[MM/DD/YYYY]","[Test Lab Name]"]
[null,"Report Review by Test Lab",null,"[MM/DD/YYYY]","[Test Lab Name]"]
[null,"Report Review by Test Lab",null,"[MM/DD/YYYY]","[Test Lab Name]"]

{"sheet":"Drop-Downs and Tables","index":13,"n_rows":78,"n_cols":15,"rows_kept":78,"cut":false,"hidden":false,"merged":[[75,3,77,3],[59,9,60,9],[41,3,42,3],[58,1,58,5],[59,7,59,8],[25,3,26,3],[24,1,24,4],[25,4,26,4],[25,1,25,2],[33,1,33,11],[1,1,1,2],[17,4,17,5],[17,1,18,1],[17,2,18,2],[17,3,18,3]]}
[]
[null,"Title Block"]
[null,"Test Report Template Name:",{"$f":"'Version Control'!C3","v":"Residential Condensing Gas Furnace"}]
[null,"Version Number:",{"$f":"'Version Control'!C4","v":"v1.6"},null,null,null,null,"Back to Instructions tab"]
[null,"Latest Template Revision: ",{"$f":"'Version Control'!C5","v":"2017-07-06"}]
[null,"Tab Name:",{"$f":"MID(CELL(\"filename\",A1), FIND(\"]\", CELL(\"filename\", A1))+ 1, 255)","v":"Drop-Downs and Tables"}]
[null,"File Name:",{"$f":"'Version Control'!C7","v":"Residential Condensing Gas Furnace - v1.6.xlsm"}]
[null,"Test Completion Date: ",{"$f":"'Version Control'!C8","v":"[MM/DD/YYYY]"}]
[]
[]
[null,"Drop Downs"]
[null,"Heating_Medium","Circulation","Energy_Source","Burner_Type","Ignition","Draft_Equipment","Off_Cycle_Devices","Installation","Flue_Gas","Control","System_Number","Fuel_Used","Yes_No","Jacket_Loss"]
[]
[null,"Air","Forced","Gas","Power (Induced Draft)","Intermittent","None","None","Isolated Combustion System","Condensing","Single Stage",10,"Natural Gas","Yes","Default Value"]
[null,null,null,null,null,null,null,null,null,null,"Two-Stage Modulating",null,"Manufactured Gas","No","Optional Test"]
[null,"Tables",null,null,null,null,null,null,null,null,"Step Modulating",null,"Butane"]
[null,"Table 1: (from 8.2.1.3)",null,null,null,null,null,null,null,null,null,null,"Propane"]
[null,"Type","Heating Value (Btu/SCF)","Sp. Gr. (Air = 1)","Test Pressure (in. Water)"]
[null,null,null,null,"Normal","Increased"]
[null,"Natural",1025,0.65,7,10.5]
{"$rows_left_out":59}
{"sheet":"Version Control","index":14,"n_rows":20,"n_cols":3,"rows_kept":20,"cut":false,"hidden":false,"merged":[[1,1,1,2]]}
[]
[null,"Title Block"]
[null,"Test Report Template Name:","Residential Condensing Gas Furnace"]
[null,"Version Number:",{"$f":"INDEX(B13:B62,COUNTA(B13:B62),1)","v":"v1.6"}]
[null,"Latest Template Revision: ",{"$f":"IF(MAX(B13:C104)=0,\"No Revisions Dates Entered\",MAX(C13:C104))","v":"2017-07-06"}]
[null,"Tab Name:",{"$f":"MID(CELL(\"filename\",A1), FIND(\"]\", CELL(\"filename\", A1))+ 1, 255)","v":"Version Control"}]
[null,"File Name:",{"$f":"MID(CELL(\"FILENAME\",F16),FIND(\"[\",CELL(\"FILENAME\",F16))+1,FIND(\"]\",CELL(\"FILENAME\",F16))-FIND(\"[\",CELL(\"FILENAME\",F16))-1)","v":"Residential Condensing Gas Furnace - v1.6.xlsm"}]
[null,"Test Completion Date: ",{"$f":"'General Info & Test Results'!C17","v":"[MM/DD/YYYY]"}]
[]
[]
[null,"Revisions List"]
[null,"Version","Date"]
[null,1,"2012-08-20"]
[null,1.1000000000000001,"2013-01-07"]
[null,1.2,"2013-03-01"]
[null,"1.5_draft3","2013-06-07"]
[null,"1.5_draft4","2013-08-01"]
[null,"1.5_draft5","2013-08-05"]
[null,"v1.5_draft6","2015-06-05"]
[null,"v1.6","2017-07-06"]