{"text_format":"1","workbook":"xlsx","n_sheets":12,"sheets":["Instructions","General Info & Test Results","Setup & Instrumentation","CTS Calibration","Photos","Test Sample Description","Sample U-factor Test","Energy Consumption","Comments","Report Sign-Off Block","Drop-Downs","Version Control"],"not_rendered":{"charts":0,"images":0,"macros":1,"external_links":0,"defined_names":11,"comments":0,"pivot_tables":0},"unopened":[],"bounds":{"document_bytes":16777216,"sheet_cells":100000,"rows_first":2000,"rows_last":500,"rows_between":2000,"halvings":0,"cell_chars":16384,"cell_head_chars":4096},"cells_cut":0,"cells_raw":0,"read":"whole","date_system":"1900"}

{"sheet":"Instructions","index":0,"n_rows":53,"n_cols":3,"rows_kept":53,"cut":false,"hidden":false,"merged":[[1,1,1,2],[9,1,9,2],[35,1,35,2],[41,1,43,1],[41,2,43,2],[10,1,10,2],[36,1,38,2],[39,1,40,2],[12,1,12,2],[27,1,27,2],[28,1,29,1],[30,1,33,1]]}
[]
[null,{"$f":"'Version Control'!$B$2","v":"Title Block"}]
[null,{"$f":"'Version Control'!$B$3","v":"Test Report Template Name:"},{"$f":"'Version Control'!$C$3","v":"Walk-In Doors"}]
[null,{"$f":"'Version Control'!$B$4","v":"Version Number:"},{"$f":"'Version Control'!$C$4","v":"v1.2"}]
[null,{"$f":"'Version Control'!$B$5","v":"Latest Template Revision: "},{"$f":"'Version Control'!$C$5","v":"2020-04-13"}]
[null,{"$f":"'Version Control'!$B$6","v":"Tab Name:"},{"$f":"MID(CELL(\"filename\",A1), FIND(\"]\", CELL(\"filename\", A1))+ 1, 255)","v":"Instructions"}]
[null,{"$f":"'Version Control'!$B$7","v":"File Name:"},{"$f":"'Version Control'!$C$7","v":"Walk-In Doors - v1.2.xlsm"}]
[]
[]
[null,"Reference Test Procedure"]
[null,"10 CFR Part 431 Appendix A to Subpart R: Uniform test method for the measurement of energy consumption of the components of envelopes of walk-in coolers and walk-in freezers"]
[]
[null,"Table of Contents"]
[null,"Tab","Contents"]
[null,"Instructions","Instructions and table of contents"]
[null,"General Info & Test Results","Lab information, equipment information, and test results"]
[null,"Setup & Instrumentation","Instrumentation and calibration requirements and space for sensor placement descriptions"]
[null,"CTS Calibration","Calibration inputs and automated calculations"]
[null,"Photos","Inputs for photographs"]
[null,"Test Sample Description","Physical and material description of the test sample which includes electrical component characteristics"]
{"$rows_left_out":34}
{"sheet":"General Info & Test Results","index":1,"n_rows":38,"n_cols":8,"rows_kept":38,"cut":false,"hidden":false,"merged":[[29,4,29,5],[1,1,1,2],[10,1,10,2],[21,1,21,2],[22,4,24,7],[28,4,28,5],[26,4,26,5],[27,4,27,5]]}
[]
[null,{"$f":"'Version Control'!$B$2","v":"Title Block"},null,null,"Back to Instructions tab"]
[null,{"$f":"'Version Control'!$B$3","v":"Test Report Template Name:"},{"$f":"'Version Control'!$C$3","v":"Walk-In Doors"}]
[null,{"$f":"'Version Control'!$B$4","v":"Version Number:"},{"$f":"'Version Control'!$C$4","v":"v1.2"}]
[null,{"$f":"'Version Control'!$B$5","v":"Latest Template Revision: "},{"$f":"'Version Control'!$C$5","v":"2020-04-13"}]
[null,{"$f":"'Version Control'!$B$6","v":"Tab Name:"},{"$f":"MID(CELL(\"filename\",A1), FIND(\"]\", CELL(\"filename\", A1))+ 1, 255)","v":"General Info & Test Results"}]
[null,{"$f":"'Version Control'!$B$7","v":"File Name:"},{"$f":"'Version Control'!$C$7","v":"Walk-In Doors - v1.2.xlsm"}]
[null,{"$f":"'Version Control'!$B$8","v":"Test Completion Date: "},{"$f":"'General Info & Test Results'!D17","v":"[MM/DD/YYYY]"}]
[]
[]
[null,"Lab Information ",null,null,null,"Test results"]
[null,"Lab Name:",null,null,null,"Variable","Result","Units"]
[null,"Lab Location:",null,null,null,"Standardized U-factor (UST)",{"$f":"IF('Sample U-factor Test'!E71<>\"\",'Sample U-factor Test'!E71,\"Incomplete\")","v":"Incomplete"},"Btu/(h-ft2-°F)"]
[null,null,null,null,null,"Energy Consumption",{"$f":"IF(ISNUMBER('Energy Consumption'!C59)=FALSE,\"Incomplete\",'Energy Consumption'!C59)","v":"Incomplete"},"kWh/day"]
[null,"U-factor Test Information"]
[null,null,"Start Date/Time","End Date/Time"]
[null,"Date of Test","[MM/DD/YYYY]","[MM/DD/YYYY]"]
[null,"Test parameters were considered stable for two consecutive four hour test periods from: ","[MM/DD/YYYY] [hh:mm]","[MM/DD/YYYY] [hh:mm]"]
[null,"The thermal test results were derived from","[MM/DD/YYYY] [hh:mm]","[MM/DD/YYYY] [hh:mm]"]
[]
{"$rows_left_out":19}
{"sheet":"Setup & Instrumentation","index":2,"n_rows":55,"n_cols":9,"rows_kept":55,"cut":false,"hidden":false,"merged":[[16,2,16,3],[20,2,20,3],[11,2,11,3],[12,2,12,3],[13,2,13,3],[14,2,14,3],[15,2,15,3],[17,2,17,3],[18,2,18,3],[19,2,19,3],[6,1,6,2],[8,1,8,2],[1,1,1,2],[2,1,2,2],[3,1,3,2],[4,1,4,2],[5,1,5,2],[7,1,7,2]]}
[]
[null,{"$f":"'Version Control'!$B$2","v":"Title Block"}]
[null,{"$f":"'Version Control'!$B$3","v":"Test Report Template Name:"},null,{"$f":"'Version Control'!$C$3","v":"Walk-In Doors"}]
[null,{"$f":"'Version Control'!$B$4","v":"Version Number:"},null,{"$f":"'Version Control'!$C$4","v":"v1.2"},null,"Back to Instructions tab"]
[null,{"$f":"'Version Control'!$B$5","v":"Latest Template Revision: "},null,{"$f":"'Version Control'!$C$5","v":"2020-04-13"}]
[null,{"$f":"'Version Control'!$B$6","v":"Tab Name:"},null,{"$f":"MID(CELL(\"filename\",B1), FIND(\"]\", CELL(\"filename\", B1))+ 1, 255)","v":"Setup & Instrumentation"}]
[null,{"$f":"'Version Control'!$B$7","v":"File Name:"},null,{"$f":"'Version Control'!$C$7","v":"Walk-In Doors - v1.2.xlsm"}]
[null,"Test Start Date:",null,{"$f":"'General Info & Test Results'!C17","v":"[MM/DD/YYYY]"}]
[null,{"$f":"'Version Control'!$B$8","v":"Test Completion Date: "},null,{"$f":"'General Info & Test Results'!D17","v":"[MM/DD/YYYY]"}]
[]
[]
[null,null,"Chamber Setup - Baffles",null,"Warm Side/Metering Chamber","Cold Side/Climate Chamber"]
[null,null,"Wind direction in relation to the test sample",null,"-"]
[null,null,"Baffle dimensions"]
[null,null,"Height (in)"]
[null,null,"Width (in)"]
[null,null,"Are the baffle thermocouples located at the center of equal-area surfaces?  If no, please provide a schematic diagram or image in the photos tab."]
[null,null,"Number of baffle thermocouples total"]
[null,null,"Number of thermocouples per row"]
[null,null,"Number of thermocouples per column"]
{"$rows_left_out":36}
{"sheet":"CTS Calibration","index":3,"n_rows":75,"n_cols":13,"rows_kept":75,"cut":false,"hidden":false,"merged":[[25,10,25,11],[25,8,25,9],[21,2,21,3],[21,10,21,11],[22,10,22,11],[23,10,23,11],[24,10,24,11],[24,8,24,9],[19,4,19,5],[22,8,22,9],[23,8,23,9],[69,2,69,4],[70,2,70,4],[74,2,74,3],[73,2,73,3],[67,2,67,4],[60,2,60,4],[71,2,71,4],[28,2,28,3],[27,4,27,5],[28,4,28,5],[29,4,29,5],[65,2,65,4],[66,2,66,4],[68,2,68,4],[37,2,37,4],[51,2,51,4],[64,2,64,4],[63,2,63,4],[33,4,33,5],[31,2,31,3],[32,2,32,3],[59,2,59,4],[27,2,27,3],[33,2,33,3],[62,2,62,4],[2,1,2,2],[3,1,3,2],[4,1,4,2],[5,1,5,2],[6,1,6,2],[7,1,7,2],[20,4,20,5],[10,1,10,2],[11,1,11,2],[20,2,20,3],[18,2,18,3],[18,4,18,5],[15,1,15,13],[20,10,20,11],[32,4,32,5],[27,8,27,9],[30,4,30,5],[30,2,30,3],[31,4,31,5],[47,2,47,4],[56,2,56,4],[55,2,55,4],[18,8,18,11],[12,1,12,2],[13,1,13,2],[46,2,46,4],[17,2,17,6],[25,2,25,6],[23,4,23,5],[24,4,24,5],[24,2,24,3],[26,2,26,3],[21,4,21,5],[26,4,26,5],[22,2,22,3],[23,2,23,3],[22,4,22,5],[39,2,39,4],[40,2,40,4],[42,2,42,4],[43,2,43,4],[17,8,17,12],[19,2,19,3],[44,2,44,4],[61,2,61,4],[27,10,27,11],[19,8,19,9],[19,10,19,11],[26,8,26,9],[26,10,26,11],[35,2,35,4],[36,2,36,4],[49,2,49,4],[41,2,41,4],[38,2,38,4],[45,2,45,4],[20,8,20,9],[21,8,21,9],[58,2,58,4],[52,2,52,4],[53,2,53,4],[54,2,54,4],[48,2,48,4],[50,2,50,4],[29,2,29,3]]}
[]
[null,{"$f":"'Version Control'!$B$2","v":"Title Block"}]
[null,{"$f":"'Version Control'!$B$3","v":"Test Report Template Name:"},null,{"$f":"'Version Control'!$C$3","v":"Walk-In Doors"}]
[null,{"$f":"'Version Control'!$B$4","v":"Version Number:"},null,{"$f":"'Version Control'!$C$4","v":"v1.2"},null,null,"Back to Instructions tab"]
[null,{"$f":"'Version Control'!$B$5","v":"Latest Template Revision: "},null,{"$f":"'Version Control'!$C$5","v":"2020-04-13"}]
[null,{"$f":"'Version Control'!$B$6","v":"Tab Name:"},null,{"$f":"MID(CELL(\"filename\",B1), FIND(\"]\", CELL(\"filename\", B1))+ 1, 255)","v":"CTS Calibration"}]
[null,{"$f":"'Version Control'!$B$7","v":"File Name:"},null,{"$f":"'Version Control'!$C$7","v":"Walk-In Doors - v1.2.xlsm"}]
[null,{"$f":"'Version Control'!$B$8","v":"Test Completion Date: "},null,{"$f":"'General Info & Test Results'!D17","v":"[MM/DD/YYYY]"}]
[]
[]
[null,"Constants",null,"Quantity","Units"]
[null,"Stefan-Boltzmann",null,{"$f":"0.000000001714","v":1.7140000000000001E-9},"Btu/(h-ft2-°R4)"]
[null,"Standardized Surface Heat Transfer Coefficient - Warm Side",null,1.36,"Btu/(h-ft2-°F)"]
[null,"Standardized Surface Heat Transfer Coefficient - Cold Side",null,5.3,"Btu/(h-ft2-°F)"]
[]
[null,"CTS Calibration - C1199 6.1.2"]
[]
[null,null,"Calibration Transfer Standard (CTS) Details",null,null,null,null,null,"Surround Panel Details"]
[null,null,"Date of purchase for the CTS materials and additional materials used for the conductance test",null,"[MM/YYYY]",null,"Units",null,"Include a diagram showing measurements & locations of thermocouples in \"Photos\" tab.  Conductance test should be done on a representative sample of material (i.e., same lot) to what is used in the surround panel and under representative conditions (i.e., temperature).",null,null,null,"Units"]
[null,null,"Material Description",null,null,null,"-",null,"Date of purchase for surround panel materials",null,"[MM/YYYY]",null,"-"]
{"$rows_left_out":56}
{"sheet":"Photos","index":4,"n_rows":179,"n_cols":10,"rows_kept":179,"cut":false,"hidden":false,"merged":[[67,9,92,25],[66,1,66,7],[66,9,66,25],[94,1,94,7],[94,9,94,25],[179,1,204,25],[178,1,178,25],[1,1,1,2],[122,1,122,25],[123,1,148,25],[38,1,38,25],[39,1,64,25],[67,1,92,7],[11,1,36,25],[10,1,10,25],[150,1,150,7],[150,9,150,25],[151,1,176,7],[151,9,176,25],[95,1,120,7],[95,9,120,25]]}
[]
[null,{"$f":"'Version Control'!$B$2","v":"Title Block"}]
[null,{"$f":"'Version Control'!$B$3","v":"Test Report Template Name:"},{"$f":"'Version Control'!$C$3","v":"Walk-In Doors"}]
[null,{"$f":"'Version Control'!$B$4","v":"Version Number:"},{"$f":"'Version Control'!$C$4","v":"v1.2"},null,"Back to Instructions tab"]
[null,{"$f":"'Version Control'!$B$5","v":"Latest Template Revision: "},{"$f":"'Version Control'!$C$5","v":"2020-04-13"}]
[null,{"$f":"'Version Control'!$B$6","v":"Tab Name:"},{"$f":"MID(CELL(\"filename\",A1), FIND(\"]\", CELL(\"filename\", A1))+ 1, 255)","v":"Photos"}]
[null,{"$f":"'Version Control'!$B$7","v":"File Name:"},{"$f":"'Version Control'!$C$7","v":"Walk-In Doors - v1.2.xlsm"}]
[null,{"$f":"'Version Control'!$B$8","v":"Test Completion Date: "},{"$f":"'General Info & Test Results'!D17","v":"[MM/DD/YYYY]"}]
[]
[]
[null,"1. Nameplate(s) and/or label(s) of test sample showing model number and serial number"]
[]
[]
[]
[]
[]
[]
[]
[]
[]
{"$rows_left_out":160}
{"sheet":"Test Sample Description","index":5,"n_rows":59,"n_cols":7,"rows_kept":59,"cut":false,"hidden":false,"merged":[[9,6,9,15],[10,6,62,15],[53,1,53,2],[56,1,56,2],[48,1,48,2],[46,1,46,2],[47,1,47,2],[42,1,42,2],[39,1,39,2],[55,1,55,2],[35,1,35,2],[36,1,36,2],[45,1,45,2],[25,1,25,2],[38,1,38,2],[52,1,52,2],[33,1,33,2],[40,1,40,2],[41,1,41,2],[54,1,54,2],[1,1,1,2],[27,1,27,2],[31,1,31,2],[34,1,34,2],[24,1,24,2],[28,1,28,2],[29,1,29,2],[30,1,30,2],[32,1,32,2],[26,1,26,2],[25,3,25,4],[32,3,32,4],[38,3,38,4],[44,3,44,4],[52,3,52,4],[27,3,27,4],[39,3,39,4],[46,3,46,4],[33,3,33,4],[45,3,45,4],[47,3,47,4],[26,3,26,4],[57,1,57,2],[58,1,58,2],[49,1,49,2],[50,1,50,2],[55,3,55,4],[54,3,54,4],[53,3,53,4]]}
[]
[null,{"$f":"'Version Control'!$B$2","v":"Title Block"},null,null,"Back to Instructions tab"]
[null,{"$f":"'Version Control'!$B$3","v":"Test Report Template Name:"},{"$f":"'Version Control'!$C$3","v":"Walk-In Doors"}]
[null,{"$f":"'Version Control'!$B$4","v":"Version Number:"},{"$f":"'Version Control'!$C$4","v":"v1.2"}]
[null,{"$f":"'Version Control'!$B$5","v":"Latest Template Revision: "},{"$f":"'Version Control'!$C$5","v":"2020-04-13"}]
[null,{"$f":"'Version Control'!$B$6","v":"Tab Name:"},{"$f":"MID(CELL(\"filename\",A1), FIND(\"]\", CELL(\"filename\", A1))+ 1, 255)","v":"Test Sample Description"}]
[null,{"$f":"'Version Control'!$B$7","v":"File Name:"},{"$f":"'Version Control'!$C$7","v":"Walk-In Doors - v1.2.xlsm"}]
[null,{"$f":"'Version Control'!$B$8","v":"Test Completion Date: "},{"$f":"'General Info & Test Results'!D17","v":"[MM/DD/YYYY]"}]
[]
[null,"Summary",null,null,null,null,"Details (Include relevant material information, dimensions and descriptions of distinct sections)"]
[null,"Equipment Class",{"$f":"IF(ISBLANK('General Info & Test Results'!C28),\"\",'General Info & Test Results'!C28)","v":""},{"$f":"IF(ISBLANK('General Info & Test Results'!C29),\"\",'General Info & Test Results'!C29)","v":""}]
[null,null,"Height (in)","Width (in)"]
[null,"Overall Size",{"$f":"IF(ISBLANK('General Info & Test Results'!C37),\"\",'General Info & Test Results'!C37)","v":""},{"$f":"IF(ISBLANK('General Info & Test Results'!C38),\"\",'General Info & Test Results'!C38)","v":""}]
[]
[null,"Glazing","Thickness (in)","Description"]
[null,"Glazing ID","-"]
[null,"Layer 1"]
[null,"Gap 1"]
[null,"Layer 2"]
[null,"Gap 2"]
{"$rows_left_out":40}
{"sheet":"Sample U-factor Test","index":6,"n_rows":74,"n_cols":8,"rows_kept":74,"cut":false,"hidden":false,"merged":[[25,2,25,3],[18,1,18,2],[32,2,32,3],[33,2,33,3],[23,2,23,5],[19,1,19,2],[10,1,10,3],[11,1,11,3],[12,1,12,2],[13,1,13,2],[17,1,17,2],[14,1,14,2],[15,1,15,2],[16,1,16,2],[1,1,1,3],[4,1,4,2],[5,1,5,2],[7,1,7,2],[2,1,2,2],[3,1,3,2],[6,1,6,2],[74,1,80,7],[46,2,46,3],[21,1,21,7],[27,2,27,5],[73,1,73,7],[54,1,54,7],[29,2,29,3],[30,2,30,3],[31,2,31,3],[34,2,34,3],[35,2,35,3],[47,2,47,3],[43,2,43,3],[40,2,40,5],[42,2,42,3],[70,2,70,3],[36,2,36,3],[37,2,37,3],[38,2,38,3],[58,2,58,3],[59,2,59,3],[51,2,51,3],[45,2,45,3],[60,2,60,3],[61,2,61,3],[62,2,62,3],[63,2,63,3],[64,2,64,3],[65,2,65,3],[66,2,66,3],[67,2,67,3],[68,2,68,3],[69,2,69,3]]}
[]
[null,{"$f":"'Version Control'!$B$2","v":"Title Block"}]
[null,{"$f":"'Version Control'!$B$3","v":"Test Report Template Name:"},null,{"$f":"'Version Control'!$C$3","v":"Walk-In Doors"}]
[null,{"$f":"'Version Control'!$B$4","v":"Version Number:"},null,{"$f":"'Version Control'!$C$4","v":"v1.2"},null,"Back to Instructions tab"]
[null,{"$f":"'Version Control'!$B$5","v":"Latest Template Revision: "},null,{"$f":"'Version Control'!$C$5","v":"2020-04-13"}]
[null,{"$f":"'Version Control'!$B$6","v":"Tab Name:"},null,{"$f":"MID(CELL(\"filename\",A1), FIND(\"]\", CELL(\"filename\", A1))+ 1, 255)","v":"Sample U-factor Test"}]
[null,{"$f":"'Version Control'!$B$7","v":"File Name:"},null,{"$f":"'Version Control'!$C$7","v":"Walk-In Doors - v1.2.xlsm"}]
[null,{"$f":"'Version Control'!$B$8","v":"Test Completion Date: "},null,{"$f":"'General Info & Test Results'!D17","v":"[MM/DD/YYYY]"}]
[]
[]
[null,"Surround Panel Details"]
[null,"Include an image showing measurements & locations of thermocouples in \"Photos\" tab."]
[null,"Material Description"]
[null,"Number of Thermocouples"]
[null,"Conductance Test Date",null,"[MM/DD/YYYY]"]
[null,"Conductance Test Location"]
[null,"Conductance Test Method"]
[null,"Thermal Conductance (Btu/h-ft2-°F)"]
[null,"Thickness (in)"]
[null,"Area of surround panel (ft2)"]
{"$rows_left_out":55}
{"sheet":"Energy Consumption","index":7,"n_rows":60,"n_cols":7,"rows_kept":60,"cut":false,"hidden":false,"merged":[[52,1,52,3],[56,1,56,3],[17,1,17,3],[10,1,10,3],[42,1,42,3],[36,1,36,3],[24,1,24,3],[19,1,19,3],[30,1,30,3],[7,2,7,4],[1,1,1,4],[2,2,2,4],[3,2,3,4],[4,2,4,4],[5,2,5,4],[6,2,6,4]]}
[]
[null,{"$f":"'Version Control'!$B$2","v":"Title Block"}]
[null,{"$f":"'Version Control'!$B$3","v":"Test Report Template Name:"},{"$f":"'Version Control'!$C$3","v":"Walk-In Doors"}]
[null,{"$f":"'Version Control'!$B$4","v":"Version Number:"},{"$f":"'Version Control'!$C$4","v":"v1.2"},null,null,null,"Back to Instructions tab"]
[null,{"$f":"'Version Control'!$B$5","v":"Latest Template Revision: "},{"$f":"'Version Control'!$C$5","v":"2020-04-13"}]
[null,{"$f":"'Version Control'!$B$6","v":"Tab Name:"},{"$f":"MID(CELL(\"filename\",A1), FIND(\"]\", CELL(\"filename\", A1))+ 1, 255)","v":"Energy Consumption"}]
[null,{"$f":"'Version Control'!$B$7","v":"File Name:"},{"$f":"'Version Control'!$C$7","v":"Walk-In Doors - v1.2.xlsm"}]
[null,{"$f":"'Version Control'!$B$8","v":"Test Completion Date: "},{"$f":"'General Info & Test Results'!D17","v":"[MM/DD/YYYY]"}]
[]
[]
[null,"Conduction Through Display Door"]
[null,null,"Quantity","Units"]
[null,"Thermal Transmittance (U)",{"$f":"IF('Sample U-factor Test'!E71=\"\",\"Incomplete\",'Sample U-factor Test'!E71)","v":"Incomplete"},"Btu/(h-ft2-°F)"]
[null,"Surface Area (A)",{"$f":"IF('Sample U-factor Test'!E26=\"\",\"Incomplete\",IF(AND('Sample U-factor Test'!E26<=1.03*'General Info & Test Results'!C35,'Sample U-factor Test'!E26>=0.97*'General Info & Test Results'!C35),'General Info & Test Results'!C35,'Sample U-factor Test'!E26))","v":"Incomplete"},"ft²"]
[null,"Temperature Differential (ΔT)",{"$f":"IF('General Info & Test Results'!C29=\"Medium Temperature\",(75-35),IF('General Info & Test Results'!C29=\"Low Temperature\",(75+10),\"Incomplete\"))","v":"Incomplete"},"°F"]
[null,"Conduction Load (Qcond)",{"$f":"IF(C13=\"Incomplete\",\"Incomplete\",C13*C14*C15)","v":"Incomplete"},"Btu/h"]
[]
[null,"Direct Energy Consumption of Electrical Components"]
[null,null,"Quantity","Units"]
[null,"Lighting"]
{"$rows_left_out":41}
{"sheet":"Comments","index":8,"n_rows":11,"n_cols":5,"rows_kept":11,"cut":false,"hidden":false,"merged":[[47,1,50,5],[1,1,1,2],[12,1,15,5],[10,1,10,5],[17,1,20,5],[22,1,25,5],[27,1,30,5],[32,1,35,5],[37,1,40,5],[42,1,45,5]]}
[]
[null,{"$f":"'Version Control'!$B$2","v":"Title Block"}]
[null,{"$f":"'Version Control'!$B$3","v":"Test Report Template Name:"},{"$f":"'Version Control'!$C$3","v":"Walk-In Doors"}]
[null,{"$f":"'Version Control'!$B$4","v":"Version Number:"},{"$f":"'Version Control'!$C$4","v":"v1.2"},null,"Back to Instructions tab"]
[null,{"$f":"'Version Control'!$B$5","v":"Latest Template Revision: "},{"$f":"'Version Control'!$C$5","v":"2020-04-13"}]
[null,{"$f":"'Version Control'!$B$6","v":"Tab Name:"},{"$f":"MID(CELL(\"filename\",A1), FIND(\"]\", CELL(\"filename\", A1))+ 1, 255)","v":"Comments"}]
[null,{"$f":"'Version Control'!$B$7","v":"File Name:"},{"$f":"'Version Control'!$C$7","v":"Walk-In Doors - v1.2.xlsm"}]
[null,{"$f":"'Version Control'!$B$8","v":"Test Completion Date: "},{"$f":"'General Info & Test Results'!D17","v":"[MM/DD/YYYY]"}]
[]
[]
[null,"Comments"]

{"sheet":"Report Sign-Off Block","index":9,"n_rows":18,"n_cols":5,"rows_kept":18,"cut":false,"hidden":false,"merged":[[17,1,17,2],[16,1,16,2],[15,1,15,2],[1,1,1,2],[11,1,12,4],[10,1,10,4],[13,1,13,2],[14,1,14,2]]}
[]
[null,{"$f":"'Version Control'!$B$2","v":"Title Block"}]
[null,{"$f":"'Version Control'!$B$3","v":"Test Report Template Name:"},{"$f":"'Version Control'!$C$3","v":"Walk-In Doors"}]
[null,{"$f":"'Version Control'!$B$4","v":"Version Number:"},{"$f":"'Version Control'!$C$4","v":"v1.2"},null,"Back to Instructions tab"]
[null,{"$f":"'Version Control'!$B$5","v":"Latest Template Revision: "},{"$f":"'Version Control'!$C$5","v":"2020-04-13"}]
[null,{"$f":"'Version Control'!$B$6","v":"Tab Name:"},{"$f":"MID(CELL(\"filename\",A1), FIND(\"]\", CELL(\"filename\", A1))+ 1, 255)","v":"Report Sign-Off Block"}]
[null,{"$f":"'Version Control'!$B$7","v":"File Name:"},{"$f":"'Version Control'!$C$7","v":"Walk-In Doors - v1.2.xlsm"}]
[null,{"$f":"'Version Control'!$B$8","v":"Test Completion Date: "},{"$f":"'General Info & Test Results'!D17","v":"[MM/DD/YYYY]"}]
[]
[]
[null,"Test Report Sign-Off Block "]
[null,"By signing in the space below, we certify that the information and data in this report: (1) were obtained from the specific test unit under test; (2) were obtained during the specific test being reported; (3) were not copied from any other source, except where instructed to do so; and (4) were not altered or modified in any way. "]
[]
[null,"Role",null,"Date","Entity"]
[null,"Test Completion",null,{"$f":"'General Info & Test Results'!D17","v":"[MM/DD/YYYY]"},"[Test Lab Name]"]
[null,"Template Completion",null,"[MM/DD/YYYY]","[Test Lab Name]"]
[null,"Report Reviewed by Test Lab",null,"[MM/DD/YYYY]","[Test Lab Name]"]
[null,"Report Reviewed by Test Lab",null,"[MM/DD/YYYY]","[Test Lab Name]"]

{"sheet":"Drop-Downs","index":10,"n_rows":19,"n_cols":7,"rows_kept":19,"cut":false,"hidden":false,"merged":[[1,1,1,2]]}
[]
[null,{"$f":"'Version Control'!$B$2","v":"Title Block"}]
[null,{"$f":"'Version Control'!$B$3","v":"Test Report Template Name:"},{"$f":"'Version Control'!$C$3","v":"Walk-In Doors"}]
[null,{"$f":"'Version Control'!$B$4","v":"Version Number:"},{"$f":"'Version Control'!$C$4","v":"v1.2"}]
[null,{"$f":"'Version Control'!$B$5","v":"Latest Template Revision: "},{"$f":"'Version Control'!$C$5","v":"2020-04-13"}]
[null,{"$f":"'Version Control'!$B$6","v":"Tab Name:"},{"$f":"MID(CELL(\"filename\",A1), FIND(\"]\", CELL(\"filename\", A1))+ 1, 255)","v":"Drop-Downs"}]
[null,{"$f":"'Version Control'!$B$7","v":"File Name:"},{"$f":"'Version Control'!$C$7","v":"Walk-In Doors - v1.2.xlsm"}]
[null,{"$f":"'Version Control'!$B$8","v":"Test Completion Date: "},{"$f":"'General Info & Test Results'!D17","v":"[MM/DD/YYYY]"}]
[]
[]
[null,"Y_N","Temp_Sensors","Equipment_Type","Equipment_Temperature","Condition_Received","Number"]
[null,"Yes","Interior","Display Door","Low Temperature","Good",1]
[null,"No","Exterior","Passage Door","Medium Temperature","Fair",{"$f":"G12+1","v":2}]
[null,null,null,"Freight Door",null,"Poor",{"$f":"G13+1","v":3}]
[null,null,null,null,null,null,4]
[null,null,null,null,null,null,5]
[null,"Wind_Direction","Conductance_Test","Configuration","Lighting",null,6]
[null,"Parallel","ASTM C518","Swinging door","LED"]
[null,"Perpendicular","ASTM C177","Sliding door","Fluorescent"]

{"sheet":"Version Control","index":11,"n_rows":15,"n_cols":3,"rows_kept":15,"cut":false,"hidden":false,"merged":[[1,1,1,2],[10,1,10,2]]}
[]
[null,"Title Block"]
[null,"Test Report Template Name:","Walk-In Doors"]
[null,"Version Number:",{"$f":"INDEX(B13:B61,COUNTA(B13:B61),1)","v":"v1.2"}]
[null,"Latest Template Revision: ",{"$f":"IF(MAX(B13:C103)=0,\"No Revisions Dates Entered\",MAX(C13:C103))","v":"2020-04-13"}]
[null,"Tab Name:",{"$f":"MID(CELL(\"filename\",A1), FIND(\"]\", CELL(\"filename\", A1))+ 1, 255)","v":"Version Control"}]
[null,"File Name:",{"$f":"MID(CELL(\"FILENAME\",A1),FIND(\"[\",CELL(\"FILENAME\",A1))+1,FIND(\"]\",CELL(\"FILENAME\",A1))-FIND(\"[\",CELL(\"FILENAME\",A1))-1)","v":"Walk-In Doors - v1.2.xlsm"}]
[null,"Test Completion Date: ",{"$f":"'General Info & Test Results'!D17","v":"[MM/DD/YYYY]"}]
[]
[]
[null,"Revisions List"]
[null,"Version","Date"]
[null,"v1.0","2020-04-01"]
[null,"v1.1","2020-04-06"]
[null,"v1.2","2020-04-13"]