{"text_format":"1","workbook":"xlsx","n_sheets":47,"sheets":["Control page","Plant general info","Process Heating Equipment","PHASTEx summary report","Sankey Diagram","Energy Usage Distribution","Energy Usage Distribution pg2","Notes On Current v Modified","Load Charge Solid-1","Load Charge Liquid-1","Load Charge Gas-1","Fixture losses ","Wall losses","Water-Air cooling","Atmosphere losses","Cp calculationsHTcurrent","Cp calculationsHTmod","Radiation losses from opening","8- Power- Motor driven  systems","9- Other heat loss","Flue gases","Av.Ht.Solid - current ","Av.Ht.Solid - modified","Data Input & RESULTS ","Data-Results vol current ","Calculations - vol current","Cp calculations  (2)","Data-Results vol mod ","Calculations vol mod","Cp calculations  (3)","radiation_vf","unit conversion","Help Chg Solid","Help Chg Liquid","Help Chg Gas","Help Fixtures","Help Atmos Loss","Help Water Cooling","Help Wall Losses","Help Opening Losses","Help Other Losses","Help Flue Gas ","Help Power","Cp calculations ","gas atm specific heat (3)","MaterialHeatData","What is PHAST"],"not_rendered":{"charts":8,"images":183,"macros":1,"external_links":0,"defined_names":25,"comments":6,"pivot_tables":0},"unopened":[],"bounds":{"document_bytes":16777216,"sheet_cells":100000,"rows_first":2000,"rows_last":500,"rows_between":2000,"halvings":0,"cell_chars":16384,"cell_head_chars":4096},"cells_cut":0,"cells_raw":0,"read":"whole","date_system":"1900"}

{"sheet":"Control page","index":0,"n_rows":24,"n_cols":12,"rows_kept":24,"cut":false,"hidden":false,"merged":[[23,1,23,5],[22,1,22,3],[21,1,21,3],[1,1,1,5],[5,1,5,5],[4,1,4,5],[6,1,6,5],[2,1,3,5]]}
[null,null,null,null,null,null,null,null,null,"Unlock",{"$f":"IF(J1=\"Lock\",1,0)","v":0}]
[null,"PHASTEx - U.S. Units Version ",null,null,null,null,null,null,null,null,0,"PHASTEx_- US Units For Excel v1.01.xls"]
[null,"         Developed by E3M Inc. under contract with Oak Ridge National Laboratory"]
[]
[null,{"$f":"$H$5","v":"What is PHASTEx?"},null,null,null,null,null,"What is PHASTEx?"]
[null,"Control Page",null,null,null,null,null,"Enter Data"]
[null,{"$f":"L2","v":"PHASTEx_- US Units For Excel v1.01.xls"},null,null,null,null,null,"Go To Report"]
[null,"No.","Items","Number of Components",null,null,null,"Print Sheet"]
[null,1,"Plant General Information "]
[null,2,"Furnace Data"]
[null,3.1,"Charge material- Solids (wet or dry) Enter \"0\" if none",3]
[null,3.2,"Charge material- Liquids Enter \"0\" if none ",3]
[null,3.3,"Charge material- Gases/vapors Enter \"0\" if none",3]
[null,4,"Fixtures, trays, conveyor etc. Enter \"0\" if none",6]
[null,5,"Wall surface heat losses",10]
[null,6,"Water or air cooling (internal) Enter \"0\" if none",6]
[null,7,"Atmosphere or makeup air  Enter \"0\" if none",3]
[null,8,"Flue Gases"]
[null,9,"Radiation losses from openings- Enter \"0\" if none",6]
[null,10,"Power use by Electric Motors & Other Devices",10,null,null,null," "]
[null,11,"Other heat loss or generation",2]
[null,"View PHASTEx Summary Report","View PHAST Energy Usage Distribution",0]
[null,"View PHASTEx Energy Usage Distribution",{"$error":"#REF!"},0]
[null,"**PHASTEx tool and its predecessor tool (PHAST) were conceived by Dr. Arvind Thekdi and developed by E3M Inc. in collaboration with Oak Ridge National Laboratory (ORNL).  Dr. Sachin Nimbalkar and Mr. Kiran Thirumaran of Oak Ridge National Laboratory (ORNL) and Dr. Jing Ke of Lawrence Berkeley National Laboratory (Berkeley Lab) contributed to the development work.  The project was supported by Advanced Manufacturing, Energy Efficiency and Renewable Energy Office of The U.S. Department of Energy.  The tool was tested by a team of experts from the ORNL and representatives from the US industrial companies.   "]

{"sheet":"Plant general info","index":1,"n_rows":36,"n_cols":8,"rows_kept":36,"cut":false,"hidden":false,"merged":[[1,0,1,5],[4,0,4,1],[35,0,35,5],[19,1,19,2],[20,0,20,6],[29,0,30,0],[31,0,31,1],[29,1,30,6],[17,1,17,2],[4,2,4,3],[4,4,4,5],[17,4,17,5],[16,1,16,5],[14,1,14,5],[18,1,18,5],[2,0,2,5],[15,1,15,5],[7,0,7,5],[13,1,13,5],[10,0,12,0],[10,2,10,5],[11,2,11,5],[12,4,12,5],[8,1,8,5],[9,1,9,3]]}
[]
["PHASTEx - U.S. Units Version "]
["               Developed by E3M Inc. under contract with Oak Ridge National Laboratory"]
[]
["Plant Energy Survey - Audit",null,"Survey / Initiation  Date:",null,null,null,null,"Print Sheet"]
[]
[null,null,null,null,null,null,null,"Done Entering Data"]
["Plant - General Information"]
["Company name"]
["Plant name",null,null,null,"Industry Code"]
["Plant address","Street"]
[null,"City / State"]
[null,"Zip or Postal Code",null,"Country     "]
["Plant description"]
["Final product(s)"]
["Contact name"]
["Address (Street, City, Postal code)"]
["Phone number",null,null,"Fax number"]
["Email"]
["Currency in which costs are given",null,null,"Exchange Rate","(Equivalent to US$1)"]
["Fuel (Energy Source) Information"]
[null,"Fuel/Energy 1","Fuel/Energy 2","Fuel/Energy 3","Fuel/Energy 4","Fuel/Energy 5","Fuel/Energy 6"]
["Name of Fuel/Energy Source used in the plant"]
["Type (Fuel or Electricity)"]
["Unit for Heating Value"]
["Heating value in the units stated above"]
["Unit for mass or quantity of fuel given below"]
["Cost Unit Used"]
["Cost of fuel/energy in the units above"]
["Other information if necessary"]
[]
[]
[]
[]
[]
[" "]

{"sheet":"Process Heating Equipment","index":2,"n_rows":37,"n_cols":12,"rows_kept":37,"cut":false,"hidden":false,"merged":[[36,1,36,6],[5,2,5,7],[11,4,11,7],[6,2,6,7],[29,1,29,7],[8,2,8,7],[9,2,9,7],[21,1,21,7],[10,1,10,7],[22,5,28,7],[26,4,28,4],[3,1,4,7],[2,1,2,2],[30,1,32,1],[30,2,32,7],[2,5,2,7]]}
[]
[]
[null,null,null,null,null,null,null,null,null,null,null,"Print Sheet"]
[null,"Process Heating Equipment Information"]
[null,null,null,null,null,null,null,null,null,null,null,"Done Entering Data"]
[null,"Name or designation of equipment"]
[null,"Model number or equipment ID"]
[null,"Production rate - average value (lb per hour)",null,"lb/hr"]
[null,"Final product "]
[null,"Type of operation (Continuous, batch or other) "]
[null,"Energy System Details "]
[null,"Operating hours per year","hrs./year"]
[null,"Number of zones",null,1]
[null,"Zone number"]
[null,"Zone Name "]
[null,"Burner  rated capacity - Total for all burners","Btu/hr"]
[null,"Percentage of rated capacity used","%"]
[null,"Duty cycle (as % of operating hours) ","%"]
[null,"Estimated fuel energy use per year","MMBtu/year",{"$f":"$D$12*D16*(D17/100)*(D18/100)/10^6","v":0},{"$f":"$D$12*E16*(E17/100)*(E18/100)/10^6","v":0},{"$f":"$D$12*F16*(F17/100)*(F18/100)/10^6","v":0},{"$f":"$D$12*G16*(G17/100)*(G18/100)/10^6","v":0},{"$f":"$D$12*H16*(H17/100)*(H18/100)/10^6","v":0}]
[null,"Total energy used ","MMBtu/year ",{"$f":"D19+(E19*E20)+(F19*F20)+(G19*G20)+(H19*H20)","v":0},{"$f":"IF($D$13<2,0,1)","v":0},{"$f":"IF($D$13<3,0,1)","v":0},{"$f":"IF($D$13<4,0,1)","v":0},{"$f":"IF($D$13<5,0,1)","v":0}]
[]
[null,"Total Energy Input - Measured values for the Equipment "]
[null,"Fuel used for the equipment - name  "]
[null,"Fuel use for the equipment-  measurement period","hrs."]
[null,"Fuel energy used for measurement period","Btu"]
[null,"Energy used per hour (average value) ","Btu/hr. ",{"$f":"IF(D24>0, D25/D24,  0)","v":0},{"$f":"IF(E24>0, E25/E24,  0)","v":0}]
[null,"Electricity use for the equipment-  measurement period","hrs."]
[null,"Electricity used for measurement period ","kWh"]
[null,"Electricity used per hour (average value) ","kW",{"$f":"IFERROR(D28/D27,\"\")","v":""}]
[]
[null,"Other information as necessary for the equipment: preheaters, coal feeder etc."]
[]
[]
[]
[]
[]
[null," "]

{"sheet":"PHASTEx summary report","index":3,"n_rows":59,"n_cols":12,"rows_kept":59,"cut":false,"hidden":false,"merged":[[7,11,9,11],[10,1,10,8],[42,5,46,5],[6,6,8,8],[45,2,46,2],[42,2,43,2],[6,3,6,5],[32,2,33,2],[30,2,31,2],[11,2,12,2],[11,3,11,5],[11,6,11,8],[6,1,6,2],[8,1,8,2],[8,3,8,5],[11,1,12,1],[0,1,0,8],[1,1,1,8],[3,1,3,8],[4,1,4,8],[5,7,5,8],[5,1,5,2],[5,3,5,5],[36,2,37,2],[36,5,40,5],[39,2,40,2],[7,1,7,2],[7,3,7,5]]}
[null,"PHASTEx - U.S. Units Version "]
[null,"Developed by E3M Inc. under contract with Oak Ridge National Laboratory"]
[]
[null,"PHASTEx (Process Heating Assessment and Survey Tool - Excel)"]
[null,"Summary Report of Energy Usage"]
[null,"Company name",null,{"$f":"IF('Plant general info'!B9=\"\",\"\",'Plant general info'!B9)","v":""},null,null,"Date",{"$f":"IF('Plant general info'!E5=0,\"\",'Plant general info'!E5)","v":""},null,null,"Previous Page"]
[null,"Plant name",null,{"$f":"IF('Plant general info'!B10=\"\",\"\",'Plant general info'!B10)","v":""},null,null,"Note: ",null,null,null,"Next Page"]
[null,"Process Heating Equipment Name ",null,{"$f":"IF('Process Heating Equipment'!C6=\"\",\"\",'Process Heating Equipment'!C6)","v":""},null,null,null,null,null,null,"Return to Control Page","Energy Equivalent Unit for Summary Report"]
[null,"Name of the energy assessment leader",null,null,null,null,null,null,null,null,"Print Sheet"]
[]
[null,null,null,null,null,null,null,null,null,null,null,"kcal"]
[null,"No","Energy use or loss category","Energy use - loss (Current)",null,null,"Energy use - loss (Modified)"]
[null,null,null,"Btu/hour",{"$f":"IF($L$11=\"kgce\", \"kgce/hour\", IF($L$11=\"kcal\",\"kCal/hour\", IF($L$11=\"kgoe\",\"kgoe/hour\",IF($L$11=\"MMBtu\",\"MMBtu/hour\",\"Btu/hour\"))))","v":"kCal/hour"},"%",{"$f":"D13","v":"Btu/hour"},{"$f":"E13","v":"kCal/hour"},"%"]
[null,1,"Charge material",{"$f":"'Load Charge Solid-1'!E156 + 'Load Charge Liquid-1'!E120+'Load Charge Gas-1'!E105","v":0},{"$f":"D14 / IF($L$11=\"kcal\", $H$28, IF($L$11=\"kgce\",$I$28,IF($L$11=\"kgoe\",$H$27,IF($L$11=\"MMBtu\", $G$27))))","v":0},{"$f":"IFERROR(D14/$D$25,\"-\")","v":"-"},{"$f":"'Load Charge Solid-1'!F156+'Load Charge Liquid-1'!F120+'Load Charge Gas-1'!F105","v":0},{"$f":"G14 / IF($L$11=\"kcal\", $H$28, IF($L$11=\"kgce\",$I$28,IF($L$11=\"kgoe\",$H$27,IF($L$11=\"MMBtu\", $G$27))))","v":0},{"$f":"IFERROR(G14/$G$25,\"-\")","v":"-"}]
[null,{"$f":"1+B14","v":2},"Fixtures, trays, conveyor etc.",{"$f":"'Fixture losses '!D65","v":0},{"$f":"D15 / IF($L$11=\"kcal\", $H$28, IF($L$11=\"kgce\",$I$28,IF($L$11=\"kgoe\",$H$27,IF($L$11=\"MMBtu\", $G$27))))","v":0},{"$f":"IFERROR(D15/$D$25,\"-\")","v":"-"},{"$f":"'Fixture losses '!E65","v":0},{"$f":"G15 / IF($L$11=\"kcal\", $H$28, IF($L$11=\"kgce\",$I$28,IF($L$11=\"kgoe\",$H$27,IF($L$11=\"MMBtu\", $G$27))))","v":0},{"$f":"IFERROR(G15/$G$25,\"-\")","v":"-"}]
[null,{"$f":"1+B15","v":3},"Wall surface heat losses",{"$f":"'Wall losses'!D129","v":0},0,"-",{"$f":"'Wall losses'!E129","v":0},0,"-"]
[null,4,"Water or air cooling (internal) ",{"$f":"'Water-Air cooling'!D233","v":0},0,"-",{"$f":"'Water-Air cooling'!E233","v":0},0,"-"]
[null,5,"Atmosphere or makeup air  ",{"$f":"'Atmosphere losses'!D50","v":0},0,"-",{"$f":"'Atmosphere losses'!E50","v":0},0,"-"]
[null,6,"Radiation losses from openings",{"$f":"'Radiation losses from opening'!D160","v":0},0,"-",{"$f":"'Radiation losses from opening'!E160","v":0},0,"-"]
[null,7,"Other heat loss or heat addition ",{"$f":"'9- Other heat loss'!E59","v":0},0,"-",{"$f":"'9- Other heat loss'!F59","v":0},0,"-"]
[null,8,"Total net heat required",{"$f":"SUM(D14:D20)","v":0},0,null,{"$f":"SUM(G14:G20)","v":0},{"$f":"G21 / IF($L$11=\"kcal\", $H$28, IF($L$11=\"kgce\",$I$28,IF($L$11=\"kgoe\",$H$27,IF($L$11=\"MMBtu\", $G$27))))","v":0}]
[null,9,"Available heat (%)",{"$f":"'Flue gases'!D14/100","v":0.90133904135354603},{"$f":"D22","v":0.90133904135354603},null,{"$f":"'Flue gases'!E14/100","v":0.93921085999999998},{"$f":"G22","v":0.93921085999999998}]
[null,10,"Flue gas loss",{"$f":"D21/(D22)-D21","v":0},{"$f":"E21/(E22)-E21","v":0},"-",{"$f":"G21/(G22)-G21","v":0},{"$f":"G23 / IF($L$11=\"kcal\", $H$28, IF($L$11=\"kgce\",$I$28,IF($L$11=\"kgoe\",$H$27,IF($L$11=\"MMBtu\", $G$27))))","v":0},"-"]
[null,null,"Exothermic heat from process ",{"$f":"-1*('Load Charge Solid-1'!K156+'Load Charge Liquid-1'!K120+'Load Charge Gas-1'!K105)","v":0},{"$f":"D24 / IF($L$11=\"kcal\", $H$28, IF($L$11=\"kgce\",$I$28,IF($L$11=\"kgoe\",$H$27,IF($L$11=\"MMBtu\", $G$27))))","v":0},"-",{"$f":"-1*('Load Charge Solid-1'!L156+'Load Charge Liquid-1'!L120+'Load Charge Gas-1'!L105)","v":0},{"$f":"G24 / IF($L$11=\"kcal\", $H$28, IF($L$11=\"kgce\",$I$28,IF($L$11=\"kgoe\",$H$27,IF($L$11=\"MMBtu\", $G$27))))","v":0},"-"]
[null,null,"Total gross heat input required ",{"$f":"D21+D23+D24","v":0},{"$f":"D25 / IF($L$11=\"kcal\", $H$28, IF($L$11=\"kgce\",$I$28,IF($L$11=\"kgoe\",$H$27,IF($L$11=\"MMBtu\", $G$27))))","v":0},{"$f":"SUM(F14:F24)","v":0},{"$f":"G21+G23+G24","v":0},{"$f":"G25 / IF($L$11=\"kcal\", $H$28, IF($L$11=\"kgce\",$I$28,IF($L$11=\"kgoe\",$H$27,IF($L$11=\"MMBtu\", $G$27))))","v":0},{"$f":"SUM(I14:I24)","v":0}]
[]
[null,null,null,null,null,null,{"$f":"10^6","v":1000000},39683,3.9652599999999998,2.2050000000000001]
[null,null,null,null,{"$f":"'Load Charge Solid-1'!I156+'Load Charge Liquid-1'!I120+'Load Charge Gas-1'!I105","v":0},{"$f":"'Load Charge Solid-1'!J156+'Load Charge Liquid-1'!J120+'Load Charge Gas-1'!J105","v":0},null,3.9683000000000002,27766]
[null,null,"Summary :","Units","Current    Values","Modified   Values"]
[null,null,"Calculated values "]
[null,null,"Energy Intensity for Charge Materials","Btu/lb",{"$f":"IF(E28 > 0, D25/E28, \"-\")","v":"-"},{"$f":"IF(F28 > 0, G25/F28, \"-\")","v":"-"}]
[null,null,null,{"$f":"IF($L$11=\"kgce\",\"kgce/kg\",IF($L$11=\"kgoe\",\"kgoe/kg\",IF($L$11=\"kcal\",\"kcal/lb\",IF($L$11=\"MMBtu\",\"MMBtu/lb\",\"Btu/lb\"))))","v":"kcal/lb"},{"$f":"IFERROR(IF($D$32=\"kgce/kg\", E31/$I$28*$J$27,IF($D$32=\"kgoe/kg\", E31/$H$27*$J$27,  IF($D$32=\"kcal/lb\",E31/$I$27,IF($D$32=\"MMBtu/lb\",E31/$G$27,\"-\")))),\"-\")","v":"-"},{"$f":"IFERROR(IF($D$32=\"kgce/kg\", F31/$I$28*$J$27,IF($D$32=\"kgoe/kg\", F31/$H$27*$J$27,  IF($D$32=\"kcal/lb\",F31/$I$27,IF($D$32=\"MMBtu/lb\",F31/$G$27,\"-\")))),\"-\")","v":"-"}]
[null,null,"Required Fuel Energy Input","Btu/hour",{"$f":"D25","v":0},{"$f":"G25","v":0}]
[null,null,null,{"$f":"IF($L$11=\"kgce\", \"kgce/hour\", IF($L$11=\"kcal\",\"kcal/hour\", IF($L$11=\"kgoe\",\"kgoe/hour\",IF($L$11=\"MMBtu\",\"MMBtu/hour\",\"Btu/hour\"))))","v":"kcal/hour"},{"$f":"E33/ IF($L$11=\"kcal\", $H$28, IF($L$11=\"kgce\",$I$28,IF($L$11=\"kgoe\",$H$27,IF($L$11=\"MMBtu\", $G$27))))","v":0},{"$f":"F33/ IF($L$11=\"kcal\", $H$28, IF($L$11=\"kgce\",$I$28,IF($L$11=\"kgoe\",$H$27,IF($L$11=\"MMBtu\", $G$27))))","v":0}]
[null,null,"Required Electrical Energy Input","kW",{"$f":"'8- Power- Motor driven  systems'!D83","v":0},{"$f":"'8- Power- Motor driven  systems'!E83","v":0}]
[null,null,"Estimated Values"]
[null,null,"Energy Input from Fuel","Btu/hour",{"$f":"IFERROR('Process Heating Equipment'!D20/'Process Heating Equipment'!D12*10^6,\"-\")","v":"-"}]
[null,null,null,{"$f":"IF($L$11=\"kgce\", \"kgce/hour\", IF($L$11=\"kcal\",\"kcal/hour\", IF($L$11=\"kgoe\",\"kgoe/hour\",IF($L$11=\"MMBtu\",\"MMBtu/hour\",\"Btu/hour\"))))","v":"kcal/hour"},{"$f":"IFERROR(E37/ IF($L$11=\"kcal\", $H$28, IF($L$11=\"kgce\",$I$28,IF($L$11=\"kgoe\",$H$27,IF($L$11=\"MMBtu\", $G$27)))),\"-\")","v":"-"}]
[null,null,"Electricity Used (average value)","kW",{"$f":"E35","v":0}]
[null,null,"Energy Intensity for Charge Materials","Btu/lb",{"$f":"IFERROR(IF(E28 > 0, E37/E28, \"-\"),\"\")","v":"-"}]
[null,null,null,{"$f":"IF($L$11=\"kgce\",\"kgce/kg\",IF($L$11=\"kgoe\",\"kgoe/kg\",IF($L$11=\"kcal\",\"kcal/lb\",IF($L$11=\"MMBtu\",\"MMBtu/lb\",\"Btu/lb\"))))","v":"kcal/lb"},{"$f":"IFERROR(IF($D$41=\"kgce/kg\", E40/$I$28*$J$27,IF($D$41=\"kgoe/kg\", E40/$H$27*$J$27,  IF($D$41=\"kcal/lb\",E40/$I$27,IF($D$41=\"MMBtu/lb\",E40/$G$27,\"-\")))),\"-\")","v":"-"}]
[null,null,"Measured values "]
[null," ","Energy Input from Fuel","Btu/hour",{"$f":"'Process Heating Equipment'!D26+'Process Heating Equipment'!E26","v":0}]
[null,null,null,{"$f":"IF($L$11=\"kgce\", \"kgce/hour\", IF($L$11=\"kcal\",\"kcal/hour\", IF($L$11=\"kgoe\",\"kgoe/hour\",IF($L$11=\"MMBtu\",\"MMBtu/hour\",\"Btu/hour\"))))","v":"kcal/hour"},{"$f":"E43/ IF($L$11=\"kcal\", $H$28, IF($L$11=\"kgce\",$I$28,IF($L$11=\"kgoe\",$H$27,IF($L$11=\"MMBtu\", $G$27))))","v":0}]
[null,null,"Electricity Used (average value) ","kW",{"$f":"'Process Heating Equipment'!D29","v":""}]
[null,null,"Energy Intensity for Charge Materials ","Btu/lb",{"$f":"IF(E28 > 0, E43/E28, \"-\")","v":"-"}]
[null,null,null,{"$f":"IF($L$11=\"kgce\",\"kgce/kg\",IF($L$11=\"kgoe\",\"kgoe/kg\",IF($L$11=\"kcal\",\"kcal/lb\",IF($L$11=\"MMBtu\",\"MMBtu/lb\",\"Btu/lb\"))))","v":"kcal/lb"},{"$f":"IFERROR(IF($D$47=\"kgce/kg\", E46/$I$28*$J$27,IF($D$47=\"kgoe/kg\", E46/$H$27*$J$27,  IF($D$47=\"kcal/lb\",E46/$I$27,IF($D$47=\"MMBtu/lb\",E46/$G$27,\"-\")))),\"-\")","v":"-"}]
[]
[]
[]
[]
[null,"E3M Inc.",null,null,null,null,null,null,"Office Phone: (240) 715-4333 "]
[null,"15216 Gravenstein Way",null,null,null,null,null,null,"Mobile: (240) 605-7545"]
[null,"North Potomac, MD 20878",null,null,null,null,null,null,"E-mail: athekdi@e3minc.com "]
[null,"15216 Gravenstein Way"]
[null,"North Potomac, MD 20878"]
[null,"Office Phone: (240) 715-4333 "]
[null,"Mobile: (240) 605-7545"]
[null,"E-mail: athekdi@e3minc.com "]

{"sheet":"Sankey Diagram","index":4,"n_rows":51,"n_cols":26,"rows_kept":51,"cut":false,"hidden":false,"merged":[[4,17,7,17],[41,2,41,11],[0,1,0,16],[39,2,39,11],[40,2,40,12],[4,2,5,15],[1,1,1,16]]}
[null,"PHASTEx - U.S. Units Version "]
[null,"Developed by E3M Inc. under contract with Oak Ridge National Laboratory"]
[]
[]
[null,null,"Furnace Heat Balance (Sankey Diagram)",null,null,null,null,null,null,null,null,null,null,null,null,null,null,"Select energy unit for report"]
[]
[null,null,null,null,null,null,null,null,null,null,null,null,null,null,null,null,null,null,null,null,{"$f":"'Process Heating Equipment'!C6","v":0}]
[null,null,null,null,null,null,null,null,null,null,null,null,null,null,null,null,null,null,null,null,null,null,null,null,null,"conversion factor"]
[null,null,null,null,null,null,null,null,null,null,null,null,null,null,null,null,null,"kgce",null,null,"Charge material",{"$f":"'PHASTEx summary report'!D14/ $Z$9","v":0},{"$f":"V9/1000000","v":0},null,null,{"$f":" IF($R$9=\"Btu\", 1, IF($R$9=\"kgce\", 'PHASTEx summary report'!$I$28, IF($R$9=\"kcal\",'PHASTEx summary report'!$H$28,IF($R$9=\"kgoe\",'PHASTEx summary report'!$H$27,IF($R$9=\"MMBtu\",'PHASTEx summary report'!G27,'PHASTEx summary report'!I28)))))","v":27766}]
[null,null,null,null,null,null,null,null,null,null,null,null,null,null,null,null,null,null,null,null,"Fixtures, trays, conveyor etc.",{"$f":"'PHASTEx summary report'!D15/ $Z$9","v":0},{"$f":"V10/1000000","v":0},null,null,{"$f":" IF($R$9=\"kgce\", \"All quantities are in units of kgce/Hr.\", IF($R$9=\"kgoe\", \"All quantities are in units of kgoe/Hr.\", IF($R$9=\"kcal\", \"All quantities are in units of kcal/Hr.\",IF(R9=\"Btu\",\"All quantities are in units of Btu/Hr.\",IF(R9=\"MMBtu\",\"All quantities are in units of MMBtu/Hr.\",\"All quantities are in units of Btu/Hr.\")))))","v":"All quantities are in units of kgce/Hr."}]
[null,null,null,null,null,null,null,null,null,null,null,null,null,null,null,null,null,null,null,null,"Wall surface heat losses",{"$f":"'PHASTEx summary report'!D16/ $Z$9","v":0},0]
[null,null,null,null,null,null,null,null,null,null,null,null,null,null,null,null,null,null,null,null,"Water or air cooling (internal) ",{"$f":"'PHASTEx summary report'!D17/ $Z$9","v":0},0]
[null,null,null,null,null,null,null,null,null,null,null,null,null,null,null,null,null,null,null,null,"Atmosphere or makeup air  ",{"$f":"'PHASTEx summary report'!D18/ $Z$9","v":0},0]
[null,null,null,null,null,null,null,null,null,null,null,null,null,null,null,null,null,null,null,null,"Radiation losses from openings",{"$f":"'PHASTEx summary report'!D19/ $Z$9","v":0},0]
[null,null,null,null,null,null,null,null,null,null,null,null,null,null,null,null,null,null,null,null,"Other heat loss or heat addition ",{"$f":"'PHASTEx summary report'!D20/ $Z$9","v":0},0]
[null,null,null,null,null,null,null,null,null,null,null,null,null,null,null,null,null,null,null,null,"Total net heat required",{"$f":"'PHASTEx summary report'!D21/ $Z$9","v":0},0]
[null,null,null,null,null,null,null,null,null,null,null,null,null,null,null,null,null,null,null,null,"Available heat",{"$f":"'PHASTEx summary report'!D22/ $Z$9","v":3.2461969363737879E-5},3.2461969363737878E-11]
[null,null,null,null,null,null,null,null,null,null,null,null,null,null,null,null,null,null,null,null,"Flue gas loss",{"$f":"'PHASTEx summary report'!D23/ $Z$9","v":0},0]
[null,null,null,null,null,null,null,null,null,null,null,null,null,null,null,null,null,null,null,null,"Exothermic heat from process ",{"$f":"'PHASTEx summary report'!D24/ $Z$9","v":0},0]
[null,null,null,null,null,null,null,null,null,null,null,null,null,null,null,null,null,null,null,null,"Total gross heat input required ",{"$f":"'PHASTEx summary report'!D25/ $Z$9","v":0},0]
[]
[]
[null,null,null,null,null,null,null,null,null,null,null,null,null,null,null,null,null,null,null,null,"Previous Page"]
[null,null,null,null,null,null,null,null,null,null,null,null,null,null,null,null,null,null,null,null,"Next Page"]
[null,null,null,null,null,null,null,null,null,null,null,null,null,null,null,null,null,null,null,null,"Return to Control Page"]
[null,null,null,null,null,null,null,null,null,null,null,null,null,null,null,null,null,null,null,null,"Print Sheet"]
[]
[]
[]
[]
[]
[]
[]
[]
[]
[]
[]
[]
[]
[null,"Note:","This is a \"static\" Sankey Diagram with no changes in width of the arrows.  ",null,null,null,null,null,null,null,null,null,null,null,null,null,null,null,null,null,"Charge material",{"$f":"'PHASTEx summary report'!G14 / $Z$9","v":0},{"$f":"V40/1000000","v":0}]
[null,null,{"$f":" IF( $R$9=\"kJ\", \"The value shown for each arrow represents heat input or use or loss in terms of kJ/hour\", IF($R$9=\"kgce\", \"The value shown for each arrow represents heat input or use or loss in terms of kgce/hour\", IF($R$9=\"TCE\", \"The value shown for each arrow represents heat input or use or loss in terms of TCE/hour\", IF($R$9=\"kgoe\", \"The value shown for each arrow represents heat input or use or loss in terms of kgoe/hour\",IF($R$9=\"Btu\", \"The value shown for each arrow represents heat input or use or loss in terms of Btu/hour\", \"The value shown for each arrow represents heat input or use or loss in terms of kcal/hour\")))))","v":"The value shown for each arrow represents heat input or use or loss in terms of kgce/hour"},null,null,null,null,null,null,null,null,null,null,null,null,null,null,null,null,null,"Fixtures, trays, conveyor etc.",{"$f":"'PHASTEx summary report'!G15 / $Z$9","v":0},{"$f":"V41/1000000","v":0}]
[null,null,"The top value is for \"current\" conditions and the bottom value is for \"modified\" conditions.",null,null,null,null,null,null,null,null,null,null,null,null,null,null,null,null,null,"Wall surface heat losses",{"$f":"'PHASTEx summary report'!G16 / $Z$9","v":0},0]
[null,null,null,null,null,null,null,null,null,null,null,null,null,null,null,null,null,null,null,null,"Water or air cooling (internal) ",{"$f":"'PHASTEx summary report'!G17 / $Z$9","v":0},0]
[null,null,null,null,null,null,null,null,null,null,null,null,null,null,null,null,null,null,null,null,"Atmosphere or makeup air  ",{"$f":"'PHASTEx summary report'!G18 / $Z$9","v":0},0]
[null,null,null,null,null,null,null,null,null,null,null,null,null,null,null,null,null,null,null,null,"Radiation losses from openings",{"$f":"'PHASTEx summary report'!G19 / $Z$9","v":0},0]
[null,null,null,null,null,null,null,null,null,null,null,null,null,null,null,null,null,null,null,null,"Other heat loss or heat addition ",{"$f":"'PHASTEx summary report'!G20 / $Z$9","v":0},0]
[null,null,null,null,null,null,null,null,null,null,null,null,null,null,null,null,null,null,null,null,"Total net heat required",{"$f":"'PHASTEx summary report'!G21 / $Z$9","v":0},0]
[null,null,null,null,null,null,null,null,null,null,null,null,null,null,null,null,null,null,null,null,"Available heat",{"$f":"'PHASTEx summary report'!G22 / $Z$9","v":3.3825933155657999E-5},3.3825933155658E-11]
[null,null,null,null,null,null,null,null,null,null,null,null,null,null,null,null,null,null,null,null,"Flue gas loss",{"$f":"'PHASTEx summary report'!G23 / $Z$9","v":0},0]
[null,null,null,null,null,null,null,null,null,null,null,null,null,null,null,null,null,null,null,null,"Exothermic heat from process ",{"$f":"'PHASTEx summary report'!G24 / $Z$9","v":0},0]
[null,null,null,null,null,null,null,null,null,null,null,null,null,null,null,null,null,null,null,null,"Total gross heat input required ",{"$f":"'PHASTEx summary report'!G25 / $Z$9","v":0},0]

{"sheet":"Energy Usage Distribution","index":5,"n_rows":44,"n_cols":18,"rows_kept":44,"cut":false,"hidden":false,"merged":[[33,8,33,9],[1,1,1,14],[2,1,2,14],[4,3,4,12],[5,3,5,12],[34,8,34,9],[35,8,35,9],[36,8,36,9],[37,8,37,9],[38,8,38,9],[39,8,39,9],[40,8,40,9],[41,8,41,9],[42,8,42,9],[43,8,43,11]]}
[]
[null,"PHASTEx - U.S. Units Version "]
[null,"Developed by E3M Inc. under contract with Oak Ridge National Laboratory"]
[]
[null,null,null,"Report Page 1"]
[null,null,null,"Distribution of Energy Usage By Area-Current Condition"]
[]
[]
[]
[null,null,null,null,null,null,null,null,null,null,null,null,null,null,null,null,"Next Page",{"$f":"IF('Sankey Diagram'!$R$9=\"kgce\",\"Heat loss or use (kgce/hour)\",IF('Sankey Diagram'!$R$9=\"kgoe\",\"Heat loss or use (kgoe/hour)\",IF('Sankey Diagram'!$R$9=\"kcal\",\"Heat loss or use (kcal/hour)\",IF('Sankey Diagram'!$R$9=\"Btu\",\"Heat loss or use (Btu/hour)\",IF('Sankey Diagram'!$R$9=\"MMBtu\",\"Heat loss or use (MMBtu/hour)\",\"Heat loss or use (kcal/hour)\")))))","v":"Heat loss or use (kgce/hour)"}]
[null,null,null,null,null,null,null,null,null,null,null,null,null,null,null,null,"Previous Page",{"$f":" IF('Sankey Diagram'!$R$9=\"kgce\", \"kgce/Hr.\", IF('Sankey Diagram'!$R$9=\"kgoe\", \"kgoe/Hr.\", IF('Sankey Diagram'!$R$9=\"kcal\",\"kcal/Hr.\", IF('Sankey Diagram'!$R$9=\"Btu\",\"Btu/Hr.\",IF('Sankey Diagram'!$R$9=\"MMBtu\",\"MMBtu/Hr.\",\"Btu/hr.\")))))","v":"kgce/Hr."}]
[null,null,null,null,null,null,null,null,null,null,null,null,null,null,null,null,"Return to Control Page"]
[null,null,null,null,null,null,null,null,null,null,null,null,null,null,null,null,"Print Sheet"]
[]
[]
[]
[]
[]
[]
[]
[]
[]
[]
[]
[]
[]
[]
[]
[]
[]
[]
[]
[]
[null,null,null,null,null,null,null,null,"Heat Loss/Use",null,"Current ","Modified"]
[null,null,null,null,null,null,null,null,"Charge-load",null,{"$f":"'PHASTEx summary report'!D14 / 'Sankey Diagram'!Z9","v":0},{"$f":"'PHASTEx summary report'!G14 / 'Sankey Diagram'!Z9","v":0}]
[null,null,null,null,null,null,null,null,"Fixtures etc.",null,{"$f":"'PHASTEx summary report'!D15 / 'Sankey Diagram'!Z9","v":0},{"$f":"'PHASTEx summary report'!G15 / 'Sankey Diagram'!Z9","v":0}]
[null,null,null,null,null,null,null,null,"Wall surfaces ",null,{"$f":"'PHASTEx summary report'!D16 / 'Sankey Diagram'!Z9","v":0},{"$f":"'PHASTEx summary report'!G16 / 'Sankey Diagram'!Z9","v":0}]
[null,null,null,null,null,null,null,null,"Water/air cooling ",null,{"$f":"'PHASTEx summary report'!D17 / 'Sankey Diagram'!Z9","v":0},{"$f":"'PHASTEx summary report'!G17 / 'Sankey Diagram'!Z9","v":0}]
[null,null,null,null,null,null,null,null,"Atmosphere ",null,{"$f":"'PHASTEx summary report'!D18 / 'Sankey Diagram'!Z9","v":0},{"$f":"'PHASTEx summary report'!G18 / 'Sankey Diagram'!Z9","v":0}]
[null,null,null,null,null,null,null,null,"Openings",null,{"$f":"'PHASTEx summary report'!D19 / 'Sankey Diagram'!Z9","v":0},{"$f":"'PHASTEx summary report'!G19 / 'Sankey Diagram'!Z9","v":0}]
[null,null,null,null,null,null,null,null,"Other loss ",null,{"$f":"'PHASTEx summary report'!D20 / 'Sankey Diagram'!Z9","v":0},{"$f":"'PHASTEx summary report'!G20 / 'Sankey Diagram'!Z9","v":0}]
[null,null,null,null,null,null,null,null,"Flue gases",null,{"$f":"'PHASTEx summary report'!D23 / 'Sankey Diagram'!Z9","v":0},{"$f":"'PHASTEx summary report'!G23 / 'Sankey Diagram'!Z9","v":0}]
[null,null,null,null,null,null,null,null,"Total",null,{"$f":"SUM(K35:K42)","v":0},{"$f":"SUM(L35:L42)","v":0}]
[null,null,null,null,null,null,null,null,{"$f":"'Sankey Diagram'!$Z$10","v":"All quantities are in units of kgce/Hr."}]

{"sheet":"Energy Usage Distribution pg2","index":6,"n_rows":42,"n_cols":17,"rows_kept":42,"cut":false,"hidden":false,"merged":[[5,3,5,12],[2,1,2,14],[1,1,1,14],[40,9,40,10],[41,9,41,12],[4,3,4,12],[45,1,45,6],[46,6,46,9],[31,9,31,10],[32,9,32,10],[33,9,33,10],[34,9,34,10],[35,9,35,10],[36,9,36,10],[37,9,37,10],[38,9,38,10],[39,9,39,10]]}
[]
[null,"PHASTEx - U.S. Units Version "]
[null,"Developed by E3M Inc. under contract with Oak Ridge National Laboratory"]
[]
[null,null,null,"Report Page 2"]
[null,null,null,"Distribution of Energy Usage By Area-Modified Condition"]
[]
[]
[]
[null,null,null,null,null,null,null,null,null,null,null,null,null,null,null,null,"Next Page"]
[null,null,null,null,null,null,null,null,null,null,null,null,null,null,null,null,"Previous Page"]
[null,null,null,null,null,null,null,null,null,null,null,null,null,null,null,null,"Return to Control Page"]
[null,null,null,null,null,null,null,null,null,null,null,null,null,null,null,null,"Print Sheet"]
[]
[]
[]
[]
[]
[]
[]
[]
[]
[]
[]
[]
[]
[]
[]
[]
[]
[]
[null,null,null,null,null,null,null,null,null,"Heat Loss/Use",null,"Current ","Modified"]
[null,null,null,null,null,null,null,null,null,"Charge-load",null,{"$f":"'PHASTEx summary report'!D14 / 'Sankey Diagram'!Z9","v":0},{"$f":"'PHASTEx summary report'!G14 / 'Sankey Diagram'!Z9","v":0}]
[null,null,null,null,null,null,null,null,null,"Fixtures etc.",null,{"$f":"'PHASTEx summary report'!D15 / 'Sankey Diagram'!Z9","v":0},{"$f":"'PHASTEx summary report'!G15 / 'Sankey Diagram'!Z9","v":0}]
[null,null,null,null,null,null,null,null,null,"Wall surfaces ",null,{"$f":"'PHASTEx summary report'!D16 / 'Sankey Diagram'!Z9","v":0},{"$f":"'PHASTEx summary report'!G16 / 'Sankey Diagram'!Z9","v":0}]
[null,null,null,null,null,null,null,null,null,"Water/air cooling ",null,{"$f":"'PHASTEx summary report'!D17 / 'Sankey Diagram'!Z9","v":0},{"$f":"'PHASTEx summary report'!G17 / 'Sankey Diagram'!Z9","v":0}]
[null,null,null,null,null,null,null,null,null,"Atmosphere ",null,{"$f":"'PHASTEx summary report'!D18 / 'Sankey Diagram'!Z9","v":0},{"$f":"'PHASTEx summary report'!G18 / 'Sankey Diagram'!Z9","v":0}]
[null,null,null,null,null,null,null,null,null,"Openings",null,{"$f":"'PHASTEx summary report'!D19 / 'Sankey Diagram'!Z9","v":0},{"$f":"'PHASTEx summary report'!G19 / 'Sankey Diagram'!Z9","v":0}]
[null,null,null,null,null,null,null,null,null,"Other loss ",null,{"$f":"'PHASTEx summary report'!D20 / 'Sankey Diagram'!Z9","v":0},{"$f":"'PHASTEx summary report'!G20 / 'Sankey Diagram'!Z9","v":0}]
[null,null,null,null,null,null,null,null,null,"Flue gases",null,{"$f":"'PHASTEx summary report'!D23 / 'Sankey Diagram'!Z9","v":0},{"$f":"'PHASTEx summary report'!G23 / 'Sankey Diagram'!Z9","v":0}]
[null,null,null,null,null,null,null,null,null,"Total",null,{"$f":"SUM(L33:L40)","v":0},{"$f":"SUM(M33:M40)","v":0}]
[null,null,null,null,null,null,null,null,null,{"$f":"'Sankey Diagram'!$Z$10","v":"All quantities are in units of kgce/Hr."}]

{"sheet":"Notes On Current v Modified","index":7,"n_rows":66,"n_cols":13,"rows_kept":66,"cut":false,"hidden":false,"merged":[[5,9,5,10],[4,9,4,10],[44,4,48,4],[44,5,48,5],[14,4,18,4],[19,4,23,4],[24,4,28,4],[29,4,33,4],[24,5,28,5],[34,4,38,4],[19,5,23,5],[29,5,33,5],[34,5,38,5],[39,5,43,5],[39,4,43,4],[49,5,53,5],[54,5,58,5],[59,5,63,5],[59,3,63,3],[59,4,63,4],[54,4,58,4],[54,3,58,3],[49,4,53,4],[44,3,48,3],[49,3,53,3],[14,3,18,3],[19,3,23,3],[24,3,28,3],[29,3,33,3],[39,3,43,3],[1,1,1,5],[2,1,2,5],[4,2,4,3],[14,5,18,5],[34,3,38,3],[34,1,38,1],[29,1,33,1],[24,1,28,1],[19,1,23,1],[14,1,18,1],[9,1,13,1],[5,2,5,3],[9,3,13,3],[9,4,13,4],[9,5,13,5],[59,1,63,1],[54,1,58,1],[49,1,53,1],[44,1,48,1],[39,1,43,1]]}
[]
[null,"PHASTEx - U.S. Units Version "]
[null,"Developed by E3M Inc. under contract with Oak Ridge National Laboratory"]
[]
[null,null,"Report Page 3",null,null,null,null,null,null,"Available heat",null,"Current","Modified"]
[null,null,"ENERGY SAVINGS (REDUCTION IN HEAT INPUT) RESULTING FROM THE MODIFICATIONS ",null,null,null,null,null,null,"Percent",null,{"$f":"'Flue gases'!D14/100","v":0.90133904135354603},{"$f":"'Flue gases'!E14/100","v":0.93921085999999998}]
[]
[null,null,null,null,null,null,null,null,null,"Return To Control Page"]
[null,"Area","Notes on Current Vs. Modified Conditions:",null,null,null,null,null,null,"Print Sheet"]
[null,"Charge Material-Solid",{"$f":"IF(K10=0,\" \",K10)","v":" "},"Resulting in a savings (increase) of:",{"$f":"M12 / 'Sankey Diagram'!Z9","v":0},{"$f":"'Energy Usage Distribution'!R11","v":"kgce/Hr."},null,null,null,"Previous Page",{"$f":"'Load Charge Solid-1'!C160","v":0}]
[null,null,{"$f":"IF(K11=0,\" \",K11)","v":" "},null,null,null,null,null,null,"Return To Control Page",{"$f":"'Load Charge Solid-1'!C161","v":0}]
[null,null," ",null,null,null,null,null,null,null,{"$f":"'Load Charge Solid-1'!C162","v":0},null,{"$f":"'Load Charge Solid-1'!E156/L6-'Load Charge Solid-1'!F156/M6","v":0}]
[null,null," ",null,null,null,null,null,null,null,{"$f":"'Load Charge Solid-1'!C163","v":0}]
[null,null," ",null,null,null,null,null,null,null,{"$f":"'Load Charge Solid-1'!C164","v":0}]
[null,"Charge Material-Liquid",{"$f":"IF(K15=0,\" \",K15)","v":" "},"Resulting in a savings (increase) of:",{"$f":"M17 / 'Sankey Diagram'!Z9","v":0},{"$f":"F10","v":"kgce/Hr."},null,null,null,null,{"$f":"'Load Charge Liquid-1'!C124","v":0}]
[null,null," ",null,null,null,null,null,null,null,{"$f":"'Load Charge Liquid-1'!C125","v":0}]
[null,null," ",null,null,null,null,null,null,null,{"$f":"'Load Charge Liquid-1'!C126","v":0},null,{"$f":"'Load Charge Liquid-1'!E120/L6-'Load Charge Liquid-1'!F120/M6","v":0}]
[null,null," ",null,null,null,null,null,null,null,{"$f":"'Load Charge Liquid-1'!C127","v":0}]
[null,null," ",null,null,null,null,null,null,null,{"$f":"'Load Charge Liquid-1'!C128","v":0}]
[null,"Charge Material-Gas",{"$f":"IF(K20=0,\" \",K20)","v":" "},"Resulting in a savings (increase) of:",{"$f":"M20 / 'Sankey Diagram'!Z9","v":0},{"$f":"F10","v":"kgce/Hr."},null,null,null,null,{"$f":"'Load Charge Gas-1'!C109","v":0},null,{"$f":"'Load Charge Gas-1'!E105/L6-'Load Charge Gas-1'!F105/M6","v":0}]
[null,null," ",null,null,null,null,null,null,null,{"$f":"'Load Charge Gas-1'!C110","v":0}]
[null,null," ",null,null,null,null,null,null,null,{"$f":"'Load Charge Gas-1'!C111","v":0}]
[null,null," ",null,null,null,null,null,null,null,{"$f":"'Load Charge Gas-1'!C112","v":0}]
[null,null," ",null,null,null,null,null,null,null,{"$f":"'Load Charge Gas-1'!C113","v":0}]
[null,"Fixture Losses",{"$f":"IF(K25=0,\" \",K25)","v":" "},"Resulting in a savings (increase) of:",{"$f":"M25 / 'Sankey Diagram'!Z9","v":0},{"$f":"F10","v":"kgce/Hr."},null,null,null,null,{"$f":"'Fixture losses '!B69","v":0},null,{"$f":"'Fixture losses '!D65/L6-'Fixture losses '!E65/M6","v":0}]
[null,null," ",null,null,null,null,null,null,null,{"$f":"'Fixture losses '!B70","v":0}]
[null,null," ",null,null,null,null,null,null,null,{"$f":"'Fixture losses '!B71","v":0}]
[null,null," ",null,null,null,null,null,null,null,{"$f":"'Fixture losses '!B72","v":0}]
[null,null," ",null,null,null,null,null,null,null,{"$f":"'Fixture losses '!B73","v":0}]
[null,"Wall Losses",{"$f":"IF(K30=0,\" \",K30)","v":" "},"Resulting in a savings (increase) of:",{"$f":"M30 / 'Sankey Diagram'!Z9","v":0},{"$f":"F10","v":"kgce/Hr."},null,null,null,null,{"$f":"'Wall losses'!B133","v":0},null,{"$f":"'Wall losses'!D129/L6-'Wall losses'!E129/M6","v":0}]
[null,null," ",null,null,null,null,null,null,null,{"$f":"'Wall losses'!B134","v":0}]
[null,null," ",null,null,null,null,null,null,null,{"$f":"'Wall losses'!B135","v":0}]
[null,null," ",null,null,null,null,null,null,null,{"$f":"'Wall losses'!B136","v":0}]
[null,null," ",null,null,null,null,null,null,null,{"$f":"'Wall losses'!B137","v":0}]
[null,"Water/Air Cooling Losses",{"$f":"IF(K35=0,\" \",K35)","v":" "},"Resulting in a savings (increase) of:",{"$f":"M35 / 'Sankey Diagram'!Z9","v":0},{"$f":"F10","v":"kgce/Hr."},null,null,null,null,{"$f":"'Water-Air cooling'!B237","v":0},null,{"$f":"'Water-Air cooling'!D233/L6-'Water-Air cooling'!E233/M6","v":0}]
[null,null," ",null,null,null,null,null,null,null,{"$f":"'Water-Air cooling'!B238","v":0}]
[null,null," ",null,null,null,null,null,null,null,{"$f":"'Water-Air cooling'!B239","v":0}]
[null,null," ",null,null,null,null,null,null,null,{"$f":"'Water-Air cooling'!B240","v":0}]
[null,null," ",null,null,null,null,null,null,null,{"$f":"'Water-Air cooling'!B241","v":0}]
[null,"Atmosphere Losses",{"$f":"IF(K40=0,\" \",K40)","v":" "},"Resulting in a savings (increase) of:",{"$f":"M40 / 'Sankey Diagram'!Z9","v":0},{"$f":"F10","v":"kgce/Hr."},null,null,null,null,{"$f":"'Atmosphere losses'!B55","v":0},null,{"$f":"'Atmosphere losses'!D50/L6-'Atmosphere losses'!E50/M6","v":0}]
[null,null," ",null,null,null,null,null,null,null,{"$f":"'Atmosphere losses'!B56","v":0}]
[null,null," ",null,null,null,null,null,null,null,{"$f":"'Atmosphere losses'!B57","v":0}]
[null,null," ",null,null,null,null,null,null,null,{"$f":"'Atmosphere losses'!B58","v":0}]
[null,null," ",null,null,null,null,null,null,null,{"$f":"'Atmosphere losses'!B59","v":0}]
[null,"Flue Gases",{"$f":"IF(K45=0,\" \",K45)","v":" "},"Resulting in a savings (increase) of:",{"$f":"('PHASTEx summary report'!D23-'PHASTEx summary report'!G23)/ 'Sankey Diagram'!Z9","v":0},{"$f":"F10","v":"kgce/Hr."},null,null,null,null,{"$f":"'Flue gases'!B18","v":0}]
[null,null," ",null,null,null,null,null,null,null,{"$f":"'Flue gases'!B19","v":0}]
[null,null," ",null,null,null,null,null,null,null,{"$f":"'Flue gases'!B20","v":0}]
[null,null," ",null,null,null,null,null,null,null,{"$f":"'Flue gases'!B21","v":0}]
[null,null," ",null,null,null,null,null,null,null,{"$f":"'Flue gases'!B22","v":0}]
[null,"Opening Losses",{"$f":"IF(K50=0,\" \",K50)","v":" "},"Resulting in a savings (increase) of:",{"$f":"M50 / 'Sankey Diagram'!Z9","v":0},{"$f":"F10","v":"kgce/Hr."},null,null,null,null,{"$f":"'Radiation losses from opening'!B164","v":0},null,{"$f":"'Radiation losses from opening'!D160/L6-'Radiation losses from opening'!E160/M6","v":0}]
[null,null," ",null,null,null,null,null,null,null,{"$f":"'Radiation losses from opening'!B165","v":0}]
[null,null," ",null,null,null,null,null,null,null,{"$f":"'Radiation losses from opening'!B166","v":0}]
[null,null," ",null,null,null,null,null,null,null,{"$f":"'Radiation losses from opening'!B167","v":0}]
[null,null," ",null,null,null,null,null,null,null,{"$f":"'Radiation losses from opening'!B168","v":0}]
[null,"Power Usage",{"$f":"IF(K55=0,\" \",K55)","v":" "},"Resulting in a savings (increase) of:",{"$f":"M55","v":0},"KW",null,null,null,null,{"$f":"'8- Power- Motor driven  systems'!B87","v":0},null,{"$f":"'8- Power- Motor driven  systems'!D83-'8- Power- Motor driven  systems'!E83","v":0}]
[null,null," ",null,null,null,null,null,null,null,{"$f":"'8- Power- Motor driven  systems'!B88","v":0}]
[null,null," ",null,null,null,null,null,null,null,{"$f":"'8- Power- Motor driven  systems'!B89","v":0}]
[null,null," ",null,null,null,null,null,null,null,{"$f":"'8- Power- Motor driven  systems'!B90","v":0}]
[null,null," ",null,null,null,null,null,null,null,{"$f":"'8- Power- Motor driven  systems'!B91","v":0}]
[null,"Other Heat Losses",{"$f":"IF(K60=0,\" \",K60)","v":" "},"Resulting in a savings (increase) of:",{"$f":"M60 / 'Sankey Diagram'!Z9","v":0},{"$f":"F10","v":"kgce/Hr."},null,null,null,null,{"$f":"'9- Other heat loss'!C70","v":0},null,{"$f":"'9- Other heat loss'!E59/L6-'9- Other heat loss'!F59/M6","v":0}]
[null,null," ",null,null,null,null,null,null,null,{"$f":"'9- Other heat loss'!C71","v":0}]
[null,null," ",null,null,null,null,null,null,null,{"$f":"'9- Other heat loss'!C72","v":0}]
[null,null," ",null,null,null,null,null,null,null,{"$f":"'9- Other heat loss'!C73","v":0}]
[null,null," ",null,null,null,null,null,null,null,{"$f":"'9- Other heat loss'!C74","v":0}]
[null,null,null,"TOTAL  ",{"$f":"E10+E15+E20+E25+E30+E35+E40+E50+E60","v":0},{"$f":"F10","v":"kgce/Hr."}]
[null,null,null,"TOTAL  ",{"$f":"E55","v":0},"Kw"]

{"sheet":"Load Charge Solid-1","index":8,"n_rows":165,"n_cols":36,"rows_kept":165,"cut":false,"hidden":false,"merged":[[5,0,23,0],[158,2,158,5],[157,2,157,5],[56,2,57,3],[167,2,167,5],[165,2,165,5],[164,2,164,5],[166,2,166,5],[159,2,159,5],[160,2,160,5],[161,2,161,5],[162,2,162,5],[163,2,163,5],[3,2,3,3],[35,6,35,7],[86,6,86,7],[107,2,108,3],[155,2,155,3],[5,2,6,3],[54,2,54,3],[55,2,55,3],[105,2,105,3],[106,2,106,3],[69,6,72,7],[120,6,123,7],[18,6,21,7]]}
[]
[null,null,"Number of charge materials - solid ",{"$f":"'Control page'!D11","v":3},"from control sheet "]
[null,null,null,null,null,null,null,null,null,null,null,46,null,"ID","Substance","MaterialType","Composition","Density (#s/ft^3)","MeanSpecific Heat of solid (Btu/lb. 0F) ","LatentHeatof Fusion Btu/lb.","MeanSpecific Heat Of Liquid (Btu/lb 0F)","MeltingPoint (Deg. F.)","Average Pouring Temp (Deg. F)","HtContentOf Solid At MeltingPoint (Btu/lb.) ","HtContentOf LiquidAt MeltingTemp (Btu/lb.) ","HtContentOf LiquidAt PouringTemp (Btu/lb.)","Change"]
[null,null,"Load Charge Material 1",null,"Current","Modified",null,null,null,null,null,"$o$5",null,null,null,null,"Conversion Factor ",{"$f":"16.02","v":16.02},4.1870000000000003,2.3260000000000001,{"$f":"S4","v":4.1870000000000003},"C=(F-32)/1.8","C=(F-32)/1.8",2.3260000000000001,{"$f":"X4","v":2.3260000000000001},{"$f":"Y4","v":2.3260000000000001}]
[null,null,"Solid",null,null,null,null,null,"Help",null,null,{"$f":"ADDRESS(L3,15,1)","v":"$O$46"},null,1,"Aluminum","Solid","Al",{"$f":"AB5/$R$4","v":166.69975031210987},{"$f":"AC5/$S$4","v":0.24791019823262478},{"$f":"AD5/$T$4","v":169},{"$f":"AE5/$U$4","v":0.26009075710532598},{"$f":"AF5*1.8 +32","v":1214.9960000000001},{"$f":"AG5*1.8 +32","v":1380.002},{"$f":"AH5/$X$4","v":286},{"$f":"AI5/$Y$4","v":454.99999999999994},{"$f":"AJ5/$Z$4","v":496.99999999999994},false,2670.53,1.038,393.09399999999999,1.089,657.22,748.89,665.23599999999999,1058.33,1156.0219999999999]
[null,null,"Name of the Material (Choose From  List) or \"Other\"\nIf not on list then enter material and thermal properties in boxes",null,"Carbon Steel",{"$f":"E6","v":"Carbon Steel"},null,null,"Copy Current to Modified",null,null,{"$f":"ADDRESS(L3+1,15,1)","v":"$O$47"},null,2,"Babbitt, lead  base","Solid","75 Pb,15 Sb,10 Sn",{"$f":"AB6/$R$4","v":0},{"$f":"AC6/$S$4","v":3.8930021495103891E-2},{"$f":"AD6/$T$4","v":26.199914015477216},{"$f":"AE6/$U$4","v":3.7974683544303799E-2},{"$f":"AF6*1.8 +32","v":462.00200000000001},{"$f":"AG6*1.8 +32","v":624.99199999999996},{"$f":"AH6/$X$4","v":15.800085984522784},{"$f":"AI6/$Y$4","v":41.999999999999993},{"$f":"AJ6/$Z$4","v":48},false,0,0.16300000000000001,60.941000000000003,0.159,238.89,329.44,36.750999999999998,97.691999999999993,111.648]
[null,null,null,null,null,null,null,null,"Done Entering Data",null,"Enter Matl Name",{"$f":"CONCATENATE(L4,\":\",L5)","v":"$o$5:$O$46"},null,3,"Babbitt, tin  base","Solid","83.3 Sn,8.4 Sb,8.3 Cu",462,7.0933842846907083E-2,34.100171969045569,6.3052304752806307E-2,464,915.99800000000005,28.600171969045572,67.699914015477205,91,false,7401.24,0.29699999999999999,79.316999999999993,0.26400000000000001,240,491.11,66.524000000000001,157.47,211.666]
[null,null,"Average specific heat of the solid material (dry)","Btu/(lb-F)",{"$f":"IF(E$6=\"Other\",K12,VLOOKUP($E$6,$O$5:$AA$100,5,))","v":0.16},{"$f":"E8","v":0.16},null,null,"Print Sheet",null,0,{"$f":"ADDRESS(L3,19,1)","v":"$S$46"},null,4,"Bismuth","Solid","Bi",612,3.2959159302603298E-2,18.5,3.5108669691903509E-2,518,620.00600000000009,15.10017196904557,33.600171969045569,37.199914015477212,false,9804.24,0.13800000000000001,43.030999999999999,0.14699999999999999,270,326.67,35.122999999999998,78.153999999999996,86.527000000000001]
[null,null,"Latent Heat of Fusion","Btu/lb",{"$f":"IF(E$6=\"Other\",K13,VLOOKUP($E$6,$O$5:$AA$100,6,))","v":60},{"$f":"E9","v":60},null,null,null,null,0,{"$f":"ADDRESS(L3,20,1)","v":"$T$46"},null,5,"Brass, Muntz metal","Solid","60 Cu,40 Zn",524,0.10508717458801051,69,0.12491043706711248,1630.0039999999999,1850,165,234,261,false,8394.48,0.44,160.494,0.52300000000000002,887.78,1010,383.79,544.28399999999999,607.08600000000001]
[null,null,"Specific heat of liquid from molten material","Btu/(lb-F)",{"$f":"IF(E$6=\"Other\",K14,VLOOKUP($E$6,$O$5:$AA$100,7,))","v":0.17497014568903749},0.17497014568903749,null,null,null,null,0,{"$f":"ADDRESS(L3,21,1)","v":"$U$46"},null,6,"Brass, red","Solid","90 Cu,10 Zn",546,0.10389300214951039,86.5,0.11511822307141149,1952.0060000000001,2249.9960000000001,196.99999999999997,283.5,317.80008598452275,false,8746.92,0.435,201.19900000000001,0.48199999999999998,1066.67,1232.22,458.22199999999998,659.42100000000005,739.20299999999997]
[null,null,"Melting Point","deg. F.",{"$f":"IF($E$6=\"Other\",K15,VLOOKUP($E$6,$O$5:$AA$100,8,))","v":2800.0039999999999},2800.0039999999999,null,null,null,null,"0",{"$f":"ADDRESS(L3,22,1)","v":"$V$46"},null,7,"Brass,yellow","Solid","67 Cu,33 Zn",528,0.10508717458801051,70.999999999999986,0.1229997611655123,1688,1950.008,171,242.00000000000003,274.19991401547719,false,8458.56,0.44,165.14599999999999,0.51500000000000001,920,1065.56,397.74599999999998,562.89200000000005,637.78899999999999]
[null,null,null,null,null,null,null,null,null,null,{"$f":"VALUE(K8)","v":0},null,null,8,"Bronze,  bearing","Solid","80 Cu,10 Pb,10 Sn",556.00000000000011,9.5056126104609506E-2,79.899828030954424,0.10890852639121089,1832,2049.9979999999996,168.30008598452278,248.19991401547719,272,false,8907.1200000000008,0.39800000000000002,185.84700000000001,0.45600000000000002,1000,1121.1099999999999,391.46600000000001,577.31299999999999,632.67200000000003]
[null,null,"Charge (wet)-Feed Rate","lb/hr",null,null,null,null,{"$f":"E13*L24","v":0},{"$f":"F13*L24","v":0},{"$f":"VALUE(K9)","v":0},null,null,9,"Bronze, aluminum","Solid","90 Cu,10 Al",510,0.12610460950561261,98.600171969045562,0.12491043706711248,1922,2199.9920000000002,235,333.60017196904556,368,false,8170.2,0.52800000000000002,229.34399999999999,0.52300000000000002,1050,1204.44,546.61,775.95399999999995,855.96799999999996]
[null,null,"Water Content as Charged (%)","%",null,null,null,null,null,null,0,null,null,10,"Bronze, bell metal","Solid","78 Cu,22 Sn",540,0.10007165034630999,76.300085984522781,0.11893957487461189,1634,1900.0039999999999,157.39982803095444,233.69991401547722,265.39982803095444,false,8650.7999999999993,0.41899999999999998,177.47399999999999,0.498,890,1037.78,366.11200000000002,543.58600000000001,617.32000000000005]
[null,null,"Water Content as Discharged (%)","%",null,null,null,null,null,null,0,null,null,11,"Bronze, gun metal","Solid","90 Cu,1oSn",550,0.10699785048961069,84.199914015477205,0.1060425125388106,1850,2100.0020000000004,191.49999999999997,275.69991401547719,302,false,8811,0.44800000000000001,195.84899999999999,0.44400000000000001,1010,1148.8900000000001,445.42899999999997,641.27800000000002,702.452]
[null,null,"Initial Temperature","deg. F.",null,null,null,null,null,null,null,null,null,12,"Bronze, tobin","Solid","60 Cu,39.2 Zn,0.8 Sn",525,0.10699785048961069,73.5,0.12395509911631239,1625,1850,167.5,241,268.89982803095444,false,8410.5,0.44800000000000001,170.96100000000001,0.51900000000000002,885,1010,389.60500000000002,560.56600000000003,625.46100000000001]
[null,null,"Charge material discharge temperature","deg. F.",null,null,null,null,null,null,null,null,null,13,"Carbon Steel","Solid","1000 series",138,0.16,60,0.17497014568903749,2800.0039999999999,-4.0000000000048885E-3,0,0,0,false,7689.6,0.628,139.56,0.73260000000000003,1537.78,-17.78,0,0,0]
[null,null,"Water vapor discharge Temperature","deg. F.",null,null,null,null,null,null,null,null,null,14,"Copper","Solid","Cu",559,0.10389300214951039,91,0.1110580367805111,1981.9939999999999,2199.9920000000002,200,291,315,false,8955.18,0.435,211.666,0.46500000000000002,1083.33,1204.44,465.2,676.86599999999999,732.69]
[null,null,"Charge Melted (% of Dry Charge)","%",null,null,{"$f":"IF(OR(AND(E17<E11, E19>0),AND(F17<F11, F19>0)), $I$25,IF(OR(AND(E17>E11,E19<=0),AND(F17>F11,F19<=0)), $I$19,\"\"))","v":""},null,"Notice: The discharge temperature is higher than the melting point, please enter proper percentage for charge melted (>0% and <=100%).",null,null,null,null,15,"Die casting metal","Solid","92 Al,8 Cu",176,0.23596847384762357,162.99999999999997,0.24098399808932405,1149.998,1400,257.30008598452281,420.30008598452281,481,false,2819.52,0.98799999999999999,379.13799999999998,1.0089999999999999,621.11,760,598.48,977.61800000000005,1118.806]
[null,null,"Charge Reacted (% of Dry Charge)","%",null,null,null,null,null,null,null,null,null,16,"Die casting metal","Solid","80 Pb,10 Sn,10 Sb",176,3.7974683544303799E-2,17.5,3.70193455935037E-2,600.00800000000004,820.00400000000002,20.5,38,146,false,2819.52,0.159,40.704999999999998,0.155,315.56,437.78,47.683,88.388000000000005,339.596]
[null,null,"Heat of Reaction","Btu/lb",null,null,null,null,null,null,"Aluminum",null,null,17,"Die casting metal","Solid","90 Sn,4.5 Cu,5,5 Sb",176,6.9978504896106991E-2,30.199914015477216,6.2096966802006208E-2,449.99599999999998,649.99400000000003,27.600171969045569,57.800085984522788,70,false,2819.52,0.29299999999999998,70.245000000000005,0.26,232.22,343.33,64.197999999999993,134.44300000000001,162.82]
[null,null,"Endothermic/Exothermic",null,"Exothermic","Exothermic",null,null,null,null,"endothermic/exothermic",null,null,18,"Die casting metal","Solid","87.3 Zn,8.1Sn,4.1Cu,0.5A",176,0.10293766419871028,48,0.1380463338906138,780.00800000000004,980.00599999999997,74,121.99999999999999,150,false,2819.52,0.43099999999999999,111.648,0.57799999999999996,415.56,526.66999999999996,172.124,283.77199999999999,348.9]
[null,null,"Additional Heat Required","Btu/hr",null,null,null,null,null,null,null,null,null,19,"German silver","Solid","60 Cu,25 Zn,1 5 Ni",540,0.10890852639121089,86.199914015477219,0.1229997611655123,1850,2100.0020000000004,194,280.19991401547719,311,false,2819.52,0.45600000000000002,200.501,0.51500000000000001,1010,1148.8900000000001,451.24400000000003,651.745,723.38599999999997]
[null,null,"Total Heat Required For Charge Material 1","Btu/hr",{"$f":"E52","v":0},{"$f":"F52","v":0},null,null,null,null,null,{"$f":"IF('Control page'!$D$11=0,0,1)","v":1},"Control",20,"Gold","Solid","Au",1205,3.2959159302603298E-2,28.499999999999996,3.3914497253403383E-2,1945.0039999999999,2150.0060000000003,62.199914015477212,90.699914015477205,97.699914015477205,false,19304.099999999999,0.13800000000000001,66.290999999999997,0.14199999999999999,1062.78,1176.67,144.67699999999999,210.96799999999999,227.25]
[null,null,null,null,null,null,null,null,"Warning: The discharge temperature is lower than the melting point, the percentage for charge melted should be 0%.",null,null,null,null,21,"Inconel - 600","Solid","Inconel",480.00000000000006,0.13995700979221398,0,0,2499.998,-4.0000000000048885E-3,0,0,0,false,7689.6,0.58599999999999997,0,0,1371.11,-17.78,0,0,0]
[null,null,null,null,null,null,null,null,null,null,null,null,null,22,"Iron, cast, gray","Solid","94 Fe,3.5 C,2.5 Si",480.00000000000006,0.19011225220921901,41.399828030954431,0,2246,2800.0039999999999,415,455.99999999999994,583,false,7689.6,0.79600000000000004,96.296000000000006,0,1230,1537.78,965.29,1060.6559999999999,1356.058]
[null,null,null,null,null,null,null,null,null,null,null,null,null,23,"Iron, cast, white","Solid","97 Fe,3 C",480.00000000000006,0.18008120372581798,60.300085984522788,0,2102,2899.9940000000001,368,428,612,false,7689.6,0.754,140.25800000000001,0,1150,1593.33,855.96799999999996,995.52800000000002,1423.5119999999999]
[null,null,null,null,null,null,null,null,null,null,null,null,null,24,"Iron, pig","Solid","93 Fe,4.22 C,1.48 Si,0.73 Mn,0.12P ,0.03 S",480.00000000000006,0.15309290661571531,83.600171969045576,0,2012,2300,299,384,450,false,7689.6,0.64100000000000001,194.45400000000001,0,1100,1260,695.47400000000005,893.18399999999997,1046.7]
[null,null,"Calculations ",null,null,null,null,null,null,null,null,null,null,25,"Iron, pure","Solid","Fe",491,0.16790064485311676,117,0.14998805827561498,2802.0020000000004,3099.9920000000002,451,567.99999999999989,626,false,7865.82,0.70299999999999996,272.142,0.628,1538.89,1704.44,1049.0260000000001,1321.1679999999999,1456.076]
[null,null,"Weight of water for charged wet material (Btu/hr)",null,{"$f":"E13*E14","v":0},{"$f":"F13*F14","v":0},null,null,null,null,null,null,null,26,"Lead","Solid","Pb",708,3.2003821351803199E-2,10,3.3914497253403383E-2,620.99600000000009,719.99600000000009,18,28,30.999999999999996,false,11342.16,0.13400000000000001,23.26,0.14199999999999999,327.22000000000003,382.22,41.868000000000002,65.128,72.105999999999995]
[null,null,"Weight of solid dry material as charged  (Btu/hr)",null,{"$f":"E13-E30","v":0},{"$f":"F13-F30","v":0},null,null,null,null,null,null,null,27,"Linotype","Solid","86 pb,11 sb,3sn",700,3.6064007642703601E-2,21.5,3.6064007642703601E-2,485.99599999999998,620.00600000000009,15.300085984522786,36.800085984522781,41.600171969045569,false,11214,0.151,50.009,0.151,252.22,326.67,35.588000000000001,85.596999999999994,96.762]
[null,null,"Weight of water for discharged wet material  (Btu/hr)",null,{"$f":"E31*E15/(1-E15)","v":0},{"$f":"F31*F15/(1-F15)","v":0},null,null,null,null,null,null,null,28,"Magnesium","Solid","Mg",108.59987515605494,0.27203248149032722,83.699914015477219,0.26606161929782662,1203.998,1380.002,311.19991401547719,394.89982803095444,441.69991401547719,false,1739.77,1.139,194.68600000000001,1.1140000000000001,651.11,748.89,723.851,918.53700000000003,1027.394]
[null,null,"Total weight of wet material at discharge  (Btu/hr)",null,{"$f":"E31+E32","v":0},{"$f":"F31+F32","v":0},null,null,null,null,null,null,null,29,"Manganese","Solid","Mn",464,0.17100549319321709,66,0.1920229281108192,2246,2400.0079999999998,374,440,469,false,7433.28,0.71599999999999997,153.51599999999999,0.80400000000000005,1230,1315.56,869.92399999999998,1023.44,1090.894]
[null,null,null,null,null,null,null,null,null,null,null,null,null,30,"Monel metal","Solid","67 Ni,28 Cu; Fe, Mn, Si",550,0.1289706233580129,117.39982803095442,0.13900167184141388,2415.0020000000004,2750,304,421.39982803095444,468,false,8811,0.54,273.072,0.58199999999999996,1323.89,1510,707.10400000000004,980.17600000000004,1088.568]
[null,null,"Water - Moisture heat requirement",null,null,null,null,null,null,null,null,null,null,31,"Nickel 60 to 2644 F","Solid","Ni",556.00000000000011,0.13398614759971339,131.5,0.13303080964891331,2643.998,2850.0079999999998,346,477.49999999999994,505.00000000000006,false,8907.1200000000008,0.56100000000000005,305.86900000000003,0.55700000000000005,1451.11,1565.56,804.79600000000005,1110.665,1174.6300000000001]
[null,null,"Heating all water to boiling point (Btu/hr)",null,{"$f":"$G$37*E30*(212-E16)","v":0},{"$f":"$G$37*F30*(212-F16)","v":0},"Values used for water - steam/vapor related calculations ",null,null,null,null,null,null,32,"Silver","Solid","Ag",655,6.3052304752806307E-2,46.800085984522781,6.9978504896106991E-2,1761.998,1950.008,107,153.80008598452278,167,false,10493.1,0.26400000000000001,108.857,0.29299999999999998,961.11,1065.56,248.88200000000001,357.73899999999998,388.44200000000001]
[null,null,"Heat required for vaporization for water removed (Btu/hr)",null,{"$f":"IF(E18>212,$G$38*(E30-E32),0)","v":0},{"$f":"IF(F18>212,$G$38*(F30-F32),0)","v":0},1,"Sp. Heat of water (avg. value) Btu/(lb. F.) ",null,null,null,null,null,33,"solder, bismuth","Solid","40 pb,20 Sn,40 Bi",580,3.988535944590399E-2,16.399828030954428,3.8930021495103891E-2,231.99799999999999,330.00800000000004,9.3000859845227861,25.699914015477212,29.5,false,9291.6,0.16700000000000001,38.146000000000001,0.16300000000000001,111.11,165.56,21.632000000000001,59.777999999999999,68.617000000000004]
[null,null,"Heat for vapor superheat (to product final temp.) (Btu/hr)",null,{"$f":"  IF(E18>212, $G$39*(E30-E32)*(E18-212),0)","v":0},{"$f":"  IF(F18>212, $G$39*(F30-F32)*(F18-212),0)","v":0},970,"Heat of evaporation  (Btu/lb) for water",null,null,null,null,null,34,"Solder, plumbers","Solid","50 pb,50 Sn",580,5.1110580367805108E-2,23,4.8961069978504891E-2,413.99599999999998,500,18,41,45,false,9291.6,0.214,53.497999999999998,0.20499999999999999,212.22,260,41.868000000000002,95.366,104.67]
[null,null,"Heat required to bring retained water to water discharge temp. (Btu/hr)",null,{"$f":"$G$37*E32*(E18-212)","v":0},{"$f":"$G$37*F32*(F18-212)","v":0},0.48099999999999998,"Sp. Heat of water vapor or steam at atm. Pressure (avg. value) Btu/(lb. F.) ",null,null,null,null,null,35,"Stainless Steel - 300 series","Solid","310 and 304",480.00000000000006,0.13995700979221398,0,0,2550.0020000000004,-4.0000000000048885E-3,0,0,0,false,7689.6,0.58599999999999997,0,0,1398.89,-17.78,0,0,0]
[null,null,"Total heat for the water related thermal load (kJ/hr) ",null,{"$f":"SUM(E36:E39)","v":0},{"$f":"SUM(F36:F39)","v":0},0.48099999999999998,null,null,null,null,null,null,36,"Stainless Steel - 410","Solid","410 SS",480.00000000000006,0.12,48,0,2800.0039999999999,2800.0039999999999,750,126,141.99999999999997,false,7689.6,1.0469999999999999,111.648,0,1537.78,1537.78,1744.5,293.07600000000002,330.29199999999997]
[null,null,null,null,null,null,null,null,null,null,null,null,null,37,"Tin","Solid","Sn",455.00000000000006,6.9023166945306899E-2,25,6.3768808215906372E-2,449.99599999999998,649.99400000000003,27,52,64,false,7289.1,0.28899999999999998,58.15,0.26700000000000002,232.22,343.33,62.802,120.952,148.864]
[null,null,"Solid load heat requirement",null,null,null,null,null,null,null,null,null,null,38,"Zinc","Solid","Zn",445,0.10699785048961069,48,0.14592787198471457,786.00199999999995,899.99600000000009,77.800085984522781,125.80008598452278,141.99999999999997,false,7128.9,0.44800000000000001,111.648,0.61099999999999999,418.89,482.22,180.96299999999999,292.61099999999999,330.29199999999997]
[null,null,"Heat required for solid material up to melting point  (Btu/hr)",null,{"$f":"IF(E19<=0, E8*E31*(E17-E16), E8*E31*(E11-E16))","v":0},{"$f":"IF(F19<=0, F8*F31*(F17-F16), F8*F31*(F11-F16))","v":0},null,null,null,null,null,null,null,39,"Refractory","Solid",null,150,0.25005970862192495,0,0,5000,-4.0000000000048885E-3,0,0,0,false,0,1.0469999999999999,0,0,2760,-17.78,0,0,0]
[null,null,"Heat required for melting  (Btu/hr)",null,{"$f":"IF(E19>0, E31*E9*E19,0)","v":0},{"$f":"IF(F19>0, F31*F9*F19,0)","v":0},null,null,null,null,null,null,null,40,"Ladle Refractory","Solid",null,150,0.25005970862192495,0,0,5000,-4.0000000000048885E-3,0,0,0,false,0,1.0469999999999999,0,0,2760,-17.78,0,0,0]
[null,null,"Heat required for superheating molten material (Btu/hr)",null,{"$f":"IF(E19>0, E10*E31*(E17-E11)*E19,0)","v":0},{"$f":"IF(F19>0, F10*F31*(F17-F11)*F19,0)","v":0},null,null,null,null,null,null,null,null,"Other",null,null,null,"1.3","400","1.2","700"]
[null,null,"Heat required for heating unmelted solid material(Btu/hr)",null,{"$f":"  IF(E19>0, (1-E19)*E8*E31*(E17-E11), 0)","v":0},{"$f":"  IF(F19>0, (1-F19)*F8*F31*(F17-F11), 0)","v":0}]
[null,null,"Heat for reaction during heating  (Btu/hr)",null,{"$f":"IF(E22=\"Endothermic\",1,-1)*E20*E31*E21","v":0},{"$f":"IF(F22=\"Endothermic\",1,-1)*F20*F31*F21","v":0},null,null,null,null,{"$f":"(IF(E47<0,-1,0))*E47*$L$24","v":0},{"$f":"(IF(F47<0,-1,0))*F47*$L$24","v":0}]
[null,"Eliminate","Heat required for cooling the molten material  (Btu/hr)",null,0,0]
[null,"Eliminate","Heat required for cooling the remaining solid material (Btu/hr)",null,0,0]
[null,null,"Heat required for solid-dry material (Btu/hr)",null,{"$f":"SUM(E43:E46)+(IF(E22=\"Endothermic\",E47,0))","v":0},{"$f":"SUM(F43:F46)+(IF(F22=\"Endothermic\",F47,0))","v":0}]
[]
[null,null,"Total heat required for charge material  (Btu/hr)",null,{"$f":"E40+E50+E23","v":0},{"$f":"F40+F50+F23","v":0}]
[]
[]
[null,null,"Load Charge Material 2",null,"Current","Modified"]
[null,null,"Solid"]
[null,null,"Name of the Material (Choose From  List) or \"Other\"\nIf not on list then enter material and thermal properties in boxes",null,"Stainless Steel - 300 series",{"$f":"E57","v":"Stainless Steel - 300 series"}]
[null,null,null,null,null,null,null,null,null,null,"Name of Matl"]
[null,null,"Average specific heat of the solid material (dry)","Btu/(lb-F)",{"$f":"IF(E$57=\"Other\",K63,VLOOKUP($E$57,$O$5:$AA$100,5,))","v":0.13995700979221398},{"$f":"E59","v":0.13995700979221398},null,null,null,null,0]
[null,null,"Latent Heat of Fusion","Btu/lb",{"$f":"IF(E$57=\"Other\",K64,VLOOKUP($E$57,$O$5:$AA$100,6,))","v":0},{"$f":"E60","v":0},null,null,null,null,0]
[null,null,"Specific heat of liquid from molten material","Btu/(lb-F)",{"$f":"IF(E$57=\"Other\",K65,VLOOKUP($E$57,$O$5:$AA$100,7,))","v":0},0,null,null,null,null,0]
[null,null,"Melting Point","deg. F.",{"$f":"IF(E$57=\"Other\",K66,VLOOKUP($E$57,$O$5:$AA$100,8,))","v":2550.0020000000004},2550.0020000000004,null,null,null,null,0]
[null,null,null,null,null,null,null,null,null,null,{"$f":"VALUE(K59)","v":0}]
[null,null,"Charge (wet)-Feed Rate","lb/hr",null,null,null,null,{"$f":"E64*L75","v":0},{"$f":"F64*L75","v":0},{"$f":"VALUE(K60)","v":0}]
[null,null,"Water Content as Charged (%)","%",null,null,null,null,null,null,0]
[null,null,"Water Content as Discharged (%)","%",null,null,null,null,null,null,0]
[null,null,"Initial Temperature","deg. F."]
[null,null,"Charge material discharge temperature","deg. F."]
[null,null,"Water vapor discharge Temperature","deg. F."]
[null,null,"Charge Melted (% of Dry Charge)","%",null,null,{"$f":"IF(OR(AND(E68<E62, E70>0),AND(F68<F62, F70>0)), $I$25,IF(OR(AND(E68>E62,E70<=0),AND(F68>F62,F70<=0)), $I$19,\"\"))","v":""}]
[null,null,"Charge Reacted (% of Dry Charge)","%"]
[null,null,"Heat of Reaction","Btu/lb"]
[null,null,"Endothermic/Exothermic",null,"Exothermic","Exothermic"]
[null,null,"Additional Heat Required","Btu/hr"]
[null,null,"Total Heat Required For Charge Material 2","Btu/hr",{"$f":"E103","v":0},{"$f":"F103","v":0},null,null,null,null,null,{"$f":"IF('Control page'!$D$11>1,1,0)","v":1},"Control"]
[]
[]
[]
[]
[null,null,"Calculations "]
[null,null,"Weight of water for charged wet material (Btu/hr)",null,{"$f":"E64*E65","v":0},{"$f":"F64*F65","v":0}]
[null,null,"Weight of solid dry material as charged  (Btu/hr)",null,{"$f":"E64-E81","v":0},{"$f":"F64-F81","v":0}]
[null,null,"Weight of water for discharged wet material  (Btu/hr)",null,{"$f":"E82*E66/(1-E66)","v":0},{"$f":"F82*F66/(1-F66)","v":0}]
[null,null,"Total weight of wet material at discharge  (Btu/hr)",null,{"$f":"E82+E83","v":0},{"$f":"F82+F83","v":0}]
[]
[null,null,"Water - Moisture heat requirement"]
[null,null,"Heating all water to boiling point (Btu/hr)",null,{"$f":"$G$37*E81*(212-E67)","v":0},{"$f":"$G$37*F81*(212-F67)","v":0},"Values used for water - steam/vapor related calculations "]
[null,null,"Heat required for vaporization for water removed (Btu/hr)",null,{"$f":"IF(E69>212,$G$38*(E81-E83),0)","v":0},{"$f":"IF(F69>212,$G$38*(F81-F83),0)","v":0},1,"Sp. Heat of water (avg. value) kJ/(kg. C)"]
[null,null,"Heat for vapor superheat (to product final temp.) (Btu/hr)",null,{"$f":"  IF(E69>212, $G$39*(E81-E83)*(E69-212),0)","v":0},{"$f":"  IF(F69>212, $G$39*(F81-F83)*(F69-212),0)","v":0},970,"Heat of evaporation (kJ/kg) for water"]
[null,null,"Heat required to bring retained water to water discharge temp. (Btu/hr)",null,{"$f":"$G$37*E83*(E69-212)","v":0},{"$f":"$G$37*F83*(F69-212)","v":0},0.48099999999999998,"Sp. Heat of water vapor or steam at atm. Pressure (avg. value) kJ/(kg. C)"]
[null,null,"Total heat for the water related thermal load (kJ/hr) ",null,{"$f":"SUM(E87:E90)","v":0},{"$f":"SUM(F87:F90)","v":0},0.48099999999999998]
[]
[null,null,"Solid load heat requirement"]
[null,null,"Heat required for solid material up to melting point  (Btu/hr)",null,{"$f":"IF(E70<=0, E59*E82*(E68-E67), E59*E82*(E62-E67))","v":0},{"$f":"IF(F70<=0, F59*F82*(F68-F67), F59*F82*(F62-F67))","v":0}]
[null,null,"Heat required for melting  (Btu/hr)",null,{"$f":"IF(E70>0, E82*E60*E70,0)","v":0},{"$f":"IF(F70>0, F82*F60*F70,0)","v":0}]
[null,null,"Heat required for superheating molten material (Btu/hr)",null,{"$f":"IF(E70>0, E61*E82*(E68-E62)*E70,0)","v":0},{"$f":"IF(F70>0, F61*F82*(F68-F62)*F70,0)","v":0}]
[null,null,"Heat required for heating unmelted solid material(Btu/hr)",null,{"$f":"  IF(E70>0, (1-E70)*E59*E82*(E68-E62), 0)","v":0},{"$f":"  IF(F70>0, (1-F70)*F59*F82*(F68-F62), 0)","v":0}]
[null,null,"Heat for reaction during heating  (Btu/hr)",null,{"$f":"IF(E73=\"Endothermic\",1,-1)*E71*E82*E72","v":0},{"$f":"IF(F73=\"Endothermic\",1,-1)*F71*F82*F72","v":0},null,null,null,null,{"$f":"(IF(E98<0,-1,0))*E98*$L$75","v":0},{"$f":"(IF(F98<0,-1,0))*F98*$L$75","v":0}]
[null,null,"Heat required for cooling the molten material  (Btu/hr)",null,0,0]
[null,null,"Heat required for cooling the remaining solid material (Btu/hr)",null,0,0]
[null,null,"Heat required for solid-dry material (Btu/hr)",null,{"$f":"SUM(E94:E97)+(IF(E73=\"Endothermic\",E98,0))","v":0},{"$f":"SUM(F94:F97)+(IF(F73=\"Endothermic\",F98,0))","v":0}]
[]
[null,null,"Total heat required for charge material  (Btu/hr)",null,{"$f":"E91+E101+E74","v":0},{"$f":"F91+F101+F74","v":0}]
[]
[]
[null,null,"Load Charge Material 3",null,"Current","Modified"]
[null,null,"Solid"]
[null,null,"Name of the Material (Choose From  List) or \"Other\"\nIf not on list then enter material and thermal properties in boxes",null,"Stainless Steel - 410",{"$f":"E108","v":"Stainless Steel - 410"}]
[null,null,null,null,null,null,null,null,null,null,"Name of Matl"]
[null,null,"Average specific heat of the solid material (dry)","Btu/(lb-F)",{"$f":"IF(E$108=\"Other\",K114,VLOOKUP($E$108,$O$5:$AA$100,5,))","v":0.12},{"$f":"E110","v":0.12},null,null,null,null,0]
[null,null,"Latent Heat of Fusion","Btu/lb",{"$f":"IF(E$108=\"Other\",K115,VLOOKUP($E$108,$O$5:$AA$100,6,))","v":48},{"$f":"E111","v":48},null,null,null,null,0]
[null,null,"Specific heat of liquid from molten material","Btu/(lb-F)",{"$f":"IF(E$108=\"Other\",K116,VLOOKUP($E$108,$O$5:$AA$100,7,))","v":0},0,null,null,null,null,0]
[null,null,"Melting Point","deg. F.",{"$f":"IF(E$108=\"Other\",K117,VLOOKUP($E$108,$O$5:$AA$100,8,))","v":2800.0039999999999},{"$f":"E113","v":2800.0039999999999},null,null,null,null,0]
[null,null,null,null,null,null,null,null,null,null,{"$f":"VALUE(K110)","v":0}]
[null,null,"Charge (wet)-Feed Rate","lb/hr",null,null,null,null,{"$f":"E115*L126","v":0},{"$f":"F115*L126","v":0},{"$f":"VALUE(K111)","v":0}]
[null,null,"Water Content as Charged (%)","%",null,null,null,null,null,null,0]
[null,null,"Water Content as Discharged (%)","%",null,null,null,null,null,null,0]
[null,null,"Initial Temperature","deg. F."]
[null,null,"Charge material discharge temperature","deg. F."]
[null,null,"Water vapor discharge Temperature","deg. F."]
[null,null,"Charge Melted (% of Dry Charge)","%",null,null,{"$f":"IF(OR(AND(E119<E113, E121>0),AND(F119<F113, F121>0)), $I$25,IF(OR(AND(E119>E113,E121<=0),AND(F119>F113,F121<=0)), $I$19,\"\"))","v":""}]
[null,null,"Charge Reacted (% of Dry Charge)","%"]
[null,null,"Heat of Reaction","Btu/lb"]
[null,null,"Endothermic/Exothermic",null,"Exothermic","Exothermic"]
[null,null,"Additional Heat Required","Btu/hr"]
[null,null,"Total Heat Required For Charge Material 3","Btu/hr",{"$f":"E154","v":0},{"$f":"F154","v":0},null,null,null,null,null,{"$f":"IF('Control page'!$D$11>2,1,0)","v":1},"Control"]
[]
[]
[]
[]
[null,null,"Calculations "]
[null,null,"Weight of water for charged wet material (Btu/hr)",null,{"$f":"E115*E116","v":0},{"$f":"F115*F116","v":0}]
[null,null,"Weight of solid dry material as charged  (Btu/hr)",null,{"$f":"E115-E132","v":0},{"$f":"F115-F132","v":0}]
[null,null,"Weight of water for discharged wet material  (Btu/hr)",null,{"$f":"E133*E117/(1-E117)","v":0},{"$f":"F133*F117/(1-F117)","v":0}]
[null,null,"Total weight of wet material at discharge  (Btu/hr)",null,{"$f":"E133+E134","v":0},{"$f":"F133+F134","v":0}]
[]
[null,null,"Water - Moisture heat requirement"]
[null,null,"Heating all water to boiling point (Btu/hr)",null,{"$f":"$G$37*E132*(212-E118)","v":0},{"$f":"$G$37*F132*(212-F118)","v":0}]
[null,null,"Heat required for vaporization for water removed (Btu/hr)",null,{"$f":"IF(E120>212,$G$38*(E132-E134),0)","v":0},{"$f":"IF(F120>212,$G$38*(F132-F134),0)","v":0}]
[null,null,"Heat for vapor superheat (to product final temp.) (Btu/hr)",null,{"$f":"  IF(E120>212, $G$39*(E132-E134)*(E120-212),0)","v":0},{"$f":"  IF(F120>212, $G$39*(F132-F134)*(F120-212),0)","v":0}]
[null,null,"Heat required to bring retained water to water discharge temp. (Btu/hr)",null,{"$f":"$G$37*E134*(E120-212)","v":0},{"$f":"$G$37*F134*(F120-212)","v":0}]
[null,null,"Total heat for the water related thermal load (kJ/hr) ",null,{"$f":"SUM(E138:E141)","v":0},{"$f":"SUM(F138:F141)","v":0}]
[]
[null,null,"Solid load heat requirement"]
[null,null,"Heat required for solid material up to melting point  (Btu/hr)",null,{"$f":"IF(E121<=0, E110*E133*(E119-E118), E110*E133*(E113-E118))","v":0},{"$f":"IF(F121<=0, F110*F133*(F119-F118), F110*F133*(F113-F118))","v":0}]
[null,null,"Heat required for melting  (Btu/hr)",null,{"$f":"IF(E121>0, E133*E111*E121,0)","v":0},{"$f":"IF(F121>0, F133*F111*F121,0)","v":0}]
[null,null,"Heat required for superheating molten material (Btu/hr)",null,{"$f":"IF(E121>0, E112*E133*(E119-E113)*E121,0)","v":0},{"$f":"IF(F121>0, F112*F133*(F119-F113)*F121,0)","v":0}]
[null,null,"Heat required for heating unmelted solid material(Btu/hr)",null,{"$f":"  IF(E121>0, (1-E121)*E110*E133*(E119-E113), 0)","v":0},{"$f":"  IF(F121>0, (1-F121)*F110*F133*(F119-F113), 0)","v":0}]
[null,null,"Heat for reaction during heating  (Btu/hr)",null,{"$f":"IF(E124=\"Endothermic\",1,-1)*E122*E133*E123","v":0},{"$f":"IF(F124=\"Endothermic\",1,-1)*F122*F133*F123","v":0},null,null,null,null,{"$f":"(IF(E149<0,-1,0))*E149*$L$126","v":0},{"$f":"(IF(F149<0,-1,0))*F149*$L$126","v":0}]
[null,null,"Heat required for cooling the molten material  (Btu/hr)",null,0,0]
[null,null,"Heat required for cooling the remaining solid material (Btu/hr)",null,0,0]
[null,null,"Heat required for solid-dry material (Btu/hr)",null,{"$f":"SUM(E145:E148)+(IF(E124=\"Endothermic\",E149,0))","v":0},{"$f":"SUM(F145:F148)+(IF(F124=\"Endothermic\",F149,0))","v":0}]
[]
[null,null,"Total heat required for charge material  (Btu/hr)",null,{"$f":"E142+E152+E125","v":0},{"$f":"F142+F152+F125","v":0}]
[null,null,null,null,null,null,null,null,null,null,null,null,null,null,"Other"]
[null,null,"Total Heat For All Charge Material (Btu/hr)",null,{"$f":"(E24*L24)+(E75*L75)+(E126*L126)","v":0},{"$f":"(F24*L24)+(F75*L75)+(F126*L126)","v":0},null,null,{"$f":"I115+I64+I13","v":0},{"$f":"J115+J64+J13","v":0},{"$f":"K149+K98+K98","v":0},{"$f":"L149+L98+L98","v":0}]
[null,null,null,null,null,null,null,null,{"$f":"ROUND(E126-F126,0)","v":0}]
[null,null,"NOTES:"]
[null,null,"Enter notes here on proposed changes for the \"Modified\" conditions."]
[null,null,null,null,null,null,null,null,{"$f":"IF(C160=\"\",0,1)","v":0}]
[null,null,null,null,null,null,null,null,{"$f":"IF(C161=\"\",0,1)","v":0}]
[null,null,null,null,null,null,null,null,{"$f":"IF(C162=\"\",0,1)","v":0}]
[null,null,null,null,null,null,null,null,{"$f":"IF(C163=\"\",0,1)","v":0}]
[null,null,null,null,null,null,null,null,{"$f":"IF(C164=\"\",0,1)","v":0}]
[null,null,null,null,null,null,null,null,{"$f":"SUM(I160:I164)","v":0}]

{"sheet":"Load Charge Liquid-1","index":9,"n_rows":129,"n_cols":36,"rows_kept":129,"cut":false,"hidden":false,"merged":[[4,2,4,3],[3,2,3,3],[42,2,42,3],[43,2,43,3],[81,2,81,3],[123,2,123,5],[124,2,124,5],[125,2,125,5],[126,2,126,5],[127,2,127,5],[14,6,18,7],[53,6,57,7],[92,6,96,7],[122,2,122,5],[5,2,6,3],[44,2,45,3],[83,2,84,3],[82,2,82,3],[119,2,119,3],[121,2,121,5]]}
[]
[null,null,"Number of charge materials - liquid",{"$f":"'Control page'!D12","v":3},"from control sheet "]
[null,null,null,null,null,null,null,null,null,null,null,null,null,"ID","Substance","MaterialType","Composition","Density (#s/ft^3)","MeanSpecific Heat of liquid (kJ/(kg oC# F) ","LatentHeatOf Fusion Btu/lb. ","MeanSpecific Heat Of Vapor (Btu/(lb. 0F)  ","Boiling Point (Deg. F.)","Average Pouring Temp (Deg. F)","HtContentOf Solid At MeltingPoint  (Btu/lb.)","HtContentOf LiquidAt MeltingTemp (Btu/lb.)","HtContentOf LiquidAt PouringTemp  (Btu/lb.)","Change"]
[null,null,"Load Charge Material 1",null,"Current","Modified",null,null,null,null,null,null,null,null,null,null,null,{"$f":"16.02","v":16.02},4.1870000000000003,2.3260000000000001,{"$f":"S4","v":4.1870000000000003},"C=(F-32)/1.8","C=(F-32)/1.8",2.3260000000000001,{"$f":"X4","v":2.3260000000000001},{"$f":"Y4","v":2.3260000000000001}]
[null,null,"Liquid",null,null,null,null,null,null,null,null,null,null,41,"Crude","Liquid",null,{"$f":"AB5/$R$4","v":0},{"$f":"AC5/$S$4","v":0.65010747551946502},{"$f":"AD5/$T$4","v":0},{"$f":"AE5/$U$4","v":0},{"$f":"AF5*1.8+32","v":899.99600000000009},{"$f":"AG5*1.8+32","v":-4.0000000000048885E-3},{"$f":"AH5/$X$4","v":0},{"$f":"AI5/$Y$4","v":0},{"$f":"AJ5/$Z$4","v":0},false,0,2.722,0,0,482.22,-17.78,0,0,{"$f":"AT5/$Z$4","v":0}]
[null,null,"Name of the Material (Choose from List) or \"Other\" if not on list then Enter Thermal Properties In Boxes",null,"Carbon tetrachloride",{"$f":"E6","v":"Carbon tetrachloride"},null,null,"Copy Current to Modified",null,null,null,null,42,"Water - std. atms. pressure","Liquid",null,{"$f":"AB6/$R$4","v":0},{"$f":"AC6/$S$4","v":1},{"$f":"AD6/$T$4","v":970.30008598452287},{"$f":"AE6/$U$4","v":0.47002627179364698},{"$f":"AF6*1.8+32","v":212},{"$f":"AG6*1.8+32","v":-4.0000000000048885E-3},{"$f":"AH6/$X$4","v":0},{"$f":"AI6/$Y$4","v":0},{"$f":"AJ6/$Z$4","v":0},false,0,4.1870000000000003,2256.9180000000001,1.968,100,-17.78,0,0,0]
[null,null,null,null,null,null,null,null,"Done Entering Data",null,"Enter Matl Here ",null,null,43,"Water - 150 psig","Liquid",null,0,1.0499164079293049,868,0.540004776689754,365,-4.0000000000048885E-3,0,0,0,false,0,4.3959999999999999,2018.9680000000001,2.2610000000000001,185,-17.78,0,0,0]
[null,null,"Specific Heat of Liquid","Btu/(lb-F)",{"$f":"IF(E$6=\"Other\",K12,VLOOKUP($E6,$O$5:$AA$44,5,))","v":0.21495103893002149},{"$f":"E8","v":0.21495103893002149},null,null,"Print Sheet",null,"0",null,null,44,"Acetic Acid","Liquid",null,0,0.50991163123955086,174,0.40004776689754001,244.4,-4.0000000000048885E-3,0,0,0,false,0,2.1349999999999998,404.72399999999999,1.675,118,-17.78,0,0,0]
[null,null,"Vaporizing Temperature","deg. F.",{"$f":"IF(E$6=\"Other\",K13,VLOOKUP($E$6,$O$5:$AA$44,8,))","v":170.006},{"$f":"E9","v":170.006},null,null,null,null,"0",null,null,45,"Acetone","Liquid",null,0,0.34702651062813472,239,0.40004776689754001,129.99200000000002,-4.0000000000048885E-3,0,0,0,false,0,1.4530000000000001,555.91399999999999,1.675,54.44,-17.78,0,0,0]
[null,null,"Latent Heat of Vaporization","Btu/lb",{"$f":"IF(E$6=\"Other\",K14,VLOOKUP($E$6,$O$5:$AA$44,6,))","v":83.5},{"$f":"E10","v":83.5},null,null,null,null,0,null,null,46,"Alcohol- ethyl","Liquid",null,0,0.64795796513016479,369,0.44996417482684492,172.00400000000002,-4.0000000000048885E-3,0,0,0,false,0,2.7130000000000001,858.29399999999998,1.8839999999999999,77.78,-17.78,0,0,0]
[null,null,"Specific Heat of Vapor","Btu/(lb-F)",{"$f":"IF(E6=\"Other\",K15,VLOOKUP($E$6,$O$5:$AA$44,7,))","v":0.25005970862192495},{"$f":"E11","v":0.25005970862192495},null,null,null,null,0,null,null,47,"Alcohol - methyl","Liquid",null,0,0.60090757105326009,481,0.33006926200143294,150.99799999999999,-4.0000000000048885E-3,0,0,0,false,0,2.516,1118.806,1.3819999999999999,66.11,-17.78,0,0,0]
[null,null,null,null,null,null,null,null,null,null,{"$f":"VALUE(K8)","v":0},null,null,48,"Benzene","Liquid",null,0,0.42297587771674222,170,0.33006926200143294,176,-4.0000000000048885E-3,0,0,0,false,0,1.7709999999999999,395.42,1.3819999999999999,80,-17.78,0,0,0]
[null,null,"Charge (Liquid)-Feed Rate","lb/hr",null,null,null,null,{"$f":"E13*L21","v":0},{"$f":"F13*L21","v":0},{"$f":"VALUE(K9)","v":0},null,null,49,"Bromine","Liquid",null,0,0.10699785048961069,82,5.493193217100549E-2,141.99799999999999,-4.0000000000048885E-3,0,0,0,false,0,0.44800000000000001,190.732,0.23,61.11,-17.78,0,0,0]
[null,null,"Initial Temperature","deg. F.",null,null,null,null,null,null,0,null,null,50,"Carbon tetrachloride","Liquid",null,0,0.21495103893002149,83.5,0.25005970862192495,170.006,-4.0000000000048885E-3,0,0,0,false,0,0.9,194.221,1.0469999999999999,76.67,-17.78,0,0,0]
[null,null,"Discharge Temperature","deg. F.",null,null,{"$f":"IF(OR(AND(E15<E9,E16>0), AND(F15<F9,F16>0)), $I$22, IF(OR(AND(E15>E9,E16<=0),AND(F15>F9,F16<=0)),$I$16,\"\"))","v":""},null,null,null,0,null,null,51,"Fuel oil no. 2 (average)","Liquid",null,0,0.57009792213995703,104.99999999999999,0.55003582517315497,375.00800000000004,-4.0000000000048885E-3,0,0,0,false,0,2.387,244.23,2.3029999999999999,190.56,-17.78,0,0,0]
[null,null,"Charge Liquid Vaporized  (% of Charge)","%",null,null,null,null,"Notice: The discharge temperature is higher than the vaporizing temperature, please enter proper percentage for charge liquid vaporized (>0% and <=100%).",null,null,null,null,52,"Fuel oil no. 6 (average)","Liquid",null,0,0.57989013613565799,108,0.55003582517315497,600.00800000000004,-4.0000000000048885E-3,0,0,0,false,0,2.4279999999999999,251.208,2.3029999999999999,315.56,-17.78,0,0,0]
[null,null,"Charge Liquid Reacted (% of Charge)","%",null,null,null,null,null,null,null,null,null,53,"Kerosene","Liquid",null,0,0.57009792213995703,260,0.62001433006926199,260.00599999999997,-4.0000000000048885E-3,0,0,0,false,0,2.387,604.76,2.5960000000000001,126.67,-17.78,0,0,0]
[null,null,"Heat of Reaction","Btu/lb",null,null,null,null,null,null,null,null,null,54,"Methanol","Liquid",null,0,0,0,0,32,32,0,0,0,false,null,null,null,null,null,null,null,null,0]
[null,null,"Type of Reaction (Endothermic/Exothermic)",null,"Exothermic","Exothermic",null,null,null,null,null,null,null,null,"Other"]
[null,null,"Additional Heat Required ","%"]
[null,null,"Total Heat Required For Charge Material 1","Btu/hr",{"$f":"E40","v":0},{"$f":"F40","v":0},null,null,null,null,null,{"$f":"IF('Control page'!$D$12=0,0,1)","v":1},"Control"]
[null,null,null,null,null,null,null,null,"Warning: The discharge temperature is lower than the vaporizing temperature, the percentage for charge liquid vaporized should be 0%."]
[null,null,null,null,null,null,null,null,{"$f":"I21*1.055","v":0}]
[]
[null,null,"Calculations "]
[null,null,"Weight of liquid vaporized",null,{"$f":"E13*E16","v":0},{"$f":"F13*F16","v":0},null,"lb./hr"]
[null,null,"Total weight of liquid at discharge",null,{"$f":"E13-E26","v":0},{"$f":"F13-F26","v":0},null,"lb./hr"]
[]
[null,null,"Vapor heat requirement"]
[null,null,"Heating liquid to vaporizing temperature",null,{"$f":"E26*E8*(E9-E14)","v":0},{"$f":"F26*F8*(F9-F14)","v":0},null,"Btu/hr"]
[null,null,"Heat required for vaporization of liquid",null,{"$f":"IF(E15>E9,E26*E10,0)","v":0},{"$f":"IF(F15>F9,F26*F10,0)","v":0},null,"Btu/hr"]
[null,null,"Heat for vapor superheat (to liquid discharge temp) ",null,{"$f":"IF(E15>E9, E11*E26*(E15-E9), 0)","v":0},{"$f":"IF(F15>F9, F11*F26*(F15-F9), 0)","v":0},null,"Btu/hr"]
[null,null,"Total heat for the vapor related thermal load",null,{"$f":"SUM(E30:E32)","v":0},{"$f":"SUM(F30:F32)","v":0},null,"Btu/hr"]
[]
[null,null,"Liquid heat requirement"]
[null,null,"Heating of liquid to discharge temperature",null,{"$f":"E8*E27*(E15-E14)","v":0},{"$f":"F8*F27*(F15-F14)","v":0},null,"Btu/hr"]
[null,null,"Heat of reaction for liquid",null,{"$f":"IF(E19=\"Endothermic\",1,-1)*E17*E13*E18","v":0},{"$f":"IF(F19=\"Endothermic\",1,-1)*F17*F13*F18","v":0},null,"Btu/hr",null,null,{"$f":"IF(E37<0,-1,0)*E37*L21","v":0},{"$f":"IF(F37<0,-1,0)*F37*L21","v":0}]
[null,null,"Total heat for liquid related thermal load",null,{"$f":"E36+(IF(E19=\"Endothermic\",E37,0))","v":0},{"$f":"F36+(IF(F19=\"Endothermic\",F37,0))","v":0},null,"Btu/hr"]
[]
[null,null,"Total heat required for liquid heating",null,{"$f":"E33+E38+E20","v":0},{"$f":"F33+F38+F20","v":0},null,"Btu/hr"]
[]
[]
[null,null,"Load Charge Material 2",null,"Current","Modified"]
[null,null,"Liquid"]
[null,null,"Name of the Material (Choose from List) or \"Other\" if not on list then Enter Thermal Properties In Boxes",null,"Alcohol - methyl",{"$f":"E45","v":"Alcohol - methyl"}]
[null,null,null,null,null,null,null,null,null,null,"Enter Matl Here"]
[null,null,"Specific Heat of Liquid","Btu/(lb-F)",{"$f":"IF(E45=\"Other\",K51,VLOOKUP(E45,$O$5:$AA$44,5,))","v":0.60090757105326009},{"$f":"E47","v":0.60090757105326009},null,null,null,null,0]
[null,null,"Vaporizing Temperature","F",{"$f":"IF(E45=\"Other\",K52,VLOOKUP(E45,$O$5:$AA$44,8,))","v":150.99799999999999},{"$f":"E48","v":150.99799999999999},null,null,null,null,0]
[null,null,"Latent Heat of Vaporization","Btu/lb",{"$f":"IF(E45=\"Other\",K53,VLOOKUP(E45,$O$5:$AA$44,6,))","v":481},{"$f":"E49","v":481},null,null,null,null,0]
[null,null,"Specific Heat of Vapor","Btu/(lb-F)",{"$f":"IF(E45=\"Other\",K54,VLOOKUP(E45,$O$5:$AA$44,7,))","v":0.33006926200143294},{"$f":"E50","v":0.33006926200143294},null,null,null,null,0]
[null,null,null,null,null,null,null,null,null,null,{"$f":"VALUE(K47)","v":0}]
[null,null,"Charge (Liquid)-Feed Rate","lb/hr",null,null,null,null,{"$f":"E52*L60","v":0},{"$f":"F52*L60","v":0},{"$f":"VALUE(K48)","v":0}]
[null,null,"Initial Temperature","deg. F.",null,null,null,null,null,null,0]
[null,null,"Discharge Temperature","deg. F.",null,null,{"$f":"IF(OR(AND(E54<E48,E55>0), AND(F54<F48,F55>0)), $I$22, IF(OR(AND(E54>E48,E55<=0),AND(F54>F48,F55<=0)),$I$16,\"\"))","v":""},null,null,null,0]
[null,null,"Charge Liquid Vaporized  (% of Charge)","%"]
[null,null,"Charge Liquid Reacted (% of Charge)","%"]
[null,null,"Heat of Reaction","Btu/lb"]
[null,null,"Type of Reaction (Endothermic/Exothermic)",null,"Endothermic","Endothermic"]
[null,null,"Additional Heat Required ","%"]
[null,null,"Total Heat Required For Charge Material 2","Btu/hr",{"$f":"E79","v":0},{"$f":"F79","v":0},null,null,null,null,null,{"$f":"IF('Control page'!$D$12>1,1,0)","v":1},"Control"]
[]
[]
[]
[null,null,"Calculations "]
[null,null,"Weight of liquid vaporized",null,{"$f":"E52*E55","v":0},{"$f":"F52*F55","v":0},null,"lb./hr"]
[null,null,"Total weight of liquid at discharge",null,{"$f":"E52-E65","v":0},{"$f":"F52-F65","v":0},null,"lb./hr"]
[]
[null,null,"Vapor heat requirement"]
[null,null,"Heating liquid to vaporizing temperature",null,{"$f":"E65*E47*(E48-E53)","v":0},{"$f":"F65*F47*(F48-F53)","v":0},null,"Btu/hr"]
[null,null,"Heat required for vaporization of liquid",null,{"$f":"IF(E54>E48,E65*E49,0)","v":0},{"$f":"IF(F54>F48,F65*F49,0)","v":0},null,"Btu/hr"]
[null,null,"Heat for vapor superheat (to liquid discharge temp) ",null,{"$f":"IF(E54>E48, E50*E65*(E54-E48), 0)","v":0},{"$f":"IF(F54>F48, F50*F65*(F54-F48), 0)","v":0},null,"Btu/hr"]
[null,null,"Total heat for the vapor related thermal load",null,{"$f":"SUM(E69:E71)","v":0},{"$f":"SUM(F69:F71)","v":0},null,"Btu/hr"]
[]
[null,null,"Liquid heat requirement"]
[null,null,"Heating of liquid to discharge temperature",null,{"$f":"E47*E66*(E54-E53)","v":0},{"$f":"F47*F66*(F54-F53)","v":0},null,"Btu/hr"]
[null,null,"Heat of reaction for liquid",null,{"$f":"IF(E58=\"Endothermic\",1,-1)*E56*E52*E57","v":0},{"$f":"IF(F58=\"Endothermic\",1,-1)*F56*F52*F57","v":0},null,"Btu/hr",null,null,{"$f":"IF(E76<0,-1,0)*E76*L60","v":0},{"$f":"IF(F76<0,-1,0)*F76*L60","v":0}]
[null,null,"Total heat for liquid related thermal load",null,{"$f":"E75+(IF(E58=\"Endothermic\",E76,0))","v":0},{"$f":"F75+(IF(F58=\"Endothermic\",F76,0))","v":0},null,"Btu/hr"]
[]
[null,null,"Total heat required for liquid heating",null,{"$f":"E72+E77+E59","v":0},{"$f":"F72+F77+F59","v":0},null,"Btu/hr"]
[]
[]
[null,null,"Load Charge Material 3",null,"Current","Modified"]
[null,null,"Liquid"]
[null,null,"Name of the Material (Choose from List) or \"Other\" if not on list then Enter Thermal Properties In Boxes",null,"Carbon tetrachloride",{"$f":"E84","v":"Carbon tetrachloride"}]
[null,null,null,null,null,null,null,null,null,null,"Enter Matl Here"]
[null,null,"Specific Heat of Liquid","Btu/(lb-F)",{"$f":"IF(E84=\"Other\",K90,VLOOKUP(E84,$O$5:$AA$44,5,))","v":0.21495103893002149},{"$f":"E86","v":0.21495103893002149},null,null,null,null,0]
[null,null,"Vaporizing Temperature","deg. F.",{"$f":"IF(E84=\"Other\",K91,VLOOKUP(E84,$O$5:$AA$44,8,))","v":170.006},{"$f":"E87","v":170.006},null,null,null,null,0]
[null,null,"Latent Heat of Vaporization","Btu/lb",{"$f":"IF(E84=\"Other\",K92,VLOOKUP(E84,$O$5:$AA$44,6,))","v":83.5},{"$f":"E88","v":83.5},null,null,null,null,0]
[null,null,"Specific Heat of Vapor","Btu/(lb-F)",{"$f":"IF(E84=\"Other\",K93,VLOOKUP(E84,$O$5:$AA$44,7,))","v":0.25005970862192495},{"$f":"E89","v":0.25005970862192495},null,null,null,null,0]
[null,null,null,null,null,null,null,null,null,null,{"$f":"VALUE(K86)","v":0}]
[null,null,"Charge (Liquid)-Feed Rate","lb/hr",null,null,null,null,{"$f":"E91*L99","v":0},{"$f":"F91*L99","v":0},{"$f":"VALUE(K87)","v":0}]
[null,null,"Initial Temperature","deg. F.",null,null,null,null,null,null,0]
[null,null,"Discharge Temperature","deg. F.",null,null,{"$f":"IF(OR(AND(E93<E87,E94>0), AND(F93<F87,F94>0)), $I$22, IF(OR(AND(E93>E87,E94<=0),AND(F93>F87,F94<=0)),$I$16,\"\"))","v":""},null,null,null,0]
[null,null,"Charge Liquid Vaporized  (% of Charge)","%"]
[null,null,"Charge Liquid Reacted (% of Charge)","%"]
[null,null,"Heat of Reaction","Btu/lb"]
[null,null,"Type of Reaction (Endothermic/Exothermic)",null,"Exothermic","Exothermic"]
[null,null,"Additional Heat Required ","%"]
[null,null,"Total Heat Required For Charge Material 3","Btu/hr",{"$f":"E118","v":0},{"$f":"F118","v":0},null,null,null,null,null,{"$f":"IF('Control page'!$D$12>2,1,0)","v":1},"Control"]
[]
[]
[]
[null,null,"Calculations "]
[null,null,"Weight of liquid vaporized",null,{"$f":"E91*E94","v":0},{"$f":"F91*F94","v":0},null,"lb./hr"]
[null,null,"Total weight of liquid at discharge",null,{"$f":"E91-E104","v":0},{"$f":"F91-F104","v":0},null,"lb./hr"]
[]
[null,null,"Vapor heat requirement"]
[null,null,"Heating liquid to vaporizing temperature",null,{"$f":"E104*E86*(E87-E92)","v":0},{"$f":"F104*F86*(F87-F92)","v":0},null,"Btu/hr"]
[null,null,"Heat required for vaporization of liquid",null,{"$f":"IF(E93>E87,E104*E88,0)","v":0},{"$f":"IF(F93>F87,F104*F88,0)","v":0},null,"Btu/hr"]
[null,null,"Heat for vapor superheat (to liquid discharge temp) ",null,{"$f":"IF(E93>E87, E89*E104*(E93-E87), 0)","v":0},{"$f":"IF(F93>F87, F89*F104*(F93-F87), 0)","v":0},null,"Btu/hr"]
[null,null,"Total heat for the vapor related thermal load",null,{"$f":"SUM(E108:E110)","v":0},{"$f":"SUM(F108:F110)","v":0},null,"Btu/hr"]
[]
[null,null,"Liquid heat requirement"]
[null,null,"Heating of liquid to discharge temperature",null,{"$f":"E86*E105*(E93-E92)","v":0},{"$f":"F86*F105*(F93-F92)","v":0},null,"Btu/hr"]
[null,null,"Heat of reaction for liquid",null,{"$f":"IF(E97=\"Endothermic\",1,-1)*E95*E91*E96","v":0},{"$f":"IF(F97=\"Endothermic\",1,-1)*F95*F91*F96","v":0},null,"Btu/hr",null,null,{"$f":"IF(E115<0,-1,0)*E115*L99","v":0},{"$f":"IF(F115<0,-1,0)*F115*L99","v":0}]
[null,null,"Total heat for liquid related thermal load",null,{"$f":"E114+(IF(E97=\"Endothermic\",E115,0))","v":0},{"$f":"F114+(IF(F97=\"Endothermic\",F115,0))","v":0},null,"Btu/hr"]
[]
[null,null,"Total heat required for liquid heating",null,{"$f":"E111+E116+E98","v":0},{"$f":"F111+F116+F98","v":0},null,"Btu/hr"]
[null,null,null,null,null,null,null,null,"Btu/hr"]
[null,null,"Total Heat For All Charge Material (Btu/hr)",null,{"$f":"(E21*L21)+(E60*L60)+(E99*L99)","v":0},{"$f":"(F21*L21)+(F60*L60)+(F99*L99)","v":0},null,null,{"$f":"I91+I52+I13","v":0},{"$f":"J91+J52+J13","v":0},{"$f":"K115+K76+K76","v":0},{"$f":"L115+L76+L76","v":0}]
[]
[null,null,"NOTES:"]
[null,null,"Enter notes here on proposed changes for the \"Modified\" conditions."]
[null,null,null,null,null,null,null,null,{"$f":"IF(C124=\"\",0,1)","v":0}]
[null,null,null,null,null,null,null,null,{"$f":"IF(C125=\"\",0,1)","v":0}]
[null,null,null,null,null,null,null,null,{"$f":"IF(C126=\"\",0,1)","v":0}]
[null,null,null,null,null,null,null,null,{"$f":"IF(C127=\"\",0,1)","v":0}]
[null,null,null,null,null,null,null,null,{"$f":"IF(C128=\"\",0,1)","v":0}]
[null,null,null,null,null,null,null,null,{"$f":"SUM(I124:I128)","v":0}]

{"sheet":"Load Charge Gas-1","index":10,"n_rows":114,"n_cols":37,"rows_kept":114,"cut":false,"hidden":false,"merged":[[112,2,112,5],[111,2,111,5],[110,2,110,5],[109,2,109,5],[108,2,108,5],[3,2,3,3],[4,2,4,3],[104,2,104,3],[106,2,106,5],[107,2,107,5],[73,2,74,3],[5,2,6,3],[39,2,40,3],[71,2,71,3],[72,2,72,3],[38,2,38,3],[37,2,37,3]]}
[]
[]
[null,null,null,null,null,null,null,null,null,null,null,null,null,"ID","Substance","MaterialType","Composition","Density (lb/cu.ft.)","MeanSpecific Heat of Gas (Btu/lb.0F) ","LatentHeatOf Fusion Btu/lb.","MeanSpecific Heat Of Vapor (Btu/lb.0F) ","Boiling Point (Deg. F.)","Average Pouring Temp (Deg. F)","HtContentOf Solid At MeltingPoint (Btu/lb.)","HtContentOf LiquidAt MeltingTemp (Btu/lb.)","HtContentOf LiquidAt PouringTemp  (Btu/lb.)","Change"]
[null,null,"Load Charge Material 1",null,"Current","Modified",null,null,null,null,null,null,null,null,null,null,null,{"$f":"16.02","v":16.02},4.1870000000000003,2.3260000000000001,{"$f":"S4","v":4.1870000000000003},"C=(F-32)/1.8","C=(F-32)/1.8",2.3260000000000001,{"$f":"X4","v":2.3260000000000001},{"$f":"Y4","v":2.3260000000000001}]
[null,null,"Gas",null,null,null,null,null,null,null,null,null,null,55,"Water vapor - near atm. pressure","Gas",null,{"$f":"AC5/$R$4","v":0},{"$f":"AD5/$S$4","v":0.47002627179364698},0,0,{"$f":"AG5*1.8+32","v":-4.0000000000048885E-3},{"$f":"AH5*1.8+32","v":-4.0000000000048885E-3},0,0,0,false,null,0,1.968,0,0,-17.78,-17.78,0,0,0]
[null,null,"Name of the Material (Choose from List) or \"Other\" if not on list then Enter Material  Name and Thermal Properties In Boxes",null,"Water vapor - near atm. pressure",{"$f":"E6","v":"Water vapor - near atm. pressure"},null,null,"Copy Current to Modified",null,null,null,null,56,"Steam - 50 psig, 400 degree F","Gas",null,0,{"$f":"AD6/$S$4","v":0.49008836876044898},0,0,{"$f":"AG6*1.8+32","v":-4.0000000000048885E-3},{"$f":"AH6*1.8+32","v":-4.0000000000048885E-3},0,0,0,false,null,0,2.052,0,0,-17.78,-17.78,0,0,0]
[null,null,null,null,null,null,null,null,"Done Entering Data",null,"Enter Matl Here",null,null,57,"Steam - 150 psig, 500 degree F","Gas",null,0,0.50991163123955086,0,0,-4.0000000000048885E-3,-4.0000000000048885E-3,0,0,0,false,null,0,2.1349999999999998,0,0,-17.78,-17.78,0,0,0]
[null,null,"Specific Heat of Gas","Btu/(lb-F)",{"$f":"IF(E6=\"Other\",K8,VLOOKUP(E6,$O$5:$AA$44,5,))","v":0.47002627179364698},{"$f":"E8","v":0.47002627179364698},null,null,"Print Sheet",null,0,null,null,58,"Steam - 600 psig, 700 degree F ","Gas",null,0,0.58992118461905896,0,0,-4.0000000000048885E-3,-4.0000000000048885E-3,0,0,0,false,null,0,2.4700000000000002,0,0,-17.78,-17.78,0,0,0]
[null,null,null,null,null,null,null,null,null,null,null,null,null,59,"Air - low pressure","Gas",null,0,0.24504418438022449,0,0,-4.0000000000048885E-3,-4.0000000000048885E-3,0,0,0,false,null,0,1.026,0,0,-17.78,-17.78,0,0,0]
[null,null,"Feed Rate for Gas Mixture","lb/hr",null,null,null,null,{"$f":"E10*L19","v":0},{"$f":"F10*L19","v":0},null,null,null,60,"Nitrogen - low pressure","Gas",null,0,0.25005970862192495,0,0,-4.0000000000048885E-3,-4.0000000000048885E-3,0,0,0,false,null,0,1.0469999999999999,0,0,-17.78,-17.78,0,0,0]
[null,null,"Vapor in Gas Mixture (% of Total)","%",null,null,null,null,null,null,null,null,null,61,"Oxygen - low pressure","Gas",null,0,0.22999761165512297,0,0,-4.0000000000048885E-3,-4.0000000000048885E-3,0,0,0,false,null,0,0.96299999999999997,0,0,-17.78,-17.78,0,0,0]
[null,null,"Initial Temperature","deg. F.",null,null,null,null,null,null,null,null,null,62,"Carbon dioxide - low pressure","Gas",null,0,0.24002866013852397,0,0,-4.0000000000048885E-3,-4.0000000000048885E-3,0,0,0,false,null,0,1.0049999999999999,0,0,-17.78,-17.78,0,0,0]
[null,null,"Discharge Temperature","deg. F.",null,null,null,null,null,null,null,null,null,63,"Carbon monoxide - low pressure","Gas",null,0,0.25005970862192495,0,0,-4.0000000000048885E-3,-4.0000000000048885E-3,0,0,0,false,null,0,1.0469999999999999,0,0,-17.78,-17.78,0,0,0]
[null,null,"Specific Heat of Vapor","Btu/(lb-F)",null,null,null,null,null,null,null,null,null,64,"Hydrogen - low pressure","Gas",null,0,14.445,0,0,-4.0000000000048885E-3,-4.0000000000048885E-3,0,0,0,false,null,0,14.445,0,0,-17.78,-17.78,0,0,0]
[null,null,"Feed Gas Reacted (% of Total)","%",null,null,null,null,null,null,null,null,null,null,"Other"]
[null,null,"Heat of Reaction","Btu/lb"]
[null,null,"Type of Reaction (Endothermic/Exothermic)",null,"Endothermic","Endothermic"]
[null,null,"Additional Heat Required","Btu/hr"]
[null,null,"Total Heat Required For Charge Material 1","Btu/hr",{"$f":"E35","v":0},{"$f":"F35","v":0},null,null,null,null,null,{"$f":"IF('Control page'!$D$13=0,0,1)","v":1},"Control"]
[]
[]
[]
[]
[null,null,"Calculations "]
[null,null,"Weight of vapor in gas mixture",null,{"$f":"ROUND(E11*E10,0)","v":0},{"$f":"ROUND(F11*F10,0)","v":0},"lb./hr."]
[null,null,"Weight of feed (total - vapor)  gas ",null,{"$f":"E10-E25","v":0},{"$f":"F10-F25","v":0},"lb./hr."]
[]
[null,null,"Vapor heat requirement"]
[null,null,"Heating vapor to discharge temperature",null,{"$f":"E14*E25*(E13-E12)","v":0},{"$f":"F14*F25*(F13-F12)","v":0},"Btu/hr."]
[null,null,"Heat required for reaction of gas mixture",null,{"$f":"IF(E17=\"Endothermic\",1,-1)*E15*E10*E16","v":0},{"$f":"IF(F17=\"Endothermic\",1,-1)*F15*F10*F16","v":0},"Btu/hr.",null,null,{"$f":"IF(E30<0,-1,0)*E30*L19","v":0},{"$f":"IF(F30<0,-1,0)*F30*L19","v":0}]
[null,null,"Heat for gas heating to discharge temp.",null,{"$f":"E8*E26*(E13-E12)","v":0},{"$f":"F8*F26*(F13-F12)","v":0},"Btu/hr."]
[null,null,"Total heat for the vapor related thermal load",null,{"$f":"E29+E31+(IF(E17=\"Endothermic\",E30,0))","v":0},{"$f":"F29+F31+(IF(F17=\"Endothermic\",F30,0))","v":0},"Btu/hr."]
[]
[]
[null,null,"Total heat required for gas mixture heating",null,{"$f":"E32+E18","v":0},{"$f":"F32+F18","v":0},"Btu/hr."]
[]
[]
[null,null,"Load Charge Material 2",null,"Current","Modified"]
[null,null,"Gas"]
[null,null,"Name of the Material (Choose from List) or \"Other\" if not on list then Enter Thermal Properties In Boxes",null,"Water vapor - near atm. pressure",{"$f":"E40","v":"Water vapor - near atm. pressure"}]
[null,null,null,null,null,null,null,null,null,null,"Enter Matl Name"]
[null,null,"Specific Heat of Gas","Btu/(lb-F)",{"$f":"IF(E40=\"Other\",K42,VLOOKUP(E40,$O$5:$AA$44,5,))","v":0.47002627179364698},{"$f":"E42","v":0.47002627179364698},null,null,null,null,0]
[]
[null,null,"Feed Rate for Gas Mixture","lb/hr",null,null,null,null,{"$f":"E44*L53","v":0},{"$f":"F44*L53","v":0}]
[null,null,"Vapor in Gas Mixture (% of Total)","%"]
[null,null,"Initial Temperature","deg. F."]
[null,null,"Discharge Temperature","deg. F."]
[null,null,"Specific Heat of Vapor","Btu/(lb-F)"]
[null,null,"Feed Gas Reacted (% of Total)","%"]
[null,null,"Heat of Reaction","Btu/lb"]
[null,null,"Type of Reaction (Endothermic/Exothermic)",null,"Endothermic","Endothermic"]
[null,null,"Additional Heat Required","Btu/hr"]
[null,null,"Total Heat Required For Charge Material 2","Btu/hr",{"$f":"E69","v":0},{"$f":"F69","v":0},null,null,null,null,null,{"$f":"IF('Control page'!$D$13>1,1,0)","v":1},"Control"]
[]
[]
[]
[]
[null,null,"Calculations "]
[null,null,"Weight of vapor in gas mixture",null,{"$f":"ROUND(E45*E44,0)","v":0},{"$f":"ROUND(F45*F44,0)","v":0},"lb./hr."]
[null,null,"Weight of feed (total - vapor)  gas ",null,{"$f":"E44-E59","v":0},{"$f":"F44-F59","v":0},"lb./hr."]
[]
[null,null,"Vapor heat requirement"]
[null,null,"Heating vapor to discharge temperature",null,{"$f":"E48*E59*(E47-E46)","v":0},{"$f":"F48*F59*(F47-F46)","v":0},"Btu/hr."]
[null,null,"Heat required for reaction of gas mixture",null,{"$f":"IF(E51=\"Endothermic\",1,-1)*E49*E44*E50","v":0},{"$f":"IF(F51=\"Endothermic\",1,-1)*F49*F44*F50","v":0},"Btu/hr.",null,null,{"$f":"IF(E64<0,-1,0)*E64*L53","v":0},{"$f":"IF(F64<0,-1,0)*F64*L53","v":0}]
[null,null,"Heat for gas heating to discharge temp.",null,{"$f":"E42*E60*(E47-E46)","v":0},{"$f":"F42*F60*(F47-F46)","v":0},"Btu/hr."]
[null,null,"Total heat for the vapor related thermal load",null,{"$f":"E63+E65+(IF(E51=\"Endothermic\",E64,0))","v":0},{"$f":"F63+F65+(IF(F51=\"Endothermic\",F64,0))","v":0},"Btu/hr."]
[]
[]
[null,null,"Total heat required for gas mixture heating",null,{"$f":"E66+E52","v":0},{"$f":"F66+F52","v":0},"Btu/hr."]
[]
[]
[null,null,"Load Charge Material 3",null,"Current","Modified"]
[null,null,"Gas"]
[null,null,"Name of the Material (Choose from List) or \"Other\" if not on list then Enter Thermal Properties In Boxes",null,"Water vapor - near atm. pressure",{"$f":"E74","v":"Water vapor - near atm. pressure"}]
[null,null,null,null,null,null,null,null,null,null,"Enter Matl Name"]
[null,null,"Specific Heat of Gas","Btu/(lb-F)",{"$f":"IF(E74=\"Other\",K76,VLOOKUP(E74,$O$5:$AA$44,5,))","v":0.47002627179364698},{"$f":"E76","v":0.47002627179364698},null,null,null,null,0]
[]
[null,null,"Feed Rate for Gas Mixture","lb/hr",null,null,null,null,{"$f":"E78*L87","v":0},{"$f":"F78*L87","v":0}]
[null,null,"Vapor in Gas Mixture (% of Total)","%"]
[null,null,"Initial Temperature","deg. F."]
[null,null,"Discharge Temperature","deg. F."]
[null,null,"Specific Heat of Vapor","Btu/(lb-F)"]
[null,null,"Feed Gas Reacted (% of Total)","%"]
[null,null,"Heat of Reaction","Btu/lb"]
[null,null,"Type of Reaction (Endothermic/Exothermic)",null,"Endothermic","Endothermic"]
[null,null,"Additional Heat Required","Btu/hr"]
[null,null,"Total Heat Required For Charge Material 3","Btu/hr",{"$f":"E103","v":0},{"$f":"F103","v":0},null,null,null,null,null,{"$f":"IF('Control page'!$D$13>2,1,0)","v":1},"Control"]
[]
[]
[]
[]
[null,null,"Calculations "]
[null,null,"Weight of vapor in gas mixture",null,{"$f":"ROUND(E79*E78,0)","v":0},{"$f":"ROUND(F79*F78,0)","v":0},"lb./hr."]
[null,null,"Weight of feed (total - vapor)  gas ",null,{"$f":"E78-E93","v":0},{"$f":"F78-F93","v":0},"lb./hr."]
[]
[null,null,"Vapor heat requirement"]
[null,null,"Heating vapor to discharge temperature",null,{"$f":"E82*E93*(E81-E80)","v":0},{"$f":"F82*F93*(F81-F80)","v":0},"Btu/hr."]
[null,null,"Heat required for reaction of gas mixture",null,{"$f":"IF(E85=\"Endothermic\",1,-1)*E83*E78*E84","v":0},{"$f":"IF(F85=\"Endothermic\",1,-1)*F83*F78*F84","v":0},"Btu/hr.",null,null,{"$f":"IF(E98<0,-1,0)*E98*L87","v":0},{"$f":"IF(F98<0,-1,0)*F98*L87","v":0}]
[null,null,"Heat for gas heating to discharge temp.",null,{"$f":"E76*E94*(E81-E80)","v":0},{"$f":"F76*F94*(F81-F80)","v":0},"Btu/hr."]
[null,null,"Total heat for the vapor related thermal load",null,{"$f":"E97+E99+(IF(E85=\"Endothermic\",E98,0))","v":0},{"$f":"F97+F99+(IF(F85=\"Endothermic\",F98,0))","v":0},"Btu/hr."]
[]
[]
[null,null,"Total heat required for gas mixture heating",null,{"$f":"E100+E86","v":0},{"$f":"F100+F86","v":0},"Btu/hr."]
[]
[null,null,"Total Heat For All Charge Material (Btu/hr) ",null,{"$f":"(E19*L19)+(E53*L53)+(E87*L87)","v":0},{"$f":"(F19*L19)+(F53*L53)+(F87*L87)","v":0}," ",null,{"$f":"I78+I44+I10","v":0},{"$f":"J78+J44+J10","v":0},{"$f":"J98+J64+J30","v":0},{"$f":"K98+K64+K30","v":0}]
[]
[null,null,"NOTES:"]
[null,null,"Enter notes here on proposed changes for the \"Modified\" conditions."]
[null,null,null,null,null,null,null,null,{"$f":"IF(C109=\"\",0,1)","v":0}]
[null,null,null,null,null,null,null,null,{"$f":"IF(C110=\"\",0,1)","v":0}]
[null,null,null,null,null,null,null,null,{"$f":"IF(C111=\"\",0,1)","v":0}]
[null,null,null,null,null,null,null,null,{"$f":"IF(C112=\"\",0,1)","v":0}]
[null,null,null,null,null,null,null,null,{"$f":"IF(C113=\"\",0,1)","v":0}]
[null,null,null,null,null,null,null,null,{"$f":"SUM(I109:I113)","v":0}]

{"sheet":"Fixture losses ","index":11,"n_rows":80,"n_cols":26,"rows_kept":80,"cut":false,"hidden":false,"merged":[[68,1,68,4],[69,1,69,4],[70,1,70,4],[71,1,71,4],[72,1,72,4],[67,1,67,4],[5,1,6,1],[5,2,6,2],[15,1,16,1],[15,2,16,2],[25,2,26,2],[55,1,56,1],[55,2,56,2],[1,3,1,4],[66,1,66,4],[25,1,26,1],[35,1,36,1],[35,2,36,2],[45,1,46,1],[45,2,46,2],[3,3,4,3],[3,4,4,4],[3,1,4,2]]}
[]
[null,"Number of fixture types ",{"$f":"'Control page'!D14","v":6},"from control sheet "]
[null,null,null,null,null,null,null,null,null,null,null,null,"ID","Substance","MaterialType","Composition","Density (#s/ft^3)","MeanSpecific Heat of solid (Btu/lb. 0F) ","LatentHeatof Fusion Btu/lb.","MeanSpecific Heat Of Liquid (Btu/lb 0F)","MeltingPoint (Deg. F.)","Average Pouring Temp (Deg. F)","HtContentOf Solid At MeltingPoint (Btu/lb.) ","HtContentOf LiquidAt MeltingTemp (Btu/lb.) ","HtContentOf LiquidAt PouringTemp (Btu/lb.)","Change"]
[null,"Fixtures, trays, conveyor etc. ",null,"Current ","Modified",null,null,null,null,null,null,null,null,null,null,"Conversion Factor ",16.02,4.1870000000000003,2.3260000000000001,4.1870000000000003,"C=(F-32)/1.8","C=(F-32)/1.8",2.3260000000000001,2.3260000000000001,2.3260000000000001]
[null,null,null,null,null,null,null,null,null,null,null,null,1,"Aluminum","Solid","Al",166.69975031210987,0.24791019823262478,169,0.26009075710532598,1214.9960000000001,1380.002,286,454.99999999999994,496.99999999999994,false]
[null,"Material Name",null,"Stainless Steel - 300 series","Stainless Steel - 300 series",null,null,"Copy Current to Modified",null,null,"Enter Matl Name",null,2,"Babbitt, lead  base","Solid","75 Pb,15 Sb,10 Sn",0,3.8930021495103891E-2,26.199914015477216,3.7974683544303799E-2,462.00200000000001,624.99199999999996,15.800085984522784,41.999999999999993,48,false]
[null,null,null,null,null,null,null,"Done Entering Data",null,null,0,null,3,"Babbitt, tin  base","Solid","83.3 Sn,8.4 Sb,8.3 Cu",462,7.0933842846907083E-2,34.100171969045569,6.3052304752806307E-2,464,915.99800000000005,28.600171969045572,67.699914015477205,91,false]
[null,"Specific heat ","Btu/(lb-F)",{"$f":"IF(D6=\"Other\",K7,VLOOKUP($D6,$N$5:$Z$45,5,))","v":0.13995700979221398},{"$f":"IF(E6=\"Other\",K9,VLOOKUP($E6,$N$5:$Z$45,5,))","v":0.13995700979221398},null,null,"Print Sheet",null,null,"Enter Matl Name",null,4,"Bismuth","Solid","Bi",612,3.2959159302603298E-2,18.5,3.5108669691903509E-2,518,620.00600000000009,15.10017196904557,33.600171969045569,37.199914015477212,false]
[null,"Fixture Weight feed rate ","lb/hr",null,null,null,null,null,null,null,0,null,5,"Brass, Muntz metal","Solid","60 Cu,40 Zn",524,0.10508717458801051,69,0.12491043706711248,1630.0039999999999,1850,165,234,261,false]
[null,"Initial Temperature","deg. F.",null,null,null,null,null,null,null,null,null,6,"Brass, red","Solid","90 Cu,10 Zn",546,0.10389300214951039,86.5,0.11511822307141149,1952.0060000000001,2249.9960000000001,196.99999999999997,283.5,317.80008598452275,false]
[null,"Final Temperature","deg. F.",null,null,null,null,null,null,{"$f":"IF($C$2>0,1,0)","v":1},"Control",null,7,"Brass,yellow","Solid","67 Cu,33 Zn",528,0.10508717458801051,70.999999999999986,0.1229997611655123,1688,1950.008,171,242.00000000000003,274.19991401547719,false]
[null,"Correction factor ",null,1,1,null,null,null,null,null,null,null,8,"Bronze,  bearing","Solid","80 Cu,10 Pb,10 Sn",556.00000000000011,9.5056126104609506E-2,79.899828030954424,0.10890852639121089,1832,2049.9979999999996,168.30008598452278,248.19991401547719,272,false]
[null,"Heat Required","Btu/hr",{"$f":"D9*D8*(D11-D10)*D12","v":0},{"$f":"E9*E8*(E11-E10)*E12","v":0},null,null,null,null,null,null,null,9,"Bronze, aluminum","Solid","90 Cu,10 Al",510,0.12610460950561261,98.600171969045562,0.12491043706711248,1922,2199.9920000000002,235,333.60017196904556,368,false]
[null,null,null,null,null,null,null,null,null,null,null,null,10,"Bronze, bell metal","Solid","78 Cu,22 Sn",540,0.10007165034630999,76.300085984522781,0.11893957487461189,1634,1900.0039999999999,157.39982803095444,233.69991401547722,265.39982803095444,false]
[null,null,null,"Current ","Modified",null,null,null,null,null,null,null,11,"Bronze, gun metal","Solid","90 Cu,1oSn",550,0.10699785048961069,84.199914015477205,0.1060425125388106,1850,2100.0020000000004,191.49999999999997,275.69991401547719,302,false]
[null,"Material ",null,"Stainless Steel - 410","Stainless Steel - 410",null,null,null,null,null,null,null,12,"Bronze, tobin","Solid","60 Cu,39.2 Zn,0.8 Sn",525,0.10699785048961069,73.5,0.12395509911631239,1625,1850,167.5,241,268.89982803095444,false]
[null,null,null,null,null,null,null,null,null,null,"Enter Matl Name",null,13,"Carbon Steel","Solid","1000 series",138,0.16,60,0.17497014568903749,2800.0039999999999,-4.0000000000048885E-3,0,0,0,false]
[null,"Specific heat ","Btu/(lb-F)",{"$f":"IF(D16=\"Other\",K18,VLOOKUP($D16,$N$5:$Z$45,5,))","v":0.12},{"$f":"IF(E16=\"Other\",K20,VLOOKUP($E16,$N$5:$Z$45,5,))","v":0.12},null,null,null,null,null,"0.248",null,14,"Copper","Solid","Cu",559,0.10389300214951039,91,0.1110580367805111,1981.9939999999999,2199.9920000000002,200,291,315,false]
[null,"Fixture Weight feed rate ","lb/hr",null,null,null,null,null,null,null,"Enter Matl Name",null,15,"Die casting metal","Solid","92 Al,8 Cu",176,0.23596847384762357,162.99999999999997,0.24098399808932405,1149.998,1400,257.30008598452281,420.30008598452281,481,false]
[null,"Initial Temperature","deg. F.",null,null,null,null,null,null,null,0,null,16,"Die casting metal","Solid","80 Pb,10 Sn,10 Sb",176,3.7974683544303799E-2,17.5,3.70193455935037E-2,600.00800000000004,820.00400000000002,20.5,38,146,false]
[null,"Final Temperature","deg. F.",null,null,null,null,null,null,{"$f":"IF($C$2>1,1,0)","v":1},"Control",null,17,"Die casting metal","Solid","90 Sn,4.5 Cu,5,5 Sb",176,6.9978504896106991E-2,30.199914015477216,6.2096966802006208E-2,449.99599999999998,649.99400000000003,27.600171969045569,57.800085984522788,70,false]
[null,"Correction factor ",null,1,1,null,null,null,null,null,null,null,18,"Die casting metal","Solid","87.3 Zn,8.1Sn,4.1Cu,0.5A",176,0.10293766419871028,48,0.1380463338906138,780.00800000000004,980.00599999999997,74,121.99999999999999,150,false]
[null,"Heat Required","Btu/hr",{"$f":"D19*D18*(D21-D20)*D22","v":0},{"$f":"E19*E18*(E21-E20)*E22","v":0},null,null,null,null,null,null,null,19,"German silver","Solid","60 Cu,25 Zn,1 5 Ni",540,0.10890852639121089,86.199914015477219,0.1229997611655123,1850,2100.0020000000004,194,280.19991401547719,311,false]
[null,null,null,null,null,null,null,null,null,null,null,null,20,"Gold","Solid","Au",1205,3.2959159302603298E-2,28.499999999999996,3.3914497253403383E-2,1945.0039999999999,2150.0060000000003,62.199914015477212,90.699914015477205,97.699914015477205,false]
[null,null,null,"Current ","Modified",null,null,null,null,null,null,null,21,"Inconel - 600","Solid","Inconel",480.00000000000006,0.13995700979221398,0,0,2499.998,-4.0000000000048885E-3,0,0,0,false]
[null,"Material ",null,"Babbitt, tin  base","Babbitt, tin  base",null,null,null,null,null,null,null,22,"Iron, cast, gray","Solid","94 Fe,3.5 C,2.5 Si",480.00000000000006,0.19011225220921901,41.399828030954431,0,2246,2800.0039999999999,415,455.99999999999994,583,false]
[null,null,null,null,null,null,null,null,null,null,"Enter Matl Name",null,23,"Iron, cast, white","Solid","97 Fe,3 C",480.00000000000006,0.18008120372581798,60.300085984522788,0,2102,2899.9940000000001,368,428,612,false]
[null,"Specific heat ","Btu/(lb-F)",{"$f":"IF(D26=\"Other\",K28,VLOOKUP($D26,$N$5:$Z$45,5,))","v":7.0933842846907083E-2},{"$f":"IF(E26=\"Other\",K30,VLOOKUP($E26,$N$5:$Z$45,5,))","v":7.0933842846907083E-2},null,null,null,null,null,0,null,24,"Iron, pig","Solid","93 Fe,4.22 C,1.48 Si,0.73 Mn,0.12P ,0.03 S",480.00000000000006,0.15309290661571531,83.600171969045576,0,2012,2300,299,384,450,false]
[null,"Fixture Weight feed rate ","lb/hr",0,0,null,null,null,null,null,"Enter Matl Name",null,25,"Iron, pure","Solid","Fe",491,0.16790064485311676,117,0.14998805827561498,2802.0020000000004,3099.9920000000002,451,567.99999999999989,626,false]
[null,"Initial Temperature","deg. F.",null,null,null,null,null,null,null,0,null,26,"Lead","Solid","Pb",708,3.2003821351803199E-2,10,3.3914497253403383E-2,620.99600000000009,719.99600000000009,18,28,30.999999999999996,false]
[null,"Final Temperature","deg. F.",null,null,null,null,null,null,{"$f":"IF($C$2>2,1,0)","v":1},"Control",null,27,"Linotype","Solid","86 pb,11 sb,3sn",700,3.6064007642703601E-2,21.5,3.6064007642703601E-2,485.99599999999998,620.00600000000009,15.300085984522786,36.800085984522781,41.600171969045569,false]
[null,"Correction factor ",null,1,1,null,null,null,null,null,null,null,28,"Magnesium","Solid","Mg",108.59987515605494,0.27203248149032722,83.699914015477219,0.26606161929782662,1203.998,1380.002,311.19991401547719,394.89982803095444,441.69991401547719,false]
[null,"Heat Required","Btu/hr",{"$f":"D29*D28*(D31-D30)*D32","v":0},{"$f":"E29*E28*(E31-E30)*E32","v":0},null,null,null,null,null,null,null,29,"Manganese","Solid","Mn",464,0.17100549319321709,66,0.1920229281108192,2246,2400.0079999999998,374,440,469,false]
[null,null,null,null,null,null,null,null,null,null,null,null,30,"Monel metal","Solid","67 Ni,28 Cu; Fe, Mn, Si",550,0.1289706233580129,117.39982803095442,0.13900167184141388,2415.0020000000004,2750,304,421.39982803095444,468,false]
[null,null,null,"Current ","Modified",null,null,null,null,null,null,null,31,"Nickel 60 to 2644 F","Solid","Ni",556.00000000000011,0.13398614759971339,131.5,0.13303080964891331,2643.998,2850.0079999999998,346,477.49999999999994,505.00000000000006,false]
[null,"Material ",null,"Aluminum","Aluminum",null,null,null,null,null,null,null,32,"Silver","Solid","Ag",655,6.3052304752806307E-2,46.800085984522781,6.9978504896106991E-2,1761.998,1950.008,107,153.80008598452278,167,false]
[null,null,null,null,null,null,null,null,null,null,"Alloy",null,33,"solder, bismuth","Solid","40 pb,20 Sn,40 Bi",580,3.988535944590399E-2,16.399828030954428,3.8930021495103891E-2,231.99799999999999,330.00800000000004,9.3000859845227861,25.699914015477212,29.5,false]
[null,"Specific heat ","Btu/(lb-F)",{"$f":"IF(D36=\"Other\",K38,VLOOKUP($D36,$N$5:$Z$45,5,))","v":0.24791019823262478},{"$f":"IF(E36=\"Other\",K40,VLOOKUP($E36,$N$5:$Z$45,5,))","v":0.24791019823262478},null,null,null,null,null,"0.15",null,34,"Solder, plumbers","Solid","50 pb,50 Sn",580,5.1110580367805108E-2,23,4.8961069978504891E-2,413.99599999999998,500,18,41,45,false]
[null,"Fixture Weight feed rate ","lb/hr",0,0,null,null,null,null,null,"Alloy",null,35,"Stainless Steel - 300 series","Solid","310 and 304",480.00000000000006,0.13995700979221398,0,0,2550.0020000000004,-4.0000000000048885E-3,0,0,0,false]
[null,"Initial Temperature","deg. F.",null,null,null,null,null,null,null,"0.15",null,36,"Stainless Steel - 410","Solid","410 SS",480.00000000000006,0.12,48,0,2800.0039999999999,2800.0039999999999,750,126,141.99999999999997,false]
[null,"Final Temperature","deg. F.",null,null,null,null,null,null,{"$f":"IF($C$2>3,1,0)","v":1},"Control",null,37,"Tin","Solid","Sn",455.00000000000006,6.9023166945306899E-2,25,6.3768808215906372E-2,449.99599999999998,649.99400000000003,27,52,64,false]
[null,"Correction factor ",null,1,1,null,null,null,null,null,null,null,38,"Zinc","Solid","Zn",445,0.10699785048961069,48,0.14592787198471457,786.00199999999995,899.99600000000009,77.800085984522781,125.80008598452278,141.99999999999997,false]
[null,"Heat Required","Btu/hr",{"$f":"D39*D38*(D41-D40)*D42","v":0},{"$f":"E39*E38*(E41-E40)*E42","v":0},null,null,null,null,null,null,null,39,"Refractory","Solid",null,150,0.25005970862192495,0,0,5000,-4.0000000000048885E-3,0,0,0,false]
[null,null,null,null,null,null,null,null,null,null,null,null,40,"Ladle Refractory","Solid",null,150,0.25005970862192495,0,0,5000,-4.0000000000048885E-3,0,0,0,false]
[null,null,null,"Current ","Modified",null,null,null,null,null,null,null,null,"Other"]
[null,"Material ",null,"Aluminum","Aluminum"]
[null,null,null,null,null,null,null,null,null,null,"Enter Matl Name"]
[null,"Specific heat ","Btu/(lb-F)",{"$f":"IF(D46=\"Other\",K48,VLOOKUP($D46,$N$5:$Z$45,5,))","v":0.24791019823262478},{"$f":"IF(E46=\"Other\",K50,VLOOKUP($E46,$N$5:$Z$45,5,))","v":0.24791019823262478},null,null,null,null,null,0]
[null,"Fixture Weight feed rate ","lb/hr",0,0,null,null,null,null,null,"Enter Matl Name"]
[null,"Initial Temperature","deg. F.",null,null,null,null,null,null,null,0]
[null,"Final Temperature","deg. F.",null,null,null,null,null,null,{"$f":"IF($C$2>4,1,0)","v":1},"Control"]
[null,"Correction factor ",null,1,1]
[null,"Heat Required","Btu/hr",{"$f":"D49*D48*(D51-D50)*D52","v":0},{"$f":"E49*E48*(E51-E50)*E52","v":0}]
[]
[null,null,null,"Current ","Modified"]
[null,"Material ",null,"Tin","Tin"]
[null,null,null,null,null,null,null,null,null,null,"Enter Matl Name"]
[null,"Specific heat ","Btu/(lb-F)",{"$f":"IF(D56=\"Other\",K58,VLOOKUP($D56,$N$5:$Z$45,5,))","v":6.9023166945306899E-2},{"$f":"IF(E56=\"Other\",K60,VLOOKUP($E56,$N$5:$Z$45,5,))","v":6.9023166945306899E-2},null,null,null,null,null,0]
[null,"Fixture Weight feed rate ","lb/hr",0,0,null,null,null,null,null,"Enter Matl Name"]
[null,"Initial Temperature","deg. F.",null,null,null,null,null,null,null,0]
[null,"Final Temperature","deg. F.",null,null,null,null,null,null,{"$f":"IF($C$2>5,1,0)","v":1},"Control"]
[null,"Correction factor ",null,1,1]
[null,"Heat Required","Btu/hr",{"$f":"D59*D58*(D61-D60)*D62","v":0},{"$f":"E59*E58*(E61-E60)*E62","v":0}]
[]
[null,"Total Fixture Losses","Btu/hr",{"$f":"(D13*$J11)+(D23*$J21)+(D33*$J31)+(D43*$J41)+(D53*$J51)+(D63*$J61)","v":0},{"$f":"(E13*$J11)+(E23*$J21)+(E33*$J31)+(E43*$J41)+(E53*$J51)+(E63*$J61)","v":0}]
[]
[null,"NOTES:"]
[null,"Enter notes here on proposed changes for the \"Modified\" conditions."]
[null,null,null,null,null,null,null,null,{"$f":"IF(B69=\"\",0,1)","v":0}]
[null,null,null,null,null,null,null,null,{"$f":"IF(B70=\"\",0,1)","v":0}]
[null,null,null,null,null,null,null,null,{"$f":"IF(B71=\"\",0,1)","v":0}]
[null,null,null,null,null,null,null,null,{"$f":"IF(B72=\"\",0,1)","v":0}]
[null,null,null,null,null,null,null,null,{"$f":"IF(B73=\"\",0,1)","v":0}]
[null,null,null,null,null,null,null,null,{"$f":"SUM(I69:I73)","v":0}]
[]
[]
[]
[]
[]
[null,null,null,null,null,"`"]

{"sheet":"Wall losses","index":12,"n_rows":138,"n_cols":16,"rows_kept":138,"cut":false,"hidden":false,"merged":[[123,5,124,5],[51,5,52,5],[63,5,64,5],[75,5,76,5],[87,5,88,5],[99,5,100,5],[73,5,74,5],[85,5,86,5],[97,5,98,5],[109,5,110,5],[121,5,122,5],[111,5,112,5],[2,6,2,7],[6,11,6,13],[66,2,66,4],[6,0,15,0],[6,2,6,4],[7,1,7,2],[42,2,42,4],[31,1,31,2],[13,5,14,5],[25,5,26,5],[37,5,38,5],[49,5,50,5],[61,5,62,5],[15,5,16,5],[27,5,28,5],[39,5,40,5],[67,1,67,2],[19,1,19,2],[131,1,131,4],[114,2,114,4],[115,1,115,2],[102,2,102,4],[103,1,103,2],[130,1,130,4],[91,1,91,2],[79,1,79,2],[90,2,90,4],[55,1,55,2],[30,2,30,4],[78,2,78,4],[0,1,0,4],[18,2,18,4],[43,1,43,2],[54,2,54,4],[1,1,1,4],[4,3,4,4],[132,1,132,4],[133,1,133,4],[134,1,134,4],[135,1,135,4],[136,1,136,4]]}
[]
[null,{"$f":"'Control page'!C15","v":"Wall surface heat losses"}]
[null,null,null,null,null,null,"Table - Surface shape/orientation factor "]
[" ","Losses from the furnace wall surfaces ",null,null,null,null,null,null,"Print Sheet"]
[null,"Number of wall surfaces ",{"$f":"'Control page'!D15","v":10},"(from control sheet)",null,null,null,null,"Copy Current to Modified"]
[null,null,null,null,null,null,null,null,"Done Entering Data"]
[null,"Surface name or designation","Top roof ",null,null,null,"Values of C ","Surface description ",null,null,null,"Calculations "]
[null,null,null,"Current","Modified",null,1.016,"Horizontal cylinders"]
[null,"Average surface temperature (measured)","deg. F.",null,null,null,1.2350000000000001,"Longer vertical cylinders",null,null,null,{"$f":"D9","v":0},0,"Deg. F"]
[null,"Ambient Temperature","deg. F.",null,null,null,1.3939999999999999,"Vertical plates",null,null,null,0,0,"Deg. F"]
[null,"Wind velocity","miles/hr.",null,null,null,1.79,"Horizontal plate facing up, warmer than air",null,null,null,0,0,"mph"]
[null,"Surface shape/orientation (select using dropdown menu)",null,"Vertical plates","Vertical plates",null,0.89,"Horizontal plate facing down, warmer than air"]
[null,"Surface shape/orientation factor ",null,{"$f":"INDEX($G$8:$G$14,MATCH(D12,$H$8:$H$14,0))","v":1.3939999999999999},{"$f":"INDEX($G$8:$G$14,MATCH(E12,$H$8:$H$14,0))","v":1.3939999999999999},null,0.89,"Horizontal plate facing up, cooler than air",null,null,null,1.3939999999999999,1.3939999999999999]
[null,"Surface emissivity (Typical - 0.9)",null,null,null,{"$f":"IF(OR(D14>1,E14>1),\"Surface emmissivity cannot be greater than 1\",\"\")","v":""},1.79,"Horizontal plate facing down, cooler than air",null,null,null,{"$f":"IF(L9>L10,((L13*(1/24)^0.2*(1/((L10+L9)/2)^0.181*(L9-L10)^0.266*(1+1.277*L11)^0.5)*(L9-L10)) + 0.1713*10^-8*D14*(((L9+460)^4-(L10+460)^4))),0)","v":0},{"$f":"IF(M9>M10,((M13*(1/24)^0.2*(1/((M10+M9)/2)^0.181*(M9-M10)^0.266*(1+1.277*M11)^0.5)*(M9-M10)) + 0.1713*10^-8*E14*(((M9+460)^4-(M10+460)^4))),0)","v":0},"Btu/hr-ft^2"]
[null,"Total outside surface area","ft^2",null,null,null,null,null,null,null,null,{"$f":"L14*D15*D16","v":0},{"$f":"M14*E15*E16","v":0},"Btu/hr"]
[null,"Correction factor (based on local conditions)",null,1,1,{"$f":"IF(OR(D9<=D10,E9<=E10),\"Surface temperature lower than ambient temperature\",\" \")","v":"Surface temperature lower than ambient temperature"},null,null,null,null,null,{"$f":"L15","v":0},{"$f":"M15","v":0},"Btu/hr"," "]
[null,"Heat loss ","Btu/hr ",{"$f":"L16","v":0},{"$f":"M16","v":0}]
[]
[null,"Surface name or designation","Sides - North"]
[null,null,null,"Current","Modified"]
[null,"Average surface temperature (measured)","deg. F.",null,null,null,null,null,null,null,null,{"$f":"D21","v":0},0,"Deg. F"]
[null,"Ambient Temperature","deg. F.",null,null,null,null,null,null,null,null,0,0,"Deg. F"]
[null,"Wind velocity","miles/hr.",null,null,null,null,null,null,null,null,0,0,"mph"]
[null,"Surface shape/orientation (select using dropdown menu)",null,"Horizontal plate facing down, warmer than air","Horizontal plate facing down, warmer than air"]
[null,"Surface shape/orientation factor ",null,{"$f":"INDEX($G$8:$G$14,MATCH(D24,$H$8:$H$14,0))","v":0.89},{"$f":"INDEX($G$8:$G$14,MATCH(E24,$H$8:$H$14,0))","v":0.89},null,null,null,null,null,null,0.89,0.89]
[null,"Surface emissivity (Typical - 0.9)",null,null,null,{"$f":"IF(OR(D26>1,E26>1),\"Surface emmissivity cannot be greater than 1\",\"\")","v":""},null,null,null,null,null,{"$f":"IF(L21>L22,((L25*(1/24)^0.2*(1/((L22+L21)/2)^0.181*(L21-L22)^0.266*(1+1.277*L23)^0.5)*(L21-L22)) + 0.1713*10^-8*D26*(((L21+460)^4-(L22+460)^4))),0)","v":0},{"$f":"IF(M21>M22,((M25*(1/24)^0.2*(1/((M22+M21)/2)^0.181*(M21-M22)^0.266*(1+1.277*M23)^0.5)*(M21-M22)) + 0.1713*10^-8*E26*(((M21+460)^4-(M22+460)^4))),0)","v":0},"Btu/hr-ft^2"]
[null,"Total outside surface area","ft^2",0,0,null,null,null,null,null,null,{"$f":"L26*D27*D28","v":0},{"$f":"M26*E27*E28","v":0},"Btu/hr"]
[null,"Correction factor (based on local conditions)",null,1,1,{"$f":"IF(OR(D21<=D22,E21<=E22),\"Surface temperature lower than ambient temperature\",\" \")","v":"Surface temperature lower than ambient temperature"},null,null,null,null,null,{"$f":"L27","v":0},{"$f":"M27","v":0},"Btu/hr",{"$f":"IF($C$5>1,1,0)","v":1},"Control"]
[null,"Heat loss ","Btu/hr ",{"$f":"L28","v":0},{"$f":"M28","v":0}]
[]
[null,"Surface name or designation","Sides - South"]
[null,null,null,"Current","Modified"]
[null,"Average surface temperature (measured)","deg. F.",null,null,null,null,null,null,null,null,{"$f":"D33","v":0},0,"Deg. F"]
[null,"Ambient Temperature","deg. F.",null,null,null,null,null,null,null,null,0,0,"Deg. F"]
[null,"Wind velocity","miles/hr.",null,null,null,null,null,null,null,null,0,0,"mph"]
[null,"Surface shape/orientation (select using dropdown menu)",null,"Longer vertical cylinders","Longer vertical cylinders"]
[null,"Surface shape/orientation factor ",null,{"$f":"INDEX($G$8:$G$14,MATCH(D36,$H$8:$H$14,0))","v":1.2350000000000001},{"$f":"INDEX($G$8:$G$14,MATCH(E36,$H$8:$H$14,0))","v":1.2350000000000001},null,null,null,null,null,null,1.2350000000000001,1.2350000000000001]
[null,"Surface emissivity (Typical - 0.9)",null,null,null,{"$f":"IF(OR(D38>1,E38>1),\"Surface emmissivity cannot be greater than 1\",\"\")","v":""},null,null,null,null,null,{"$f":"IF(L33>L34,((L37*(1/24)^0.2*(1/((L34+L33)/2)^0.181*(L33-L34)^0.266*(1+1.277*L35)^0.5)*(L33-L34)) + 0.1713*10^-8*D38*(((L33+460)^4-(L34+460)^4))),0)","v":0},{"$f":"IF(M33>M34,((M37*(1/24)^0.2*(1/((M34+M33)/2)^0.181*(M33-M34)^0.266*(1+1.277*M35)^0.5)*(M33-M34)) + 0.1713*10^-8*E38*(((M33+460)^4-(M34+460)^4))),0)","v":0},"Btu/hr-ft^2"]
[null,"Total outside surface area","ft^2",0,0,null,null,null,null,null,null,{"$f":"L38*D39*D40","v":0},{"$f":"M38*E39*E40","v":0},"Btu/hr"]
[null,"Correction factor (based on local conditions)",null,1,1,{"$f":"IF(OR(D33<=D34,E33<=E34),\"Surface temperature lower than ambient temperature\",\" \")","v":"Surface temperature lower than ambient temperature"},null,null,null,null,null,{"$f":"L39","v":0},{"$f":"M39","v":0},"Btu/hr",{"$f":"IF($C$5>2,1,0)","v":1},"Control"]
[null,"Heat loss ","Btu/hr ",{"$f":"L40","v":0},{"$f":"M40","v":0}]
[]
[null,"Surface name or designation","Ends "]
[null,null,null,"Current","Modified"]
[null,"Average surface temperature (measured)","deg. F.",null,null,null,null,null,null,null,null,{"$f":"D45","v":0},0,"Deg. F"]
[null,"Ambient Temperature","deg. F.",null,null,null,null,null,null,null,null,0,0,"Deg. F"]
[null,"Wind velocity","miles/hr.",null,null,null,null,null,null,null,null,0,0,"mph"]
[null,"Surface shape/orientation (select using dropdown menu)",null,"Horizontal plate facing up, cooler than air","Horizontal plate facing up, cooler than air"]
[null,"Surface shape/orientation factor ",null,{"$f":"INDEX($G$8:$G$14,MATCH(D48,$H$8:$H$14,0))","v":0.89},{"$f":"INDEX($G$8:$G$14,MATCH(E48,$H$8:$H$14,0))","v":0.89},null,null,null,null,null,null,0.89,0.89]
[null,"Surface emissivity (Typical - 0.9)",null,null,null,{"$f":"IF(OR(D50>1,E50>1),\"Surface emmissivity cannot be greater than 1\",\"\")","v":""},null,null,null,null,null,{"$f":"IF(L45>L46,((L49*(1/24)^0.2*(1/((L46+L45)/2)^0.181*(L45-L46)^0.266*(1+1.277*L47)^0.5)*(L45-L46)) + 0.1713*10^-8*D50*(((L45+460)^4-(L46+460)^4))),0)","v":0},{"$f":"IF(M45>M46,((M49*(1/24)^0.2*(1/((M46+M45)/2)^0.181*(M45-M46)^0.266*(1+1.277*M47)^0.5)*(M45-M46)) + 0.1713*10^-8*E50*(((M45+460)^4-(M46+460)^4))),0)","v":0},"Btu/hr-ft^2"]
[null,"Total outside surface area","ft^2",0,0,null,null,null,null,null,null,{"$f":"L50*D51*D52","v":0},{"$f":"M50*E51*E52","v":0},"Btu/hr"]
[null,"Correction factor (based on local conditions)",null,1,1,{"$f":"IF(OR(D53<=0,E53<=0),\"Surface temperature lower than ambient temperature\",\" \")","v":"Surface temperature lower than ambient temperature"},null,null,null,null,null,{"$f":"L51","v":0},{"$f":"M51","v":0},"Btu/hr",{"$f":"IF($C$5>3,1,0)","v":1},"Control"]
[null,"Heat loss ","Btu/hr ",{"$f":"L52","v":0},{"$f":"M52","v":0}]
[]
[null,"Surface name or designation"]
[null,null,null,"Current","Modified"]
[null,"Average surface temperature (measured)","deg. F.",null,null,null,null,null,null,null,null,{"$f":"D57","v":0},0,"Deg. F"]
[null,"Ambient Temperature","deg. F.",null,null,null,null,null,null,null,null,0,0,"Deg. F"]
[null,"Wind velocity","miles/hr.",null,null,null,null,null,null,null,null,0,0,"mph"]
[null,"Surface shape/orientation (select using dropdown menu)",null,"Horizontal plate facing down, cooler than air","Horizontal plate facing down, cooler than air"]
[null,"Surface shape/orientation factor ",null,{"$f":"INDEX($G$8:$G$14,MATCH(D60,$H$8:$H$14,0))","v":1.79},{"$f":"INDEX($G$8:$G$14,MATCH(E60,$H$8:$H$14,0))","v":1.79},null,null,null,null,null,null,1.79,1.79]
[null,"Surface emissivity (Typical - 0.9)",null,null,null,{"$f":"IF(OR(D62>1,E62>1),\"Surface emmissivity cannot be greater than 1\",\"\")","v":""},null,null,null,null,null,{"$f":"IF(L57>L58,((L61*(1/24)^0.2*(1/((L58+L57)/2)^0.181*(L57-L58)^0.266*(1+1.277*L59)^0.5)*(L57-L58)) + 0.1713*10^-8*D62*(((L57+460)^4-(L58+460)^4))),0)","v":0},{"$f":"IF(M57>M58,((M61*(1/24)^0.2*(1/((M58+M57)/2)^0.181*(M57-M58)^0.266*(1+1.277*M59)^0.5)*(M57-M58)) + 0.1713*10^-8*E62*(((M57+460)^4-(M58+460)^4))),0)","v":0},"Btu/hr-ft^2"]
[null,"Total outside surface area","ft^2",0,0,null,null,null,null,null,null,{"$f":"L62*D63*D64","v":0},{"$f":"M62*E63*E64","v":0},"Btu/hr"]
[null,"Correction factor (based on local conditions)",null,1,1,{"$f":"IF(OR(D57<=D58,E57<=E58),\"Surface temperature lower than ambient temperature\",\" \")","v":"Surface temperature lower than ambient temperature"},null,null,null,null,null,{"$f":"L63","v":0},{"$f":"M63","v":0},"Btu/hr",{"$f":"IF($C$5>4,1,0)","v":1},"Control"]
[null,"Heat loss ","Btu/hr ",{"$f":"L64","v":0},{"$f":"M64","v":0}]
[]
[null,"Surface name or designation"]
[null,null,null,"Current","Modified"]
[null,"Average surface temperature (measured)","deg. F.",null,null,null,null,null,null,null,null,{"$f":"D69","v":0},0,"Deg. F"]
[null,"Ambient Temperature","deg. F.",null,null,null,null,null,null,null,null,0,0,"Deg. F"]
[null,"Wind velocity","miles/hr.",null,null,null,null,null,null,null,null,0,0,"mph"]
[null,"Surface shape/orientation (select using dropdown menu)",null,"Horizontal cylinders","Horizontal cylinders"]
[null,"Surface shape/orientation factor ",null,{"$f":"INDEX($G$8:$G$14,MATCH(D72,$H$8:$H$14,0))","v":1.016},{"$f":"INDEX($G$8:$G$14,MATCH(E72,$H$8:$H$14,0))","v":1.016},null,null,null,null,null,null,1.016,1.016]
[null,"Surface emissivity (Typical - 0.9)",null,null,null,{"$f":"IF(OR(D74>1,E74>1),\"Surface emmissivity cannot be greater than 1\",\"\")","v":""},null,null,null,null,null,{"$f":"IF(L69>L70,((L73*(1/24)^0.2*(1/((L70+L69)/2)^0.181*(L69-L70)^0.266*(1+1.277*L71)^0.5)*(L69-L70)) + 0.1713*10^-8*D74*(((L69+460)^4-(L70+460)^4))),0)","v":0},{"$f":"IF(M69>M70,((M73*(1/24)^0.2*(1/((M70+M69)/2)^0.181*(M69-M70)^0.266*(1+1.277*M71)^0.5)*(M69-M70)) + 0.1713*10^-8*E74*(((M69+460)^4-(M70+460)^4))),0)","v":0},"Btu/hr-ft^2"]
[null,"Total outside surface area","ft^2",0,0,null,null,null,null,null,null,{"$f":"L74*D75*D76","v":0},{"$f":"M74*E75*E76","v":0},"Btu/hr"]
[null,"Correction factor (based on local conditions)",null,1,1,{"$f":"IF(OR(D69<=D70,E69<=E70),\"Surface temperature lower than ambient temperature\",\" \")","v":"Surface temperature lower than ambient temperature"},null,null,null,null,null,{"$f":"L75","v":0},{"$f":"M75","v":0},"Btu/hr",{"$f":"IF($C$5>5,1,0)","v":1},"Control"]
[null,"Heat loss ","Btu/hr ",{"$f":"L76","v":0},{"$f":"M76","v":0}]
[]
[null,"Surface name or designation"]
[null,null,null,"Current","Modified"]
[null,"Average surface temperature (measured)","deg. F.",null,null,null,null,null,null,null,null,{"$f":"D81","v":0},0,"Deg. F"]
[null,"Ambient Temperature","deg. F.",null,null,null,null,null,null,null,null,0,0,"Deg. F"]
[null,"Wind velocity","miles/hr.",null,null,null,null,null,null,null,null,0,0,"mph"]
[null,"Surface shape/orientation (select using dropdown menu)",null,"Longer vertical cylinders","Longer vertical cylinders"]
[null,"Surface shape/orientation factor ",null,{"$f":"INDEX($G$8:$G$14,MATCH(D84,$H$8:$H$14,0))","v":1.2350000000000001},{"$f":"INDEX($G$8:$G$14,MATCH(E84,$H$8:$H$14,0))","v":1.2350000000000001},null,null,null,null,null,null,1.2350000000000001,1.2350000000000001]
[null,"Surface emissivity (Typical - 0.9)",null,null,null,{"$f":"IF(OR(D86>1,E86>1),\"Surface emmissivity cannot be greater than 1\",\"\")","v":""},null,null,null,null,null,{"$f":"IF(L81>L82,((L85*(1/24)^0.2*(1/((L82+L81)/2)^0.181*(L81-L82)^0.266*(1+1.277*L83)^0.5)*(L81-L82)) + 0.1713*10^-8*D86*(((L81+460)^4-(L82+460)^4))),0)","v":0},{"$f":"IF(M81>M82,((M85*(1/24)^0.2*(1/((M82+M81)/2)^0.181*(M81-M82)^0.266*(1+1.277*M83)^0.5)*(M81-M82)) + 0.1713*10^-8*E86*(((M81+460)^4-(M82+460)^4))),0)","v":0},"Btu/hr-ft^2"]
[null,"Total outside surface area","ft^2",0,0,null,null,null,null,null,null,{"$f":"L86*D87*D88","v":0},{"$f":"M86*E87*E88","v":0},"Btu/hr"]
[null,"Correction factor (based on local conditions)",null,1,1,{"$f":"IF(OR(D81<=D82,E81<=E82),\"Surface temperature lower than ambient temperature\",\" \")","v":"Surface temperature lower than ambient temperature"},null,null,null,null,null,{"$f":"L87","v":0},{"$f":"M87","v":0},"Btu/hr",{"$f":"IF($C$5>6,1,0)","v":1},"Control"]
[null,"Heat loss ","Btu/hr ",{"$f":"L88","v":0},{"$f":"M88","v":0}]
[null,null,null,1,1]
[null,"Surface name or designation"]
[null,null,null,"Current","Modified"]
[null,"Average surface temperature (measured)","deg. F.",null,null,null,null,null,null,null,null,{"$f":"D93","v":0},0,"Deg. F"]
[null,"Ambient Temperature","deg. F.",null,null,null,null,null,null,null,null,0,0,"Deg. F"]
[null,"Wind velocity","miles/hr.",null,null,null,null,null,null,null,null,0,0,"mph"]
[null,"Surface shape/orientation (select using dropdown menu)",null,"Horizontal plate facing up, cooler than air","Horizontal plate facing up, cooler than air"]
[null,"Surface shape/orientation factor ",null,{"$f":"INDEX($G$8:$G$14,MATCH(D96,$H$8:$H$14,0))","v":0.89},{"$f":"INDEX($G$8:$G$14,MATCH(E96,$H$8:$H$14,0))","v":0.89},null,null,null,null,null,null,0.89,0.89]
[null,"Surface emissivity (Typical - 0.9)",null,null,null,{"$f":"IF(OR(D98>1,E98>1),\"Surface emmissivity cannot be greater than 1\",\"\")","v":""},null,null,null,null,null,{"$f":"IF(L93>L94,((L97*(1/24)^0.2*(1/((L94+L93)/2)^0.181*(L93-L94)^0.266*(1+1.277*L95)^0.5)*(L93-L94)) + 0.1713*10^-8*D98*(((L93+460)^4-(L94+460)^4))),0)","v":0},{"$f":"IF(M93>M94,((M97*(1/24)^0.2*(1/((M94+M93)/2)^0.181*(M93-M94)^0.266*(1+1.277*M95)^0.5)*(M93-M94)) + 0.1713*10^-8*E98*(((M93+460)^4-(M94+460)^4))),0)","v":0},"Btu/hr-ft^2"]
[null,"Total outside surface area","ft^2",0,0,null,null,null,null,null,null,{"$f":"L98*D99*D100","v":0},{"$f":"M98*E99*E100","v":0},"Btu/hr"]
[null,"Correction factor (based on local conditions)",null,1,1,{"$f":"IF(OR(D93<=D94,E93<=E94),\"Surface temperature lower than ambient temperature\",\" \")","v":"Surface temperature lower than ambient temperature"},null,null,null,null,null,{"$f":"L99","v":0},{"$f":"M99","v":0},"Btu/hr",{"$f":"IF($C$5>7,1,0)","v":1},"Control"]
[null,"Heat loss ","Btu/hr ",{"$f":"L100","v":0},{"$f":"M100","v":0}]
[]
[null,"Surface name or designation"]
[null,null,null,"Current","Modified"]
[null,"Average surface temperature (measured)","deg. F.",null,null,null,null,null,null,null,null,{"$f":"D105","v":0},0,"Deg. F"]
[null,"Ambient Temperature","deg. F.",null,null,null,null,null,null,null,null,0,0,"Deg. F"]
[null,"Wind velocity","miles/hr.",null,null,null,null,null,null,null,null,0,0,"mph"]
[null,"Surface shape/orientation (select using dropdown menu)",null,"Horizontal plate facing up, cooler than air","Horizontal plate facing up, cooler than air"]
[null,"Surface shape/orientation factor ",null,{"$f":"INDEX($G$8:$G$14,MATCH(D108,$H$8:$H$14,0))","v":0.89},{"$f":"INDEX($G$8:$G$14,MATCH(E108,$H$8:$H$14,0))","v":0.89},null,null,null,null,null,null,0.89,0.89]
[null,"Surface emissivity (Typical - 0.9)",null,null,null,{"$f":"IF(OR(D110>1,E110>1),\"Surface emmissivity cannot be greater than 1\",\"\")","v":""},null,null,null,null,null,{"$f":"IF(L105>L106,((L109*(1/24)^0.2*(1/((L106+L105)/2)^0.181*(L105-L106)^0.266*(1+1.277*L107)^0.5)*(L105-L106)) + 0.1713*10^-8*D110*(((L105+460)^4-(L106+460)^4))),0)","v":0},{"$f":"IF(M105>M106,((M109*(1/24)^0.2*(1/((M106+M105)/2)^0.181*(M105-M106)^0.266*(1+1.277*M107)^0.5)*(M105-M106)) + 0.1713*10^-8*E110*(((M105+460)^4-(M106+460)^4))),0)","v":0},"Btu/hr-ft^2"]
[null,"Total outside surface area","ft^2",0,0,null,null,null,null,null,null,{"$f":"L110*D111*D112","v":0},{"$f":"M110*E111*E112","v":0},"Btu/hr"]
[null,"Correction factor (based on local conditions)",null,1,1,{"$f":"IF(OR(D105<=D106,E105<=E106),\"Surface temperature lower than ambient temperature\",\" \")","v":"Surface temperature lower than ambient temperature"},null,null,null,null,null,{"$f":"L111","v":0},{"$f":"M111","v":0},"Btu/hr",{"$f":"IF($C$5>8,1,0)","v":1},"Control"]
[null,"Heat loss ","Btu/hr ",{"$f":"L112","v":0},{"$f":"M112","v":0}]
[]
[null,"Surface name or designation"]
[null,"Data - User input",null,"Current","Modified"]
[null,"Average surface temperature (measured)","deg. F.",null,null,null,null,null,null,null,null,{"$f":"D117","v":0},0,"Deg. F"]
[null,"Ambient Temperature","deg. F.",null,null,null,null,null,null,null,null,0,0,"Deg. F"]
[null,"Wind velocity","miles/hr.",null,null,null,null,null,null,null,null,0,0,"mph"]
[null,"Surface shape/orientation (select using dropdown menu)",null,"Horizontal plate facing down, cooler than air","Horizontal plate facing down, cooler than air"]
[null,"Surface shape/orientation factor ",null,{"$f":"INDEX($G$8:$G$14,MATCH(D120,$H$8:$H$14,0))","v":1.79},{"$f":"INDEX($G$8:$G$14,MATCH(E120,$H$8:$H$14,0))","v":1.79},null,null,null,null,null,null,1.79,1.79]
[null,"Surface emissivity (Typical - 0.9)",null,null,null,{"$f":"IF(OR(D122>1,E122>1),\"Surface emmissivity cannot be greater than 1\",\"\")","v":""},null,null,null,null,null,{"$f":"IF(L117>L118,((L121*(1/24)^0.2*(1/((L118+L117)/2)^0.181*(L117-L118)^0.266*(1+1.277*L119)^0.5)*(L117-L118)) + 0.1713*10^-8*D122*(((L117+460)^4-(L118+460)^4))),0)","v":0},{"$f":"IF(M117>M118,((M121*(1/24)^0.2*(1/((M118+M117)/2)^0.181*(M117-M118)^0.266*(1+1.277*M119)^0.5)*(M117-M118)) + 0.1713*10^-8*E122*(((M117+460)^4-(M118+460)^4))),0)","v":0},"Btu/hr-ft^2"]
[null,"Total outside surface area","ft^2",0,0,null,null,null,null,null,null,{"$f":"L122*D123*D124","v":0},{"$f":"M122*E123*E124","v":0},"Btu/hr"]
[null,"Correction factor (based on local conditions)",null,1,1,{"$f":"IF(OR(D117<=D118,E117<=E118),\"Surface temperature lower than ambient temperature\",\" \")","v":"Surface temperature lower than ambient temperature"},null,null,null,null,null,{"$f":"L123","v":0},{"$f":"M123","v":0},"Btu/hr",{"$f":"IF($C$5>9,1,0)","v":1},"Control"]
[null,"Heat loss ","Btu/hr ",{"$f":"L124","v":0},{"$f":"M124","v":0}]
[]
[]
[]
[null,"Total Losses From Wall Surfaces","Btu/hr",{"$f":"L129","v":0},{"$f":"M129","v":0},null,null,null,null,null,null,{"$f":"SUM(($O124*L124)+($O112*L112)+($O100*L100)+($O88*L88)+($O76*L76)+($O64*L64)+($O52*L52)+($O40*L40)+($O28*L28)+L16)","v":0},{"$f":"SUM(($O124*M124)+($O112*M112)+($O100*M100)+($O88*M88)+($O76*M76)+($O64*M64)+($O52*M52)+($O40*M40)+($O28*M28)+M16)","v":0},"Btu/hr."]
[]
[null,"NOTES:"]
[null,"Enter notes here on proposed changes for the \"Modified\" conditions."]
[null,null,null,null,null,null,null,null,null,{"$f":"IF(B133=\"\",0,1)","v":0}]
[null,null,null,null,null,null,null,null,null,{"$f":"IF(B134=\"\",0,1)","v":0}]
[null,null,null,null,null,null,null,null,null,{"$f":"IF(B135=\"\",0,1)","v":0}]
[null,null,null,null,null,null,null,null,null,{"$f":"IF(B136=\"\",0,1)","v":0}]
[null,null,null,null,null,null,null,null,null,{"$f":"IF(B137=\"\",0,1)","v":0}]
[null,null,null,null,null,null,null,null,null,{"$f":"SUM(J133:J137)","v":0}]

{"sheet":"Water-Air cooling","index":13,"n_rows":236,"n_cols":13,"rows_kept":236,"cut":false,"hidden":false,"merged":[[237,1,237,4],[238,1,238,4],[239,1,239,4],[240,1,240,4],[1,1,1,4],[2,3,2,4],[234,1,234,4],[235,1,235,4],[236,1,236,4]]}
[]
[null,"Water or air cooling (internal)"]
[null,"Number of Loops",{"$f":"'Control page'!D16","v":6},"(from Control Sheet)"]
[]
[null,"Cooling - Loop 1"]
[null,null,null,"Current ","Modified ",null,null,null,"Copy Current to Modified",null,"Liquid Flow","gal/min"]
[null,"Cooling Medium",null,"AIR","AIR",null,null,null,"Done Entering Data",null,"Gas Flow","SCFM"]
[null,"Average Specific Heat ","(Btu/lb-F)"]
[null,"Density",{"$f":"IF(B10=\"Gas Flow\",\"(lb/SCF)\", \"(lb/gal)\")","v":"(lb/SCF)"}]
[null,{"$f":"IF(OR(D7=\"Air\",D7=\"OTHER GAS\"),K$7,K$6)","v":"Gas Flow"},{"$f":"IF(B10=\"Gas Flow\",L$7,L$6)","v":"SCFM"},null,null,null,null,null,"Help"]
[null,"Inlet Temperature","deg. F.",null,null,null,null,null,"Print Sheet"]
[null,{"$f":"IF(OR(D7=\"Water\",E7=\"Water\",D7=\"Other Liquid\",E7=\"Other Liquid\"), \"Outlet Temperature (Below boiling point)\",\"Outlet Temperature\")","v":"Outlet Temperature"},"deg. F."]
[null,"Heat Required","Btu/hr",{"$f":"D40","v":0},{"$f":"E40","v":0},null,null,null,null,null,null,{"$f":"IF($C$3=0,0,1)","v":1},"Control"]
[null,"Correction factor ",null,1,1]
[null,"Heat required calculations-Water",null,null,null,null,null,null,null,"$E$17+$E$18*C4+$E$19*C4^2-$E$20*C4^3"]
[null,null,null,null,null,null,null,null,null,"Specific Heat of Air "]
[null,"Flow rate of water  (l/min)","gal/min",{"$f":"D10","v":0},{"$f":"E10","v":0},null,null,null,null,"Temp F","Btu/(lb.F.)"]
[null,"Mass flow  for water - rate ","lb/min",{"$f":"D17*8.335","v":0},{"$f":"E17*8.335","v":0},null,null,null,null,0,null,"Density of AIR @32 DEG. F"]
[null,"Sp. Heat of water  ","(Btu/(lb-F)",1,1,"This is constant at normal ambient temperature ",null,null,null,{"$f":"100+J18","v":100},null,7.6300000000000007E-2,"lb/scf"]
[null,"Heat required  ","Btu/hr",{"$f":"D18*60*D19*(D12-D11)","v":0},{"$f":"E18*60*E19*(E12-E11)","v":0},null,null,null,null,200,null,"Standard condition "]
[null,null,null,null,null,null,null,null,null,300]
[null,"Heat required calculations-Air",null,null,null,null,null,null,null,400]
[null,"Mean temp of air","deg. F",{"$f":"(D11+D12)/2","v":0},{"$f":"(E11+E12)/2","v":0},null,null,null,null,500]
[null,"Sp. Heat of air at average air temperature ","Btu/(lb-F)",{"$f":"$L$27+$L$28*D23+$L$29*D23^2-$L$30*D23^3","v":0.23710000000000001},{"$f":"$L$27+$L$28*E23+$L$29*E23^2-$L$30*E23^3","v":0.23710000000000001},null,null,null,null,600]
[null,"Density of air at NTP (32 F, 1 atm.) ","lb/SCF",7.6300000000000007E-2,7.6300000000000007E-2,null,null,null,null,700]
[null,"Mass flow of air","lb/hr.",{"$f":"D10*$L$19*60","v":0},{"$f":"E10*$L$19*60","v":0},null,null,null,null,null,"Constants for sp. Heat calculations "]
[null,"Heat required ","Btu/hr",{"$f":"D24*D26*(D12-D11)","v":0},{"$f":"E24*E26*(E12-E11)","v":0},null,null,null,null,null,"Constant",0.23710000000000001]
[null,null,null,null,null,null,null,null,null,null,"x",{"$f":"-9*10^(-6)","v":-9.0000000000000002E-6}]
[null,"Heat required calculations-Other Fluid",null,null,null,null,null,null,null,null,"x^2",{"$f":"7*10^(-8)","v":7.0000000000000005E-8}]
[null,null,null,null,null,null,null,null,null,null,"x^3",{"$f":"3*10^(-11)","v":3E-11}]
[null,"Sp. Heat of Gas or Liquid ","(Btu/(lb-F)",{"$f":"D8","v":0},{"$f":"E8","v":0}]
[null,"Density of Gas or Liquid NTP (0 C, 100 pa) ","lb/SCF or lb/gal",{"$f":"D9","v":0},{"$f":"E9","v":0}]
[null,"Mass flow of Gas or Liquid","lb/hr.",{"$f":"D10*D32*60","v":0},{"$f":"E10*E32*60","v":0}]
[]
[null,"Heat required ","Btu/hr",{"$f":"D31*D33*(D12-D11)","v":0},{"$f":"E31*E33*(E12-E11)","v":0}]
[]
[null,"If Air or Water",null,{"$f":"OR((D7=\"Air\"),(D7=\"Water\"))","v":true},{"$f":"OR((E7=\"Air\"),(E7=\"Water\"))","v":true}]
[null,"If Air or Water",null,{"$f":"IF(D7=\"Air\",(D27*D37),(D20*D37))","v":0},{"$f":"IF(E7=\"Air\",(E27*E37),(E20*E37))","v":0}]
[null,"If Other Gas or Liquid",null,{"$f":"OR((D7=\"Other Gas\"),(D7=\"Other Liquid\"))","v":false},{"$f":"OR((E7=\"Other Gas\"),(E7=\"Other Liquid\"))","v":false}]
[null,null,"Total",{"$f":"IF(D39,D35,D38)","v":0},{"$f":"IF(E39,E35,E38)","v":0}]
[]
[null,"Cooling - Loop 2"]
[null,null,null,"Current ","Modified "]
[null,"Cooling Medium",null,"OTHER LIQUID","OTHER LIQUID"]
[null,"Average Specific Heat ","(Btu/lb-F)"]
[null,"Density",{"$f":"IF(B47=\"Gas Flow\",\"(lb/SCF)\", \"(lb/gal)\")","v":"(lb/gal)"}]
[null,{"$f":"IF(OR(D44=\"Air\",D44=\"OTHER GAS\"),K$7,K$6)","v":"Liquid Flow"},{"$f":"IF(B47=\"Gas Flow\",L$7,L$6)","v":"gal/min"}]
[null,"Inlet Temperature","deg. F."]
[null,{"$f":"IF(OR(D44=\"Water\",E44=\"Water\",D44=\"Other Liquid\",E44=\"Other Liquid\"), \"Outlet Temperature (Below boiling point)\",\"Outlet Temperature\")","v":"Outlet Temperature (Below boiling point)"},"deg. F."]
[null,"Heat Required","Btu/hr",{"$f":"D77","v":0},{"$f":"E77","v":0},null,null,null,null,null,null,{"$f":"IF($C$3>1,1,0)","v":1},"Control"]
[null,"Correction factor ",null,1,1]
[null,"Heat required calculations-Water"]
[]
[null,"Flow rate of water  (GPM)","gal/min",{"$f":"D47","v":0},{"$f":"E47","v":0}]
[null,"Mass flow  for water - rate ","lb/min",{"$f":"D54*8.335","v":0},{"$f":"E54*8.335","v":0}]
[null,"Sp. Heat of water  ","(Btu/(lb-F)",1,1,"This is constant at normal ambinet temperature "]
[null,"Heat required  ","Btu/hr",{"$f":"D55*60*D56*(D49-D48)","v":0},{"$f":"E55*60*E56*(E49-E48)","v":0}]
[]
[null,"Heat required calculations-Air"]
[null,"Mean temp of air","deg. F",{"$f":"(D48+D49)/2","v":0},{"$f":"(E48+E49)/2","v":0}]
[null,"Sp. Heat of air at average air temperature ","Btu/(lb-F)",{"$f":"$L$27+$L$28*D60+$L$29*D60^2-$L$30*D60^3","v":0.23710000000000001},{"$f":"$L$27+$L$28*E60+$L$29*E60^2-$L$30*E60^3","v":0.23710000000000001}]
[null,"Density of air at NTP (32 C, 1 atm.) ","lb/SCF",{"$f":"L19","v":7.6300000000000007E-2},{"$f":"D62","v":7.6300000000000007E-2}]
[null,"Mass flow of air","lb/hr.",{"$f":"D47*$L$19*60","v":0},{"$f":"E47*$L$19*60","v":0}]
[null,"Heat required ","Btu/hr",{"$f":"D61*D63*(D49-D48)","v":0},{"$f":"E61*E63*(E49-E48)","v":0}]
[]
[null,"Heat required calculations-Other Fluid"]
[]
[null,"Sp. Heat of Gas or Liquid ","(Btu/(lb-F)",{"$f":"D45","v":0},{"$f":"E45","v":0}]
[null,"Density of Gas or Liquid NTP (32 F, 1 atm.) ","lb/SCF or lb/gal",{"$f":"D46","v":0},{"$f":"E46","v":0}]
[null,"Mass flow of Gas or Liquid","lb/hr.",{"$f":"D47*D69*60","v":0},{"$f":"E47*E69*60","v":0}]
[]
[null,"Heat required ","Btu/hr",{"$f":"D68*D70*(D49-D48)","v":0},{"$f":"E68*E70*(E49-E48)","v":0}]
[]
[null,"If Air or Water",null,{"$f":"OR((D44=\"Air\"),(D44=\"Water\"))","v":false},{"$f":"OR((E44=\"Air\"),(E44=\"Water\"))","v":false}]
[null,"If Air or Water",null,{"$f":"IF(D44=\"Air\",(D64*D74),(D57*D74))","v":0},{"$f":"IF(E44=\"Air\",(E64*E74),(E57*E74))","v":0}]
[null,"If Other Gas or Liquid",null,{"$f":"OR((D44=\"Other Gas\"),(D44=\"Other Liquid\"))","v":true},{"$f":"OR((E44=\"Other Gas\"),(E44=\"Other Liquid\"))","v":true}]
[null,null,"Total",{"$f":"IF(D76,D72,D75)","v":0},{"$f":"IF(E76,E72,E75)","v":0}]
[]
[]
[null,"Cooling - Loop 3"]
[null,null,null,"Current ","Modified "]
[null,"Cooling Medium",null,"OTHER GAS","OTHER GAS"]
[null,"Average Specific Heat ","(Btu/lb-F)"]
[null,"Density",{"$f":"IF(B85=\"Gas Flow\",\"(lb/SCF)\", \"(lb/gal)\")","v":"(lb/SCF)"},null,null,null,null,null,null,null,null,{"$f":"IF($C$3>2,1,0)","v":1},"Control"]
[null,{"$f":"IF(OR(D82=\"Air\",D82=\"OTHER GAS\"),K$7,K$6)","v":"Gas Flow"},{"$f":"IF(B85=\"Gas Flow\",L$7,L$6)","v":"SCFM"}]
[null,"Inlet Temperature","deg. F."]
[null,{"$f":"IF(OR(D82=\"Water\",E82=\"Water\",D82=\"Other Liquid\",E82=\"Other Liquid\"), \"Outlet Temperature (Below boiling point)\",\"Outlet Temperature\")","v":"Outlet Temperature"},"deg. F."]
[null,"Heat Required","Btu/hr",{"$f":"D115","v":0},{"$f":"E115","v":0}]
[null,"Correction factor ",null,1,1]
[null,"Heat required calculations-Water",null,null,null,"This is constant at normal ambinet temperature "]
[]
[null,"Flow rate of water  (l/min)","gal/min",{"$f":"D85","v":0},{"$f":"E85","v":0}]
[null,"Mass flow  for water - rate ","lb/min",{"$f":"D92*8.335","v":0},{"$f":"E92*8.335","v":0}]
[null,"Sp. Heat of water  ","(Btu/(lb-F)",1,{"$f":"D94","v":1}]
[null,"Heat required  ","Btu/hr",{"$f":"D93*60*D94*(D87-D86)","v":0},{"$f":"E93*60*E94*(E87-E86)","v":0}]
[]
[null,"Heat required calculations-Air"]
[null,"Mean temp of air","deg. F",{"$f":"(D86+D87)/2","v":0},{"$f":"(E86+E87)/2","v":0}]
[null,"Sp. Heat of air at average air temperature ","Btu/(lb-F)",{"$f":"$L$27+$L$28*D98+$L$29*D98^2-$L$30*D98^3","v":0.23710000000000001},{"$f":"$L$27+$L$28*E98+$L$29*E98^2-$L$30*E98^3","v":0.23710000000000001}]
[null,"Density of air at NTP (032 F, 1 atm.) ","lb/SCF",{"$f":"L19","v":7.6300000000000007E-2},{"$f":"D100","v":7.6300000000000007E-2}]
[null,"Mass flow of air","lb/hr.",{"$f":"D85*$L$19*60","v":0},{"$f":"E85*$L$19*60","v":0}]
[null,"Heat required ","Btu/hr",{"$f":"D99*D101*(D87-D86)","v":0},{"$f":"E99*E101*(E87-E86)","v":0}]
[]
[null,"Heat required calculations-Other Fluid"]
[]
[null,"Sp. Heat of Gas or Liquid ","(Btu/(lb-F)",{"$f":"D83","v":0},{"$f":"E83","v":0}]
[null,"Density of Gas or Liquid NTP (32 C, 1 atm) ","lb/SCF or lb/gal",{"$f":"D84","v":0},{"$f":"E84","v":0}]
[null,"Mass flow of Gas or Liquid","lb/hr.",{"$f":"D85*D107*60","v":0},{"$f":"E85*E107*60","v":0},null,null,null,null,null,null,{"$f":"IF($C$3>3,1,0)","v":1},"Control"]
[]
[null,"Heat required ","Btu/hr",{"$f":"D106*D108*(D87-D86)","v":0},{"$f":"E106*E108*(E87-E86)","v":0}]
[]
[null,"If Air or Water",null,{"$f":"OR((D82=\"Air\"),(D82=\"Water\"))","v":false},{"$f":"OR((E82=\"Air\"),(E82=\"Water\"))","v":false}]
[null,"If Air or Water",null,{"$f":"IF(D82=\"Air\",(D102*D112),(D95*D112))","v":0},{"$f":"IF(E82=\"Air\",(E102*E112),(E95*E112))","v":0}]
[null,"If Other Gas or Liquid",null,{"$f":"OR((D82=\"Other Gas\"),(D82=\"Other Liquid\"))","v":true},{"$f":"OR((E82=\"Other Gas\"),(E82=\"Other Liquid\"))","v":true}]
[null,null,"Total",{"$f":"IF(D114,D110,D113)","v":0},{"$f":"IF(E114,E110,E113)","v":0}]
[]
[]
[null,"Cooling - Loop 4"]
[null,null,null,"Current ","Modified "]
[null,"Cooling Medium",null,"OTHER GAS","OTHER GAS"]
[null,"Average Specific Heat ","(Btu/lb-F)"]
[null,"Density",{"$f":"IF(B123=\"Gas Flow\",\"(lb/SCF)\", \"(lb/gal)\")","v":"(lb/SCF)"}]
[null,{"$f":"IF(OR(D120=\"Air\",D120=\"OTHER GAS\"),K$7,K$6)","v":"Gas Flow"},{"$f":"IF(B123=\"Gas Flow\",L$7,L$6)","v":"SCFM"}]
[null,"Inlet Temperature","deg. F."]
[null,{"$f":"IF(OR(D120=\"Water\",E120=\"Water\",D120=\"Other Liquid\",E120=\"Other Liquid\"), \"Outlet Temperature (Below boiling point)\",\"Outlet Temperature\")","v":"Outlet Temperature"},"deg. F."]
[null,"Heat Required","Btu/hr",{"$f":"D153","v":0},{"$f":"E153","v":0}]
[null,"Correction factor ",null,1,1]
[null,"Heat required calculations-Water"]
[]
[null,"Flow rate of water  (gallons/min)","gal/min",{"$f":"D123","v":0},{"$f":"E123","v":0}]
[null,"Mass flow  for water - rate ","lb/min",{"$f":"D130*8.335","v":0},{"$f":"E130*8.335","v":0}]
[null,"Sp. Heat of water  ","(Btu/(lb-F)",1,1]
[null,"Heat required  ","Btu/hr",{"$f":"D131*60*D132*(D125-D124)","v":0},{"$f":"E131*60*E132*(E125-E124)","v":0}]
[null,null,null,null,null,null,null,null,null,null,null,{"$f":"IF($C$3>4,1,0)","v":1},"Control"]
[null,"Heat required calculations-Air"]
[null,"Mean temp of air","deg. F",{"$f":"(D124+D125)/2","v":0},{"$f":"(E124+E125)/2","v":0}]
[null,"Sp. Heat of air at average air temperature ","Btu/(lb-F)",{"$f":"$L$27+$L$28*D136+$L$29*D136^2-$L$30*D136^3","v":0.23710000000000001},{"$f":"$L$27+$L$28*E136+$L$29*E136^2-$L$30*E136^3","v":0.23710000000000001}]
[null,"Density of air at NTP (32 F, 1atm) ","lb/SCF",7.6300000000000007E-2,7.6300000000000007E-2]
[null,"Mass flow of air","lb/hr.",{"$f":"D123*$L$19*60","v":0},{"$f":"E123*$L$19*60","v":0}]
[null,"Heat required ","Btu/hr",{"$f":"D137*D139*(D125-D124)","v":0},{"$f":"E137*E139*(E125-E124)","v":0}]
[]
[null,"Heat required calculations-Other Fluid"]
[]
[null,"Sp. Heat of Gas or Liquid ","(Btu/(lb-F)",{"$f":"D121","v":0},{"$f":"E121","v":0}]
[null,"Density of Gas or Liquid NTP (0 C, 100 pa) ","lb/SCF or lb/gal",{"$f":"D122","v":0},{"$f":"E122","v":0}]
[null,"Mass flow of Gas or Liquid","lb/hr.",{"$f":"D123*D145*60","v":0},{"$f":"E123*E145*60","v":0}]
[]
[null,"Heat required ","Btu/hr",{"$f":"D144*D146*(D125-D124)","v":0},{"$f":"E144*E146*(E125-E124)","v":0}]
[]
[null,"If Air or Water",null,{"$f":"OR((D120=\"Air\"),(D120=\"Water\"))","v":false},{"$f":"OR((E120=\"Air\"),(E120=\"Water\"))","v":false}]
[null,"If Air or Water",null,{"$f":"IF(D120=\"Air\",(D140*D150),(D133*D150))","v":0},{"$f":"IF(E120=\"Air\",(E140*E150),(E133*E150))","v":0}]
[null,"If Other Gas or Liquid",null,{"$f":"OR((D120=\"Other Gas\"),(D120=\"Other Liquid\"))","v":true},{"$f":"OR((E120=\"Other Gas\"),(E120=\"Other Liquid\"))","v":true}]
[null,null,"Total",{"$f":"IF(D152,D148,D151)","v":0},{"$f":"IF(E152,E148,E151)","v":0}]
[]
[]
[null,"Cooling - Loop 5"]
[null,null,null,"Current ","Modified "]
[null,"Cooling Medium",null,"OTHER LIQUID","OTHER LIQUID"]
[null,"Average Specific Heat ","(Btu/lb-F)"]
[null,"Density",{"$f":"IF(B161=\"Gas Flow\",\"(lb/SCF)\", \"(lb/gal)\")","v":"(lb/gal)"}]
[null,{"$f":"IF(OR(D158=\"Air\",D158=\"OTHER GAS\"),K$7,K$6)","v":"Liquid Flow"},{"$f":"IF(B161=\"Gas Flow\",L$7,L$6)","v":"gal/min"},null,null,null,null,null,null,null,null,{"$f":"IF($C$3>5,1,0)","v":1},"Control"]
[null,"Inlet Temperature","deg. F."]
[null,{"$f":"IF(OR(D158=\"Water\",E158=\"Water\",D158=\"Other Liquid\",E158=\"Other Liquid\"), \"Outlet Temperature (Below boiling point)\",\"Outlet Temperature\")","v":"Outlet Temperature (Below boiling point)"},"deg. F."]
[null,"Heat Required","Btu/hr",{"$f":"D191","v":0},{"$f":"E191","v":0}]
[null,"Correction factor ",null,1,1]
[null,"Heat required calculations-Water"]
[]
[null,"Flow rate of water  (l/min)","gal/min",{"$f":"D161","v":0},{"$f":"E161","v":0}]
[null,"Mass flow  for water - rate ","lb/min",{"$f":"D168*8.335","v":0},{"$f":"E168*8.335","v":0}]
[null,"Sp. Heat of water  ","(Btu/(lb-F)",1,1]
[null,"Heat required  ","Btu/hr",{"$f":"D169*60*D170*(D163-D162)","v":0},{"$f":"E169*60*E170*(E163-E162)","v":0}]
[]
[null,"Heat required calculations-Air"]
[null,"Mean temp of air","deg. F",{"$f":"(D162+D163)/2","v":0},{"$f":"(E162+E163)/2","v":0}]
[null,"Sp. Heat of air at average air temperature ","Btu/(lb-F)",{"$f":"$L$27+$L$28*D174+$L$29*D174^2-$L$30*D174^3","v":0.23710000000000001},{"$f":"$L$27+$L$28*E174+$L$29*E174^2-$L$30*E174^3","v":0.23710000000000001}]
[null,"Density of air at NTP (032 F, 1 atm.) ","lb/SCF",7.6300000000000007E-2,7.6300000000000007E-2]
[null,"Mass flow of air","lb/hr.",{"$f":"D161*$L$19*60","v":0},{"$f":"E161*$L$19*60","v":0}]
[null,"Heat required ","Btu/hr",{"$f":"D175*D177*(D163-D162)","v":0},{"$f":"E175*E177*(E163-E162)","v":0}]
[]
[null,"Heat required calculations-Other Fluid"]
[]
[null,"Sp. Heat of Gas or Liquid ","(Btu/(lb-F)",{"$f":"D159","v":0},{"$f":"E159","v":0}]
[null,"Density of Gas or Liquid NTP (32 F, 1 atm.) ","lb/SCF or lb/gal",{"$f":"D160","v":0},{"$f":"E160","v":0}]
[null,"Mass flow of Gas or Liquid","lb/hr.",{"$f":"D161*D183*60","v":0},{"$f":"E161*E183*60","v":0}]
[]
[null,"Heat required ","Btu/hr",{"$f":"D182*D184*(D163-D162)","v":0},{"$f":"E182*E184*(E163-E162)","v":0}]
[]
[null,"If Air or Water",null,{"$f":"OR((D158=\"Air\"),(D158=\"Water\"))","v":false},{"$f":"OR((E158=\"Air\"),(E158=\"Water\"))","v":false}]
[null,"If Air or Water",null,{"$f":"IF(D158=\"Air\",(D178*D188),(D171*D188))","v":0},{"$f":"IF(E158=\"Air\",(E178*E188),(E171*E188))","v":0}]
[null,"If Other Gas or Liquid",null,{"$f":"OR((D158=\"Other Gas\"),(D158=\"Other Liquid\"))","v":true},{"$f":"OR((E158=\"Other Gas\"),(E158=\"Other Liquid\"))","v":true}]
[null,null,"Total",{"$f":"IF(D190,D186,D189)","v":0},{"$f":"IF(E190,E186,E189)","v":0}]
[]
[]
[null,"Cooling - Loop 6"]
[null,null,null,"Current ","Modified "]
[null,"Cooling Medium",null,"AIR","AIR"]
[null,"Average Specific Heat ","(Btu/lb-F)",0.25,0.25]
[null,"Density",{"$f":"IF(B199=\"Gas Flow\",\"(lb/SCF)\", \"(lb/gal)\")","v":"(lb/SCF)"},0.08,0.08]
[null,{"$f":"IF(OR(D196=\"Air\",D196=\"OTHER GAS\"),K$7,K$6)","v":"Gas Flow"},{"$f":"IF(B199=\"Gas Flow\",L$7,L$6)","v":"SCFM"}]
[null,"Inlet Temperature","deg. F."]
[null,{"$f":"IF(OR(D196=\"Water\",E196=\"Water\",D196=\"Other Liquid\",E196=\"Other Liquid\"), \"Outlet Temperature (Below boiling point)\",\"Outlet Temperature\")","v":"Outlet Temperature"},"deg. F."]
[null,"Heat Required","Btu/hr",{"$f":"D230","v":0},{"$f":"E230","v":0}]
[null,"Correction factor ",null,1,1]
[]
[null,"Heat required calculations-Water"]
[]
[null,"Flow rate of water  (l/min)","gal/min",{"$f":"D199","v":0},{"$f":"E199","v":0}]
[null,"Mass flow  for water - rate ","lb/min",{"$f":"D207*8.335","v":0},{"$f":"E207*8.335","v":0}]
[null,"Sp. Heat of water  ","(Btu/(lb-F)",1,1]
[null,"Heat required  ","Btu/hr",{"$f":"D208*60*D209*(D201-D200)","v":0},{"$f":"E208*60*E209*(E201-E200)","v":0}]
[]
[null,"Heat required calculations-Air"]
[null,"Mean temp of air","deg. F",{"$f":"(D200+D201)/2","v":0},{"$f":"(E200+E201)/2","v":0}]
[null,"Sp. Heat of air at average air temperature ","Btu/(lb-F)",{"$f":"$L$27+$L$28*D213+$L$29*D213^2-$L$30*D213^3","v":0.23710000000000001},{"$f":"$L$27+$L$28*E213+$L$29*E213^2-$L$30*E213^3","v":0.23710000000000001}]
[null,"Density of air at NTP (32 F, 1 atm.) ","lb/ft^3",7.6300000000000007E-2,7.6300000000000007E-2]
[null,"Mass flow of air","lb/hr.",{"$f":"D199*$L$19*60","v":0},{"$f":"E199*$L$19*60","v":0}]
[null,"Heat required ","Btu/hr",{"$f":"D214*D216*(D201-D200)","v":0},{"$f":"E214*E216*(E201-E200)","v":0}]
[]
[null,"Heat required calculations-Other Fluid"]
[]
[null,"Sp. Heat of Gas or Liquid ","(Btu/(lb-F)",{"$f":"D198","v":0.08},{"$f":"E198","v":0.08}]
[null,"Density of Gas or Liquid NTP (0 C, 100 pa) ","lb/ft^3 or lb/gal",{"$f":"D197","v":0.25},{"$f":"E197","v":0.25}]
[null,"Mass flow of Gas or Liquid","lb/hr.",{"$f":"D199*D222*60","v":0},{"$f":"E199*E222*60","v":0}]
[]
[null,"Heat required ","Btu/hr",{"$f":"D221*D223*(D201-D200)","v":0},{"$f":"E221*E223*(E201-E200)","v":0}]
[]
[null,"If Air or Water",null,{"$f":"OR((D196=\"Air\"),(D196=\"Water\"))","v":true},{"$f":"OR((E196=\"Air\"),(E196=\"Water\"))","v":true}]
[null,"If Air or Water",null,{"$f":"IF(D196=\"Air\",(D217*D227),(D210*D227))","v":0},{"$f":"IF(E196=\"Air\",(E217*E227),(E210*E227))","v":0}]
[null,"If Other Gas or Liquid",null,{"$f":"OR((D196=\"Other Gas\"),(D196=\"Other Liquid\"))","v":false},{"$f":"OR((E196=\"Other Gas\"),(E196=\"Other Liquid\"))","v":false}]
[null,null,"Total",{"$f":"IF(D229,D225,D228)","v":0},{"$f":"IF(E229,E225,E228)","v":0}]
[]
[]
[null,"Total Heat loss for cooling ","Btu/hr",{"$f":"(D13*D14*$L$13)+(D50*D51*$L$50)+(D88*D89*$L$84)+(D126*D127*$L$108)+(D164*D165*$L$134)+(D202*D203*$L$161)","v":0},{"$f":"(E13*E14*$L$13)+(E50*E51*$L$50)+(E88*E89*$L$84)+(E126*E127*$L$108)+(E164*E165*$L$134)+(E202*E203*$L$161)","v":0}]
[]
[null,"NOTES:"]
[null,"Enter notes here on proposed changes for the \"Modified\" conditions."]

{"sheet":"Atmosphere losses","index":14,"n_rows":60,"n_cols":13,"rows_kept":60,"cut":false,"hidden":false,"merged":[[53,1,53,4],[28,1,29,1],[28,2,29,2],[39,1,40,1],[39,2,40,2],[52,1,52,4],[3,1,3,4],[5,1,6,1],[5,2,6,2],[16,1,17,1],[16,2,17,2],[54,1,54,4],[55,1,55,4],[56,1,56,4],[57,1,57,4],[58,1,58,4]]}
[]
[null,"Number of atmosphere-gases",{"$f":"'Control page'!D17","v":3},"From Control Sheet"]
[]
[null,"Atmosphere losses ",null,null,null,null,null,null,null,"Process Atmosphere","Specific Heat ","Specific Heat "]
[null,null,null,"Current ","Modified",null,null,null,"Copy Current to Modified",null,"Btu/(s.cu.ft.- deg. F)",{"$f":"K5","v":"Btu/(s.cu.ft.- deg. F)"}]
[null,"Atmosphere Gas 1",null,"Hydrogen",{"$f":"D6","v":"Hydrogen"},null,null,null,"Done Entering Data","Conversion factor",1,1]
[null,null,null,null,null,null,null,null,"Help","Nitrogen",{"$f":"0.0185","v":1.8499999999999999E-2},{"$f":"K7","v":1.8499999999999999E-2},""]
[null,"Specific heat of the gas (air or atmosphere) ","Btu/(SCF- deg. F)",{"$f":"IF(D6=\"Other\",M8,VLOOKUP($D6,$J$7:$L$14,3,))","v":1.8200000000000001E-2},{"$f":"D8","v":1.8200000000000001E-2},null,"F",{"$f":"D9*1.8+32","v":32},"Print Sheet","Hydrogen",1.8200000000000001E-2,1.8200000000000001E-2,"0"]
[null,"Initial Temperature","deg. F.",null,null,null,"F",{"$f":"D10*1.8+32","v":32},null,"Exothermic gas",1.8499999999999999E-2,1.8499999999999999E-2]
[null,"Final Temperature","deg. F.",null,null,null,"scfh",{"$f":"D11*35.31","v":0},null,"Endothermic gas",{"$f":"0.0185","v":1.8499999999999999E-2},1.8499999999999999E-2]
[null,"Flow Rate","SCF/hr",null,null,null,"Btu/hr",{"$f":"0.0195*H10*(H9-H8)","v":0},{"$f":"IF('Control page'!D$17=0,0,1)","v":1},"Air",1.84E-2,1.84E-2]
[null,"Correction factor ",null,1,1,null,null,null,null,"Water vapor",2.12E-2,{"$f":"K12","v":2.12E-2}]
[null,"Heat Loss","Btu/hr",{"$f":"D11*D12*D8*(D10-D9)","v":0},{"$f":"E11*E12*E8*(E10-E9)","v":0},null,"kJ/hr",{"$f":"H11*1.055","v":0},null,"Other","?"]
[]
[]
[null,null,null,"Current ","Modified"]
[null,"Makeup Air ",null,"Nitrogen",{"$f":"D17","v":"Nitrogen"}]
[null,null,null,null,null,null,null,null,null,null,null,null,"Enter Material Name"]
[null,"Specific heat of the gas (air or atmosphere) ","Btu/(SCF- deg. F)",{"$f":"IF(D17=\"Other\",M19,VLOOKUP($D17,$J$7:$L$14,3,))","v":1.8499999999999999E-2},{"$f":"D19","v":1.8499999999999999E-2},null,"F",{"$f":"D20*1.8+32","v":32},null,null,null,null,0]
[null,"Initial Temperature","deg. F.",null,null,null,"F",{"$f":"D21*1.8+32","v":32}]
[null,"Final Temperature","deg. F.",null,null,null,"scfh",{"$f":"D22*35.31","v":0}]
[null,"Flow Rate","SCF/hr",null,null,null,"Btu/hr",{"$f":"0.0195*H21*(H20-H19)","v":0},{"$f":"IF('Control page'!D$17=0,0,1)","v":1},"Control"]
[null,"Correction factor ",null,1,1]
[null,"Heat Loss","Btu/hr",{"$f":"D22*D23*D19*(D21-D20)","v":0},{"$f":"E22*E23*E19*(E21-E20)","v":0},null,"kJ/hr",{"$f":"H22*1.055","v":0}]
[]
[]
[]
[null,null,null,"Current ","Modified"]
[null,"Atmosphere Gas 2",null,"Nitrogen",{"$f":"D29","v":"Nitrogen"}]
[null,null,null,null,null,null,null,null,null,null,null,null,"Enter Material Name"]
[null,"Specific heat of the gas (air or atmosphere) ","Btu/(SCF- deg. F)",{"$f":"IF(D29=\"Other\",M31,VLOOKUP($D29,$J$7:$L$14,3,))","v":1.8499999999999999E-2},{"$f":"D31","v":1.8499999999999999E-2},null,"F",{"$f":"D32*1.8+32","v":32},null,null,null,null,0]
[null,"Initial Temperature","deg. F.",null,null,null,"F",{"$f":"D33*1.8+32","v":32}]
[null,"Final Temperature","deg. F.",null,null,null,"scfh",{"$f":"D34*35.31","v":0}]
[null,"Flow Rate","SCF/hr",null,null,null,"Btu/hr",{"$f":"0.0195*H33*(H32-H31)","v":0},{"$f":"IF('Control page'!D$17>1,1,0)","v":1},"Control"]
[null,"Correction factor ",null,1,1]
[null,"Heat Loss","Btu/hr",{"$f":"D34*D35*D31*(D33-D32)","v":0},{"$f":"E34*E35*E31*(E33-E32)","v":0},null,"kJ/hr",{"$f":"H34*1.055","v":0}]
[]
[]
[null,null,null,"Current ","Modified"]
[null,"Atmosphere Gas 3",null,"Nitrogen",{"$f":"D40","v":"Nitrogen"}]
[null,null,null,null,null,null,null,null,null,null,null,null,"Enter Material Name"]
[null,"Specific heat of the gas (air or atmosphere) ","Btu/(SCF- deg. F)",{"$f":"IF(D40=\"Other\",M42,VLOOKUP($D40,$J$7:$L$14,3,))","v":1.8499999999999999E-2},{"$f":"D42","v":1.8499999999999999E-2},null,"F",{"$f":"D43*1.8+32","v":32},null,null,null,null,0]
[null,"Initial Temperature","deg. F.",null,null,null,"F",{"$f":"D44*1.8+32","v":32}]
[null,"Final Temperature","deg. F.",null,null,null,"scfh",{"$f":"D45*35.31","v":0}]
[null,"Flow Rate","SCF/hr",null,null,null,"Btu/hr",{"$f":"0.0195*H44*(H43-H42)","v":0},{"$f":"IF('Control page'!D$17>2,1,0)","v":1},"Control"]
[null,"Correction factor ",null,1,1]
[null,"Heat Loss","Btu/hr",{"$f":"D45*D46*D42*(D44-D43)","v":0},{"$f":"E45*E46*E42*(E44-E43)","v":0},null,"kJ/hr",{"$f":"H45*1.055","v":0}]
[]
[]
[null,"Total Heat Loss (Required)  for Process Atmosphere - Makeup Air","Btu/hr",{"$f":"(D47*I45)+(D36*I34)+(D24*I22)+(D13*I11)","v":0},{"$f":"(E47*I45)+(E36*I34)+(E24*I22)+(E13*I11)","v":0}]
[]
[null,null,null,null,null,null,"Btu/(scfF)",1.8499999999999999E-2]
[null,"NOTES:"]
[null,"Enter notes here on proposed changes for the \"Modified\" conditions."]
[null,null,null,null,null,null,null,null,{"$f":"IF(B55=\"\",0,1)","v":0}]
[null,null,null,null,null,null,null,null,{"$f":"IF(B56=\"\",0,1)","v":0}]
[null,null,null,null,null,null,null,null,{"$f":"IF(B57=\"\",0,1)","v":0}]
[null,null,null,null,null,null,null,null,{"$f":"IF(B58=\"\",0,1)","v":0}]
[null,null,null,null,null,null,null,null,{"$f":"IF(B59=\"\",0,1)","v":0}]
[null,null,null,null,null,null,null,null,{"$f":"SUM(I55:I59)","v":0}]

{"sheet":"Cp calculationsHTcurrent","index":15,"n_rows":159,"n_cols":14,"rows_kept":159,"cut":false,"hidden":true,"merged":[[7,11,8,11],[10,11,11,11],[13,11,14,11],[16,11,17,11],[31,11,32,11],[19,11,20,11],[22,11,23,11],[25,11,26,11],[28,11,29,11]]}
[]
[null,"Initial Gas temperature (F)",60]
[null,"Final Gas temperature (F)",1000]
[]
[]
[null,null,null,null,"Cp",null,"Cp","Sp. Vol","Sp. Wt","Sp. Gravity","Cp","Mean CP"]
[null,"Gas","Temp (F)","Temp ®","Btu/(#mole.F)","Mol wt","Btu/(#F)","SCF/#","#/SCF","wrt Air @stp","Btu/SCF","Btu/SCF"]
[null,"Oxygen",{"$f":"C2","v":60},{"$f":"460+C8","v":520},{"$f":"11.515-172/D8^0.5 +1530/D8","v":6.9146087262672413},32,{"$f":"E8/F8","v":0.21608152269585129},{"$f":"378.2/F8","v":11.81875},{"$f":"1/H8","v":8.4611316763617134E-2},{"$f":"I8/0.0763","v":1.1089294464432127},{"$f":"G8/H8","v":1.82829421635834E-2},{"$f":"(K8+K9)/2","v":1.8159907895190751E-2}]
[null,"Oxygen",{"$f":"'Av.Ht.Solid - current '!C88","v":0},{"$f":"460+C9","v":460},{"$f":"11.515-172/D9^0.5 +1530/D9","v":6.8215456056550403},32,{"$f":"E9/F9","v":0.21317330017672001},{"$f":"378.2/F9","v":11.81875},{"$f":"1/H9","v":8.4611316763617134E-2},{"$f":"I9/0.0763","v":1.1089294464432127},{"$f":"G9/H9","v":1.8036873626798098E-2}]
[]
[null,"Nitrogen",{"$f":"C8","v":60},{"$f":"460+C11","v":520},{"$f":"9.47-3.47*10^3/D11 +1.07*10^6/D11^2","v":6.7540236686390536},28,{"$f":"E11/F11","v":0.24121513102282335},{"$f":"378.2/F11","v":13.507142857142856},{"$f":"1/H11","v":7.4034902168164995E-2},{"$f":"I11/0.0763","v":0.97031326563781117},{"$f":"G11/H11","v":1.7858338626755829E-2},{"$f":"(K11+K12)/2","v":1.8161364599176031E-2}]
[null,"Nitrogen",{"$f":"C9","v":0},{"$f":"460+C12","v":460},{"$f":"9.47-3.47*10^3/D12 +1.07*10^6/D12^2","v":6.9832325141776943},28,{"$f":"E12/F12","v":0.24940116122063194},{"$f":"378.2/F12","v":13.507142857142856},{"$f":"1/H12","v":7.4034902168164995E-2},{"$f":"I12/0.0763","v":0.97031326563781117},{"$f":"G12/H12","v":1.8464390571596233E-2}]
[]
[null,"Carbon Monoxide",{"$f":"C11","v":60},{"$f":"460+C14","v":520},{"$f":"9.46-3.29*10^3/D14+1.07*10^6/D14^2","v":7.0901775147929005},28,{"$f":"E14/F14","v":0.25322062552831787},{"$f":"378.2/F14","v":13.507142857142856},{"$f":"1/H14","v":7.4034902168164995E-2},{"$f":"I14/0.0763","v":0.97031326563781117},{"$f":"G14/H14","v":1.8747164237950559E-2},{"$f":"(K14+K15)/2","v":1.9109881513480545E-2}]
[null,"Carbon Monoxide",{"$f":"C12","v":0},{"$f":"460+C15","v":460},{"$f":"9.46-3.29*10^3/D15+1.07*10^6/D15^2","v":7.3645368620037814},28,{"$f":"E15/F15","v":0.26301917364299221},{"$f":"378.2/F15","v":13.507142857142856},{"$f":"1/H15","v":7.4034902168164995E-2},{"$f":"I15/0.0763","v":0.97031326563781117},{"$f":"G15/H15","v":1.9472598789010531E-2}]
[]
[null,"Hydrogen",{"$f":"C14","v":60},{"$f":"460+C17","v":520},{"$f":"5.76+0.578*D17/10^3+20/D17^0.5","v":6.9376180193070294},2,{"$f":"E17/F17","v":3.4688090096535147},{"$f":"378.2/F17","v":189.1},{"$f":"1/H17","v":5.2882072977260709E-3},{"$f":"I17/0.0763","v":6.9308090402700792E-2},{"$f":"G17/H17","v":1.8343781119267662E-2},{"$f":"(K17+K18)/2","v":1.8371235890464493E-2}]
[null,"Hydrogen",{"$f":"C15","v":0},{"$f":"460+C18","v":460},{"$f":"5.76+0.578*D18/10^3+20/D18^0.5","v":6.9583848082403135},2,{"$f":"E18/F18","v":3.4791924041201567},{"$f":"378.2/F18","v":189.1},{"$f":"1/H18","v":5.2882072977260709E-3},{"$f":"I18/0.0763","v":6.9308090402700792E-2},{"$f":"G18/H18","v":1.8398690661661325E-2}]
[]
[null,"Water vapor (H2O)",{"$f":"C17","v":60},{"$f":"460+C20","v":520},{"$f":"19.86-597/D20^0.5+7500/D20","v":8.1028950467621002},18,{"$f":"E20/F20","v":0.4501608359312278},{"$f":"378.2/F20","v":21.011111111111109},{"$f":"1/H20","v":4.7593865679534643E-2},{"$f":"I20/0.0763","v":0.62377281362430714},{"$f":"G20/H20","v":2.1424894359497886E-2},{"$f":"(K20+K21)/2","v":2.1723921664298901E-2}]
[null,"Water vapor (H2O)",{"$f":"C18","v":0},{"$f":"460+C21","v":460},{"$f":"19.86-597/D21^0.5+7500/D21","v":8.3290793001135874},18,{"$f":"E21/F21","v":0.46272662778408818},{"$f":"378.2/F21","v":21.011111111111109},{"$f":"1/H21","v":4.7593865679534643E-2},{"$f":"I21/0.0763","v":0.62377281362430714},{"$f":"G21/H21","v":2.2022948969099915E-2}]
[]
[null,"Carbon Dioxide",{"$f":"C20","v":60},{"$f":"460+C23","v":520},{"$f":"16.2-6.53*10^3/D23+1.41*10^6/D23^2","v":8.8568047337278095},44,{"$f":"E23/F23","v":0.20129101667563204},{"$f":"378.2/F23","v":8.5954545454545457},{"$f":"1/H23","v":0.11634056054997356},{"$f":"I23/0.0763","v":1.5247779888594175},{"$f":"G23/H23","v":2.3418309713717105E-2},{"$f":"(K23+K24)/2","v":2.3168520132030267E-2}]
[null,"Carbon Dioxide",{"$f":"C21","v":0},{"$f":"460+C24","v":460},{"$f":"16.2-6.53*10^3/D24+1.41*10^6/D24^2","v":8.6678638941398862},44,{"$f":"E24/F24","v":0.19699690668499742},{"$f":"378.2/F24","v":8.5954545454545457},{"$f":"1/H24","v":0.11634056054997356},{"$f":"I24/0.0763","v":1.5247779888594175},{"$f":"G24/H24","v":2.2918730550343432E-2}]
[]
[null,"Methane - CH4",{"$f":"C23","v":60},{"$f":"460+C26","v":520},{"$f":"4.23+0.01177*D26","v":10.3504},16,{"$f":"E26/F26","v":0.64690000000000003},{"$f":"378.2/F26","v":23.637499999999999},{"$f":"1/H26","v":4.2305658381808567E-2},{"$f":"I26/0.0763","v":0.55446472322160634},{"$f":"G26/H26","v":2.7367530407191965E-2},{"$f":"(K26+K27)/2","v":2.6433897408778426E-2}]
[null,"Methane - CH5",{"$f":"C24","v":0},{"$f":"460+C27","v":460},{"$f":"4.23+0.01177*D27","v":9.6441999999999997},16,{"$f":"E27/F27","v":0.60276249999999998},{"$f":"378.2/F27","v":23.637499999999999},{"$f":"1/H27","v":4.2305658381808567E-2},{"$f":"I27/0.0763","v":0.55446472322160634},{"$f":"G27/H27","v":2.5500264410364886E-2}]
[]
[null,"Ethylene C2H4",{"$f":"C26","v":60},{"$f":"460+C29","v":520},{"$f":"4.52+0.00737*D29","v":8.3523999999999994},28,{"$f":"E29/F29","v":0.29829999999999995},{"$f":"378.2/F29","v":13.507142857142856},{"$f":"1/H29","v":7.4034902168164995E-2},{"$f":"I29/0.0763","v":0.97031326563781117},{"$f":"G29/H29","v":2.2084611316763616E-2},{"$f":"(K29+K30)/2","v":2.1499999999999998E-2}]
[null,"Ethylene C2H5",{"$f":"C27","v":0},{"$f":"460+C30","v":460},{"$f":"4.52+0.00737*D30","v":7.9101999999999997},28,{"$f":"E30/F30","v":0.28250714285714285},{"$f":"378.2/F30","v":13.507142857142856},{"$f":"1/H30","v":7.4034902168164995E-2},{"$f":"I30/0.0763","v":0.97031326563781117},{"$f":"G30/H30","v":2.0915388683236384E-2}]
[]
[null,"Ethane C2H6",{"$f":"C29","v":60},{"$f":"460+C32","v":520},{"$f":"4.04+0.01636*D32","v":12.5472},30,{"$f":"E32/F32","v":0.41824},{"$f":"378.2/F32","v":12.606666666666666},{"$f":"1/H32","v":7.9323109465891065E-2},{"$f":"I32/0.0763","v":1.0396213560405119},{"$f":"G32/H32","v":3.3176097303014282E-2},{"$f":"(K32+K33)/2","v":3.18783712321523E-2}]
[null,"Ethane C2H7",{"$f":"C30","v":0},{"$f":"460+C33","v":460},{"$f":"4.04+0.01636*D33","v":11.5656},30,{"$f":"E33/F33","v":0.38551999999999997},{"$f":"378.2/F33","v":12.606666666666666},{"$f":"1/H33","v":7.9323109465891065E-2},{"$f":"I33/0.0763","v":1.0396213560405119},{"$f":"G33/H33","v":3.0580645161290321E-2}]
[]
[null,"Source - Gas Engineers Handbook "]
[]
[null,"For Air at 60 F., 80% Humidity "]
[null,"Composition of gas mixture ","% Vol","% mass","Mean CP Btu/scf","Cp-60 F","Cp 1000F"]
[null,"Oxygen ",20.7,null,{"$f":"L8","v":1.8159907895190751E-2},{"$f":"K8","v":1.82829421635834E-2},{"$f":"K9","v":1.8036873626798098E-2}]
[null,"Carbon Dioxide",0,null,{"$f":"L23","v":2.3168520132030267E-2},{"$f":"K23","v":2.3418309713717105E-2},{"$f":"K24","v":2.2918730550343432E-2}]
[null,"Nitrogen & Other",78.3,null,{"$f":"L11","v":1.8161364599176031E-2},{"$f":"K11","v":1.7858338626755829E-2},{"$f":"K12","v":1.8464390571596233E-2}]
[null,"Water vapor",1,null,{"$f":"L20","v":2.1723921664298901E-2},{"$f":"K20","v":2.1424894359497886E-2},{"$f":"K21","v":2.2022948969099915E-2}]
[]
[null,"Total",{"$f":"SUM(C39:C43)","v":100}]
[null,"Mean value",null,null,{"$f":"($C$39*E39+$C$40*E40+$C$41*E41+$C$42*E42)/100","v":1.8196688632102304E-2},{"$f":"($C$39*F39+$C$40*F40+$C$41*F41+$C$42*F42)/100","v":1.7981897116206558E-2},{"$f":"($C$39*G39+$C$40*G40+$C$41*G41+$C$42*G42)/100","v":1.8411480147998052E-2}]
[]
[null,null,null,null,null,"B",{"$f":"(G45-F45)/(1000-60)","v":4.570032253100998E-7}]
[null,null,null,null,null,"A",{"$f":"G45-G47*1000","v":1.7954476922687951E-2}]
[]
[null,null,null,null,"cp for air"]
[null,null,null,null,"Temp","Cp (Btu/scf)"]
[null,null,null,null,60,{"$f":"$G$48+$G$47*E52","v":1.7981897116206558E-2}]
[null,null,null,null,100,1.8000177245218962E-2]
[null,null,null,null,{"$f":"100+E53","v":200},1.804587756774997E-2]
[null,null,null,null,300,1.8091577890280982E-2]
[null,null,null,null,400,1.813727821281199E-2]
[null,null,null,null,500,1.8182978535343002E-2]
[null,null,null,null,600,1.822867885787401E-2]
[null,null,null,null,700,1.8274379180405021E-2]
[null,null,null,null,800,1.8320079502936029E-2]
[null,null,null,null,900,1.8365779825467041E-2]
[null,null,null,null,1000,1.8411480147998052E-2]
[null,null,null,null,1100,1.845718047052906E-2]
[null,null,null,null,1200,1.8502880793060072E-2]
[null,null,null,null,1300,1.854858111559108E-2]
[null,null,null,null,1400,1.8594281438122091E-2]
[null,null,null,null,1500,1.8639981760653099E-2]
[null,null,null,null,{"$f":"'Av.Ht.Solid - current '!C86","v":0},1.7954476922687951E-2,"Air temp. entering sp. Ht. "]
[]
[null,null,null,null,{"$f":"100+E67","v":1600},{"$f":"$G$48+$G$47*E70","v":1.8685682083184111E-2}]
[null,null,null,null,"Cp",null,"Cp","Sp. Vol","Sp. Wt","Sp. Gravity","Cp","Mean CP"]
[null,"Gas","Temp (F)","Temp ®","Btu/(#mole.F)","Mol wt","Btu/(#F)","SCF/#","#/SCF","wrt Air @stp","Btu/SCF","Btu/SCF"]
[null,"Water vapor (H2O)",300,{"$f":"460+C73","v":760},{"$f":"19.86-597/D73^0.5+7500/D73","v":8.0729549868477299},18,{"$f":"E73/F73","v":0.44849749926931831},{"$f":"378.2/F73","v":21.011111111111109},{"$f":"1/H73","v":4.7593865679534643E-2},{"$f":"I73/0.0763","v":0.62377281362430714},{"$f":"G73/H73","v":2.1345729737831123E-2},null,null,{"$f":"E73/(18*21.011)","v":2.1345842619071836E-2}]
[null,null,{"$f":"C73+100","v":400},860,8.2233991993645041,{"$f":"F73","v":18},0.4568555110758058,21.011111111111109,4.7593865679534643E-2,0.62377281362430714,2.1743519829097051E-2,null,null,2.1743634813945353E-2]
[null,null,500,960,8.4044078526180996,18,0.46691154736767221,21.011111111111109,4.7593865679534643E-2,0.62377281362430714,2.2222125469640669E-2,null,null,2.2222242985468193E-2]
[null,null,600,1060,8.5987624606197635,18,0.47770902558998685,21.011111111111109,4.7593865679534643E-2,0.62377281362430714,2.2736019197831209E-2,null,null,2.2736139431249674E-2]
[null,null,700,1160,8.7969936888654097,18,0.4887218716036339,21.011111111111109,4.7593865679534643E-2,0.62377281362430714,2.3260163111754127E-2,null,null,2.3260286116968915E-2]
[null,null,800,1260,8.993811283283474,18,0.49965618240463744,21.011111111111109,4.7593865679534643E-2,0.62377281362430714,2.3780569231315375E-2,null,null,2.3780694988560159E-2]
[null,null,900,1360,9.1862704676357225,18,0.51034835931309575,21.011111111111109,4.7593865679534643E-2,0.62377281362430714,2.4289451262918361E-2,null,null,2.4289579711251046E-2]
[null,null,1000,1460,9.3727822120519821,18,0.52071012289177676,21.011111111111109,4.7593865679534643E-2,0.62377281362430714,2.47826076468852E-2,null,null,2.4782738703144867E-2]
[null,null,1100,1560,9.5525572539685832,18,0.53069762522047681,21.011111111111109,4.7593865679534643E-2,0.62377281362430714,2.525795149119139E-2,null,null,2.5258085061181136E-2]
[null,null,1200,1660,9.7252835829932174,18,0.54029353238851208,21.011111111111109,4.7593865679534643E-2,0.62377281362430714,2.5714657808020142E-2]
[null,null,1300,1760,9.8909344918731712,18,0.5494963606596206,21.011111111111109,4.7593865679534643E-2,0.62377281362430714,2.6152655980627108E-2]
[null,null,1400,1860,10.049652026075105,18,0.55831400144861698,21.011111111111109,4.7593865679534643E-2,0.62377281362430714,2.6572321591948986E-2]
[null,null,1500,1960,10.201675161384022,18,0.56675973118800127,21.011111111111109,4.7593865679534643E-2,0.62377281362430714,2.6974286518730892E-2]
[null,null,1600,2060,10.347295119238058,18,0.57484972884655883,21.011111111111109,4.7593865679534643E-2,0.62377281362430714,2.7359320780640031E-2]
[null,null,1700,2160,10.486827457300954,18,0.58260152540560861,21.011111111111109,4.7593865679534643E-2,0.62377281362430714,2.7728258744846527E-2]
[null,null,1800,2260,10.620594687733073,18,0.59003303820739295,21.011111111111109,4.7593865679534643E-2,0.62377281362430714,2.8081953166930393E-2]
[null,null,1900,2360,10.748915580525086,18,0.59716197669583815,21.011111111111109,4.7593865679534643E-2,0.62377281362430714,2.8421246907787117E-2]
[null,null,2000,2460,10.872098747513114,18,0.60400548597295078,21.011111111111109,4.7593865679534643E-2,0.62377281362430714,2.8746955969098664E-2]
[null,null,2100,2560,10.990438980496736,18,0.6105799433609298,21.011111111111109,4.7593865679534643E-2,0.62377281362430714,2.9059859810937963E-2]
[null,null,2200,2660,11.104215362312942,18,0.6169008534618301,21.011111111111109,4.7593865679534643E-2,0.62377281362430714,2.9360696357252625E-2]
[null,null,2300,2760,11.213690514016628,18,0.62298280633425707,21.011111111111109,4.7593865679534643E-2,0.62377281362430714,2.9650160005332174E-2]
[null,null,{"$f":"'Av.Ht.Solid - current '!C88","v":0},460,8.3290793001135874,18,0.46272662778408818,21.011111111111109,4.7593865679534643E-2,0.62377281362430714,2.2022948969099915E-2]
[]
[]
[]
[]
[]
[null,null,300,0.44849749926931831,{"$f":"0.424+6*10^-5*C100+7*10^-8*C100^2-4*10^-11*C100^3+8*10^-15*C100^4","v":0.44728479999999998},{"$f":"(D100-E100)/D100","v":2.7039153424356448E-3}]
[null,null,400,0.4568555110758058,0.4568448,2.3445215272942999E-5]
[null,null,500,0.46691154736767221,0.46700000000000003,-1.894419463953958E-4]
[null,null,600,0.47770902558998685,0.47759679999999999,2.349245753694021E-4]
[null,null,700,0.4887218716036339,0.48850079999999996,4.5234644995227987E-4]
[null,null,800,0.49965618240463744,0.49959679999999995,1.1884653233290155E-4]
[null,null,900,0.51034835931309575,0.51078880000000004,-8.6301969795123763E-4]
[null,null,1000,0.52071012289177676,0.52200000000000002,-2.4771500524320396E-3]
[null,null,1100,0.53069762522047681,0.5331728,-4.6640019888818766E-3]
[null,null,1200,0.54029353238851208,0.5442688,-7.357607250847862E-3]
[null,null,1300,0.5494963606596206,0.55526880000000001,-1.0504963733426948E-2]
[null,null,1400,0.55831400144861698,0.56617280000000003,-1.4075947461450715E-2]
[null,null,1500,0.56675973118800127,0.57699999999999996,-1.8068095258874105E-2]
[null,null,1600,0.57484972884655883,0.58778880000000011,-2.2508614867756217E-2]
[null,null,1700,0.58260152540560861,0.59859680000000004,-2.74549136877997E-2]
[null,null,1800,0.59003303820739295,0.60950079999999995,-3.2994358844299514E-2]
[null,null,1900,0.59716197669583815,0.62059680000000006,-3.9243662889973885E-2]
[null,null,2000,0.60400548597295078,0.63200000000000001,-4.6348112189667931E-2]
[null,null,2100,0.6105799433609298,0.64384480000000011,-5.448075555178624E-2]
[null,null,2200,0.6169008534618301,0.65628480000000011,-6.3841614608184105E-2]
[null,null,2300,0.62298280633425707,0.66949280000000022,-7.465694589456863E-2]
[]
[]
[]
[]
[]
[null,null,null,"Btu/(scf-F)","Btu/(# - F)",null,"Avg. Btu/(scf-F)"]
[null,{"$f":"B128-100","v":0},{"$f":"B127+460","v":460},{"$f":"(19.86-597/C127^0.5+7500/C127)/(18*21.011)","v":2.202306543163525E-2},{"$f":"(19.86-597/C127^0.5+7500/C127)/18","v":0.46272662778408818},null,{"$f":"($K$73+(D127-$K$73)/2)","v":2.1684397584733187E-2},null,{"$f":"(D127+$D$127)/2","v":2.202306543163525E-2},null,{"$f":"(D127-I127)/D127","v":0}]
[null,100,560,2.1219050971213283E-2,0.44583347995616229,null,2.1282390354522202E-2,null,2.1621058201424265E-2,null,-1.8945580118373939E-2]
[null,200,660,2.1114450315482633E-2,0.44363571557860559,null,2.1230090026656878E-2,null,2.1568757873558941E-2,null,-2.1516428383796353E-2]
[null,300,760,2.1345842619071836E-2,0.44849749926931831,null,2.1345786178451481E-2,null,2.1684454025353544E-2,null,-1.5863107974907028E-2]
[null,400,860,2.1743634813945353E-2,0.4568555110758058,null,2.1544682275888238E-2,null,2.1883350122790302E-2,null,-6.4255728189171633E-3]
[null,500,960,2.2222242985468193E-2,0.46691154736767221,null,2.178398636164966E-2,null,2.2122654208551723E-2,null,4.4814907739778552E-3]
[null,600,1060,2.2736139431249674E-2,0.47770902558998685,null,2.20409345845404E-2,null,2.2379602431442464E-2,null,1.5681510085972124E-2]
[null,700,1160,2.3260286116968915E-2,0.4887218716036339,null,2.2303007927400018E-2,null,2.2641675774302081E-2,null,2.6595130410521646E-2]
[null,800,1260,2.3780694988560159E-2,0.49965618240463744,null,2.2563212363195639E-2,null,2.2901880210097703E-2,null,3.6954966155750085E-2]
[null,900,1360,2.4289579711251046E-2,0.51034835931309575,null,2.2817654724541087E-2,null,2.315632257144315E-2,null,4.6656103287080204E-2]
[null,1000,1460,2.4782738703144867E-2,0.52071012289177676,null,2.3064234220487995E-2,null,2.3402902067390059E-2,null,5.5677326557121425E-2]
[null,1100,1560,2.5258085061181136E-2,0.53069762522047681,null,2.330190739950613E-2,null,2.3640575246408193E-2,null,6.4039289235702027E-2]
[null,1200,1660,2.5714793793180341E-2,0.54029353238851208,null,2.3530261765505732E-2,null,2.3868929612407795E-2,null,7.1782188712789741E-2]
[null,1300,1760,2.6152794282024685E-2,0.5494963606596206,null,2.3749262009927906E-2,null,2.4087929856829969E-2,null,7.8953874026911786E-2]
[null,1400,1860,2.6572462112637047E-2,0.55831400144861698,null,2.3959095925234083E-2,null,2.4297763772136147E-2,null,8.5603597094569703E-2]
[null,1500,1960,2.6974429165104053E-2,0.56675973118800127,null,2.4160079451467587E-2,null,2.449874729836965E-2,null,9.1778841790547058E-2]
[null,1600,2060,2.7359465463164954E-2,0.57484972884655883,null,2.4352597600498037E-2,null,2.46912654474001E-2,null,9.7523835740034787E-2]
[null,1700,2160,2.77284053784022E-2,0.58260152540560861,null,2.453706755811666E-2,null,2.4875735405018723E-2,null,0.10287897679126677]
[null,1800,2260,2.8082101670905382E-2,0.59003303820739295,null,2.4713915704368254E-2,null,2.5052583551270317E-2,null,0.10788074750024189]
[null,1900,2360,2.8421397206027231E-2,0.59716197669583815,null,2.4883563471929177E-2,null,2.522223131883124E-2,null,0.11256187948837203]
[null,2000,2460,2.8747107989764924E-2,0.60400548597295078,null,2.5046418863798024E-2,null,2.5385086710700087E-2,null,0.11695163493530709]
[null,2100,2560,2.906001348631335E-2,0.6105799433609298,null,2.5202871612072235E-2,null,2.5541539458974298E-2,null,0.12107613195004807]
[null,2200,2660,2.9360851623522449E-2,0.6169008534618301,null,2.5353290680676786E-2,null,2.569195852757885E-2,null,0.12495867432551805]
[null,2300,2760,2.965031680235387E-2,0.62298280633425707,null,2.5498023270092499E-2,null,2.5836691116994562E-2,null,0.12862006536997789]
[]
[]
[]
[null,"Average value "]
[null,null,null,"(19.86-597/C122^0.5+7500/C122)/(18*21.011)"]
[]
[null,null,null,19.86,597,7500]
[]
[null,100]

{"sheet":"Cp calculationsHTmod","index":16,"n_rows":159,"n_cols":14,"rows_kept":159,"cut":false,"hidden":true,"merged":[[25,11,26,11],[28,11,29,11],[31,11,32,11],[7,11,8,11],[10,11,11,11],[13,11,14,11],[16,11,17,11],[19,11,20,11],[22,11,23,11]]}
[]
[null,"Initial Gas temperature (F)",60]
[null,"Final Gas temperature (F)",1000]
[]
[]
[null,null,null,null,"Cp",null,"Cp","Sp. Vol","Sp. Wt","Sp. Gravity","Cp","Mean CP"]
[null,"Gas","Temp (F)","Temp ®","Btu/(#mole.F)","Mol wt","Btu/(#F)","SCF/#","#/SCF","wrt Air @stp","Btu/SCF","Btu/SCF"]
[null,"Oxygen",{"$f":"C2","v":60},{"$f":"460+C8","v":520},{"$f":"11.515-172/D8^0.5 +1530/D8","v":6.9146087262672413},32,{"$f":"E8/F8","v":0.21608152269585129},{"$f":"378.2/F8","v":11.81875},{"$f":"1/H8","v":8.4611316763617134E-2},{"$f":"I8/0.0763","v":1.1089294464432127},{"$f":"G8/H8","v":1.82829421635834E-2},{"$f":"(K8+K9)/2","v":1.8159907895190751E-2}]
[null,"Oxygen",{"$f":"'Av.Ht.Solid - modified'!C88","v":0},{"$f":"460+C9","v":460},{"$f":"11.515-172/D9^0.5 +1530/D9","v":6.8215456056550403},32,{"$f":"E9/F9","v":0.21317330017672001},{"$f":"378.2/F9","v":11.81875},{"$f":"1/H9","v":8.4611316763617134E-2},{"$f":"I9/0.0763","v":1.1089294464432127},{"$f":"G9/H9","v":1.8036873626798098E-2}]
[]
[null,"Nitrogen",{"$f":"C8","v":60},{"$f":"460+C11","v":520},{"$f":"9.47-3.47*10^3/D11 +1.07*10^6/D11^2","v":6.7540236686390536},28,{"$f":"E11/F11","v":0.24121513102282335},{"$f":"378.2/F11","v":13.507142857142856},{"$f":"1/H11","v":7.4034902168164995E-2},{"$f":"I11/0.0763","v":0.97031326563781117},{"$f":"G11/H11","v":1.7858338626755829E-2},{"$f":"(K11+K12)/2","v":1.8161364599176031E-2}]
[null,"Nitrogen",{"$f":"C9","v":0},{"$f":"460+C12","v":460},{"$f":"9.47-3.47*10^3/D12 +1.07*10^6/D12^2","v":6.9832325141776943},28,{"$f":"E12/F12","v":0.24940116122063194},{"$f":"378.2/F12","v":13.507142857142856},{"$f":"1/H12","v":7.4034902168164995E-2},{"$f":"I12/0.0763","v":0.97031326563781117},{"$f":"G12/H12","v":1.8464390571596233E-2}]
[]
[null,"Carbon Monoxide",{"$f":"C11","v":60},{"$f":"460+C14","v":520},{"$f":"9.46-3.29*10^3/D14+1.07*10^6/D14^2","v":7.0901775147929005},28,{"$f":"E14/F14","v":0.25322062552831787},{"$f":"378.2/F14","v":13.507142857142856},{"$f":"1/H14","v":7.4034902168164995E-2},{"$f":"I14/0.0763","v":0.97031326563781117},{"$f":"G14/H14","v":1.8747164237950559E-2},{"$f":"(K14+K15)/2","v":1.9109881513480545E-2}]
[null,"Carbon Monoxide",{"$f":"C12","v":0},{"$f":"460+C15","v":460},{"$f":"9.46-3.29*10^3/D15+1.07*10^6/D15^2","v":7.3645368620037814},28,{"$f":"E15/F15","v":0.26301917364299221},{"$f":"378.2/F15","v":13.507142857142856},{"$f":"1/H15","v":7.4034902168164995E-2},{"$f":"I15/0.0763","v":0.97031326563781117},{"$f":"G15/H15","v":1.9472598789010531E-2}]
[]
[null,"Hydrogen",{"$f":"C14","v":60},{"$f":"460+C17","v":520},{"$f":"5.76+0.578*D17/10^3+20/D17^0.5","v":6.9376180193070294},2,{"$f":"E17/F17","v":3.4688090096535147},{"$f":"378.2/F17","v":189.1},{"$f":"1/H17","v":5.2882072977260709E-3},{"$f":"I17/0.0763","v":6.9308090402700792E-2},{"$f":"G17/H17","v":1.8343781119267662E-2},{"$f":"(K17+K18)/2","v":1.8371235890464493E-2}]
[null,"Hydrogen",{"$f":"C15","v":0},{"$f":"460+C18","v":460},{"$f":"5.76+0.578*D18/10^3+20/D18^0.5","v":6.9583848082403135},2,{"$f":"E18/F18","v":3.4791924041201567},{"$f":"378.2/F18","v":189.1},{"$f":"1/H18","v":5.2882072977260709E-3},{"$f":"I18/0.0763","v":6.9308090402700792E-2},{"$f":"G18/H18","v":1.8398690661661325E-2}]
[]
[null,"Water vapor (H2O)",{"$f":"C17","v":60},{"$f":"460+C20","v":520},{"$f":"19.86-597/D20^0.5+7500/D20","v":8.1028950467621002},18,{"$f":"E20/F20","v":0.4501608359312278},{"$f":"378.2/F20","v":21.011111111111109},{"$f":"1/H20","v":4.7593865679534643E-2},{"$f":"I20/0.0763","v":0.62377281362430714},{"$f":"G20/H20","v":2.1424894359497886E-2},{"$f":"(K20+K21)/2","v":2.1723921664298901E-2}]
[null,"Water vapor (H2O)",{"$f":"C18","v":0},{"$f":"460+C21","v":460},{"$f":"19.86-597/D21^0.5+7500/D21","v":8.3290793001135874},18,{"$f":"E21/F21","v":0.46272662778408818},{"$f":"378.2/F21","v":21.011111111111109},{"$f":"1/H21","v":4.7593865679534643E-2},{"$f":"I21/0.0763","v":0.62377281362430714},{"$f":"G21/H21","v":2.2022948969099915E-2}]
[]
[null,"Carbon Dioxide",{"$f":"C20","v":60},{"$f":"460+C23","v":520},{"$f":"16.2-6.53*10^3/D23+1.41*10^6/D23^2","v":8.8568047337278095},44,{"$f":"E23/F23","v":0.20129101667563204},{"$f":"378.2/F23","v":8.5954545454545457},{"$f":"1/H23","v":0.11634056054997356},{"$f":"I23/0.0763","v":1.5247779888594175},{"$f":"G23/H23","v":2.3418309713717105E-2},{"$f":"(K23+K24)/2","v":2.3168520132030267E-2}]
[null,"Carbon Dioxide",{"$f":"C21","v":0},{"$f":"460+C24","v":460},{"$f":"16.2-6.53*10^3/D24+1.41*10^6/D24^2","v":8.6678638941398862},44,{"$f":"E24/F24","v":0.19699690668499742},{"$f":"378.2/F24","v":8.5954545454545457},{"$f":"1/H24","v":0.11634056054997356},{"$f":"I24/0.0763","v":1.5247779888594175},{"$f":"G24/H24","v":2.2918730550343432E-2}]
[]
[null,"Methane - CH4",{"$f":"C23","v":60},{"$f":"460+C26","v":520},{"$f":"4.23+0.01177*D26","v":10.3504},16,{"$f":"E26/F26","v":0.64690000000000003},{"$f":"378.2/F26","v":23.637499999999999},{"$f":"1/H26","v":4.2305658381808567E-2},{"$f":"I26/0.0763","v":0.55446472322160634},{"$f":"G26/H26","v":2.7367530407191965E-2},{"$f":"(K26+K27)/2","v":2.6433897408778426E-2}]
[null,"Methane - CH5",{"$f":"C24","v":0},{"$f":"460+C27","v":460},{"$f":"4.23+0.01177*D27","v":9.6441999999999997},16,{"$f":"E27/F27","v":0.60276249999999998},{"$f":"378.2/F27","v":23.637499999999999},{"$f":"1/H27","v":4.2305658381808567E-2},{"$f":"I27/0.0763","v":0.55446472322160634},{"$f":"G27/H27","v":2.5500264410364886E-2}]
[]
[null,"Ethylene C2H4",{"$f":"C26","v":60},{"$f":"460+C29","v":520},{"$f":"4.52+0.00737*D29","v":8.3523999999999994},28,{"$f":"E29/F29","v":0.29829999999999995},{"$f":"378.2/F29","v":13.507142857142856},{"$f":"1/H29","v":7.4034902168164995E-2},{"$f":"I29/0.0763","v":0.97031326563781117},{"$f":"G29/H29","v":2.2084611316763616E-2},{"$f":"(K29+K30)/2","v":2.1499999999999998E-2}]
[null,"Ethylene C2H5",{"$f":"C27","v":0},{"$f":"460+C30","v":460},{"$f":"4.52+0.00737*D30","v":7.9101999999999997},28,{"$f":"E30/F30","v":0.28250714285714285},{"$f":"378.2/F30","v":13.507142857142856},{"$f":"1/H30","v":7.4034902168164995E-2},{"$f":"I30/0.0763","v":0.97031326563781117},{"$f":"G30/H30","v":2.0915388683236384E-2}]
[]
[null,"Ethane C2H6",{"$f":"C29","v":60},{"$f":"460+C32","v":520},{"$f":"4.04+0.01636*D32","v":12.5472},30,{"$f":"E32/F32","v":0.41824},{"$f":"378.2/F32","v":12.606666666666666},{"$f":"1/H32","v":7.9323109465891065E-2},{"$f":"I32/0.0763","v":1.0396213560405119},{"$f":"G32/H32","v":3.3176097303014282E-2},{"$f":"(K32+K33)/2","v":3.18783712321523E-2}]
[null,"Ethane C2H7",{"$f":"C30","v":0},{"$f":"460+C33","v":460},{"$f":"4.04+0.01636*D33","v":11.5656},30,{"$f":"E33/F33","v":0.38551999999999997},{"$f":"378.2/F33","v":12.606666666666666},{"$f":"1/H33","v":7.9323109465891065E-2},{"$f":"I33/0.0763","v":1.0396213560405119},{"$f":"G33/H33","v":3.0580645161290321E-2}]
[]
[null,"Source - Gas Engineers Handbook "]
[]
[null,"For Air at 60 F., 80% Humidity "]
[null,"Composition of gas mixture ","% Vol","% mass","Mean CP Btu/scf","Cp-60 F","Cp 1000F"]
[null,"Oxygen ",20.7,null,{"$f":"L8","v":1.8159907895190751E-2},{"$f":"K8","v":1.82829421635834E-2},{"$f":"K9","v":1.8036873626798098E-2}]
[null,"Carbon Dioxide",0,null,{"$f":"L23","v":2.3168520132030267E-2},{"$f":"K23","v":2.3418309713717105E-2},{"$f":"K24","v":2.2918730550343432E-2}]
[null,"Nitrogen & Other",78.3,null,{"$f":"L11","v":1.8161364599176031E-2},{"$f":"K11","v":1.7858338626755829E-2},{"$f":"K12","v":1.8464390571596233E-2}]
[null,"Water vapor",1,null,{"$f":"L20","v":2.1723921664298901E-2},{"$f":"K20","v":2.1424894359497886E-2},{"$f":"K21","v":2.2022948969099915E-2}]
[]
[null,"Total",{"$f":"SUM(C39:C43)","v":100}]
[null,"Mean value",null,null,{"$f":"($C$39*E39+$C$40*E40+$C$41*E41+$C$42*E42)/100","v":1.8196688632102304E-2},{"$f":"($C$39*F39+$C$40*F40+$C$41*F41+$C$42*F42)/100","v":1.7981897116206558E-2},{"$f":"($C$39*G39+$C$40*G40+$C$41*G41+$C$42*G42)/100","v":1.8411480147998052E-2}]
[]
[null,null,null,null,null,"B",{"$f":"(G45-F45)/(1000-60)","v":4.570032253100998E-7}]
[null,null,null,null,null,"A",{"$f":"G45-G47*1000","v":1.7954476922687951E-2}]
[]
[null,null,null,null,"cp for air"]
[null,null,null,null,"Temp","Cp (Btu/scf)"]
[null,null,null,null,60,{"$f":"$G$48+$G$47*E52","v":1.7981897116206558E-2}]
[null,null,null,null,100,1.8000177245218962E-2]
[null,null,null,null,{"$f":"100+E53","v":200},1.804587756774997E-2]
[null,null,null,null,300,1.8091577890280982E-2]
[null,null,null,null,400,1.813727821281199E-2]
[null,null,null,null,500,1.8182978535343002E-2]
[null,null,null,null,600,1.822867885787401E-2]
[null,null,null,null,700,1.8274379180405021E-2]
[null,null,null,null,800,1.8320079502936029E-2]
[null,null,null,null,900,1.8365779825467041E-2]
[null,null,null,null,1000,1.8411480147998052E-2]
[null,null,null,null,1100,1.845718047052906E-2]
[null,null,null,null,1200,1.8502880793060072E-2]
[null,null,null,null,1300,1.854858111559108E-2]
[null,null,null,null,1400,1.8594281438122091E-2]
[null,null,null,null,1500,1.8639981760653099E-2]
[null,null,null,null,{"$f":"'Av.Ht.Solid - modified'!C86","v":0},1.7954476922687951E-2,"Air temp. entering sp. Ht. "]
[]
[null,null,null,null,{"$f":"100+E67","v":1600},{"$f":"$G$48+$G$47*E70","v":1.8685682083184111E-2}]
[null,null,null,null,"Cp",null,"Cp","Sp. Vol","Sp. Wt","Sp. Gravity","Cp","Mean CP"]
[null,"Gas","Temp (F)","Temp ®","Btu/(#mole.F)","Mol wt","Btu/(#F)","SCF/#","#/SCF","wrt Air @stp","Btu/SCF","Btu/SCF"]
[null,"Water vapor (H2O)",300,{"$f":"460+C73","v":760},{"$f":"19.86-597/D73^0.5+7500/D73","v":8.0729549868477299},18,{"$f":"E73/F73","v":0.44849749926931831},{"$f":"378.2/F73","v":21.011111111111109},{"$f":"1/H73","v":4.7593865679534643E-2},{"$f":"I73/0.0763","v":0.62377281362430714},{"$f":"G73/H73","v":2.1345729737831123E-2},null,null,{"$f":"E73/(18*21.011)","v":2.1345842619071836E-2}]
[null,null,{"$f":"C73+100","v":400},860,8.2233991993645041,{"$f":"F73","v":18},0.4568555110758058,21.011111111111109,4.7593865679534643E-2,0.62377281362430714,2.1743519829097051E-2,null,null,2.1743634813945353E-2]
[null,null,500,960,8.4044078526180996,18,0.46691154736767221,21.011111111111109,4.7593865679534643E-2,0.62377281362430714,2.2222125469640669E-2,null,null,2.2222242985468193E-2]
[null,null,600,1060,8.5987624606197635,18,0.47770902558998685,21.011111111111109,4.7593865679534643E-2,0.62377281362430714,2.2736019197831209E-2,null,null,2.2736139431249674E-2]
[null,null,700,1160,8.7969936888654097,18,0.4887218716036339,21.011111111111109,4.7593865679534643E-2,0.62377281362430714,2.3260163111754127E-2,null,null,2.3260286116968915E-2]
[null,null,800,1260,8.993811283283474,18,0.49965618240463744,21.011111111111109,4.7593865679534643E-2,0.62377281362430714,2.3780569231315375E-2,null,null,2.3780694988560159E-2]
[null,null,900,1360,9.1862704676357225,18,0.51034835931309575,21.011111111111109,4.7593865679534643E-2,0.62377281362430714,2.4289451262918361E-2,null,null,2.4289579711251046E-2]
[null,null,1000,1460,9.3727822120519821,18,0.52071012289177676,21.011111111111109,4.7593865679534643E-2,0.62377281362430714,2.47826076468852E-2,null,null,2.4782738703144867E-2]
[null,null,1100,1560,9.5525572539685832,18,0.53069762522047681,21.011111111111109,4.7593865679534643E-2,0.62377281362430714,2.525795149119139E-2,null,null,2.5258085061181136E-2]
[null,null,1200,1660,9.7252835829932174,18,0.54029353238851208,21.011111111111109,4.7593865679534643E-2,0.62377281362430714,2.5714657808020142E-2]
[null,null,1300,1760,9.8909344918731712,18,0.5494963606596206,21.011111111111109,4.7593865679534643E-2,0.62377281362430714,2.6152655980627108E-2]
[null,null,1400,1860,10.049652026075105,18,0.55831400144861698,21.011111111111109,4.7593865679534643E-2,0.62377281362430714,2.6572321591948986E-2]
[null,null,1500,1960,10.201675161384022,18,0.56675973118800127,21.011111111111109,4.7593865679534643E-2,0.62377281362430714,2.6974286518730892E-2]
[null,null,1600,2060,10.347295119238058,18,0.57484972884655883,21.011111111111109,4.7593865679534643E-2,0.62377281362430714,2.7359320780640031E-2]
[null,null,1700,2160,10.486827457300954,18,0.58260152540560861,21.011111111111109,4.7593865679534643E-2,0.62377281362430714,2.7728258744846527E-2]
[null,null,1800,2260,10.620594687733073,18,0.59003303820739295,21.011111111111109,4.7593865679534643E-2,0.62377281362430714,2.8081953166930393E-2]
[null,null,1900,2360,10.748915580525086,18,0.59716197669583815,21.011111111111109,4.7593865679534643E-2,0.62377281362430714,2.8421246907787117E-2]
[null,null,2000,2460,10.872098747513114,18,0.60400548597295078,21.011111111111109,4.7593865679534643E-2,0.62377281362430714,2.8746955969098664E-2]
[null,null,2100,2560,10.990438980496736,18,0.6105799433609298,21.011111111111109,4.7593865679534643E-2,0.62377281362430714,2.9059859810937963E-2]
[null,null,2200,2660,11.104215362312942,18,0.6169008534618301,21.011111111111109,4.7593865679534643E-2,0.62377281362430714,2.9360696357252625E-2]
[null,null,2300,2760,11.213690514016628,18,0.62298280633425707,21.011111111111109,4.7593865679534643E-2,0.62377281362430714,2.9650160005332174E-2]
[null,null,{"$f":"'Av.Ht.Solid - current '!C88","v":0},460,8.3290793001135874,18,0.46272662778408818,21.011111111111109,4.7593865679534643E-2,0.62377281362430714,2.2022948969099915E-2]
[]
[]
[]
[]
[]
[null,null,300,0.44849749926931831,{"$f":"0.424+6*10^-5*C100+7*10^-8*C100^2-4*10^-11*C100^3+8*10^-15*C100^4","v":0.44728479999999998},{"$f":"(D100-E100)/D100","v":2.7039153424356448E-3}]
[null,null,400,0.4568555110758058,0.4568448,2.3445215272942999E-5]
[null,null,500,0.46691154736767221,0.46700000000000003,-1.894419463953958E-4]
[null,null,600,0.47770902558998685,0.47759679999999999,2.349245753694021E-4]
[null,null,700,0.4887218716036339,0.48850079999999996,4.5234644995227987E-4]
[null,null,800,0.49965618240463744,0.49959679999999995,1.1884653233290155E-4]
[null,null,900,0.51034835931309575,0.51078880000000004,-8.6301969795123763E-4]
[null,null,1000,0.52071012289177676,0.52200000000000002,-2.4771500524320396E-3]
[null,null,1100,0.53069762522047681,0.5331728,-4.6640019888818766E-3]
[null,null,1200,0.54029353238851208,0.5442688,-7.357607250847862E-3]
[null,null,1300,0.5494963606596206,0.55526880000000001,-1.0504963733426948E-2]
[null,null,1400,0.55831400144861698,0.56617280000000003,-1.4075947461450715E-2]
[null,null,1500,0.56675973118800127,0.57699999999999996,-1.8068095258874105E-2]
[null,null,1600,0.57484972884655883,0.58778880000000011,-2.2508614867756217E-2]
[null,null,1700,0.58260152540560861,0.59859680000000004,-2.74549136877997E-2]
[null,null,1800,0.59003303820739295,0.60950079999999995,-3.2994358844299514E-2]
[null,null,1900,0.59716197669583815,0.62059680000000006,-3.9243662889973885E-2]
[null,null,2000,0.60400548597295078,0.63200000000000001,-4.6348112189667931E-2]
[null,null,2100,0.6105799433609298,0.64384480000000011,-5.448075555178624E-2]
[null,null,2200,0.6169008534618301,0.65628480000000011,-6.3841614608184105E-2]
[null,null,2300,0.62298280633425707,0.66949280000000022,-7.465694589456863E-2]
[]
[]
[]
[]
[]
[null,null,null,"Btu/(scf-F)","Btu/(# - F)",null,"Avg. Btu/(scf-F)"]
[null,{"$f":"B128-100","v":0},{"$f":"B127+460","v":460},{"$f":"(19.86-597/C127^0.5+7500/C127)/(18*21.011)","v":2.202306543163525E-2},{"$f":"(19.86-597/C127^0.5+7500/C127)/18","v":0.46272662778408818},null,{"$f":"($K$73+(D127-$K$73)/2)","v":2.1684397584733187E-2},null,{"$f":"(D127+$D$127)/2","v":2.202306543163525E-2},null,{"$f":"(D127-I127)/D127","v":0}]
[null,100,560,2.1219050971213283E-2,0.44583347995616229,null,2.1282390354522202E-2,null,2.1621058201424265E-2,null,-1.8945580118373939E-2]
[null,200,660,2.1114450315482633E-2,0.44363571557860559,null,2.1230090026656878E-2,null,2.1568757873558941E-2,null,-2.1516428383796353E-2]
[null,300,760,2.1345842619071836E-2,0.44849749926931831,null,2.1345786178451481E-2,null,2.1684454025353544E-2,null,-1.5863107974907028E-2]
[null,400,860,2.1743634813945353E-2,0.4568555110758058,null,2.1544682275888238E-2,null,2.1883350122790302E-2,null,-6.4255728189171633E-3]
[null,500,960,2.2222242985468193E-2,0.46691154736767221,null,2.178398636164966E-2,null,2.2122654208551723E-2,null,4.4814907739778552E-3]
[null,600,1060,2.2736139431249674E-2,0.47770902558998685,null,2.20409345845404E-2,null,2.2379602431442464E-2,null,1.5681510085972124E-2]
[null,700,1160,2.3260286116968915E-2,0.4887218716036339,null,2.2303007927400018E-2,null,2.2641675774302081E-2,null,2.6595130410521646E-2]
[null,800,1260,2.3780694988560159E-2,0.49965618240463744,null,2.2563212363195639E-2,null,2.2901880210097703E-2,null,3.6954966155750085E-2]
[null,900,1360,2.4289579711251046E-2,0.51034835931309575,null,2.2817654724541087E-2,null,2.315632257144315E-2,null,4.6656103287080204E-2]
[null,1000,1460,2.4782738703144867E-2,0.52071012289177676,null,2.3064234220487995E-2,null,2.3402902067390059E-2,null,5.5677326557121425E-2]
[null,1100,1560,2.5258085061181136E-2,0.53069762522047681,null,2.330190739950613E-2,null,2.3640575246408193E-2,null,6.4039289235702027E-2]
[null,1200,1660,2.5714793793180341E-2,0.54029353238851208,null,2.3530261765505732E-2,null,2.3868929612407795E-2,null,7.1782188712789741E-2]
[null,1300,1760,2.6152794282024685E-2,0.5494963606596206,null,2.3749262009927906E-2,null,2.4087929856829969E-2,null,7.8953874026911786E-2]
[null,1400,1860,2.6572462112637047E-2,0.55831400144861698,null,2.3959095925234083E-2,null,2.4297763772136147E-2,null,8.5603597094569703E-2]
[null,1500,1960,2.6974429165104053E-2,0.56675973118800127,null,2.4160079451467587E-2,null,2.449874729836965E-2,null,9.1778841790547058E-2]
[null,1600,2060,2.7359465463164954E-2,0.57484972884655883,null,2.4352597600498037E-2,null,2.46912654474001E-2,null,9.7523835740034787E-2]
[null,1700,2160,2.77284053784022E-2,0.58260152540560861,null,2.453706755811666E-2,null,2.4875735405018723E-2,null,0.10287897679126677]
[null,1800,2260,2.8082101670905382E-2,0.59003303820739295,null,2.4713915704368254E-2,null,2.5052583551270317E-2,null,0.10788074750024189]
[null,1900,2360,2.8421397206027231E-2,0.59716197669583815,null,2.4883563471929177E-2,null,2.522223131883124E-2,null,0.11256187948837203]
[null,2000,2460,2.8747107989764924E-2,0.60400548597295078,null,2.5046418863798024E-2,null,2.5385086710700087E-2,null,0.11695163493530709]
[null,2100,2560,2.906001348631335E-2,0.6105799433609298,null,2.5202871612072235E-2,null,2.5541539458974298E-2,null,0.12107613195004807]
[null,2200,2660,2.9360851623522449E-2,0.6169008534618301,null,2.5353290680676786E-2,null,2.569195852757885E-2,null,0.12495867432551805]
[null,2300,2760,2.965031680235387E-2,0.62298280633425707,null,2.5498023270092499E-2,null,2.5836691116994562E-2,null,0.12862006536997789]
[]
[]
[]
[null,"Average value "]
[null,null,null,"(19.86-597/C122^0.5+7500/C122)/(18*21.011)"]
[]
[null,null,null,19.86,597,7500]
[]
[null,100]

{"sheet":"Radiation losses from opening","index":17,"n_rows":169,"n_cols":17,"rows_kept":169,"cut":false,"hidden":false,"merged":[[163,1,163,4],[164,1,164,4],[165,1,165,4],[166,1,166,4],[167,1,167,4],[139,8,139,10],[34,0,51,0],[76,2,76,4],[76,8,76,10],[118,2,118,4],[55,8,55,10],[96,2,96,4],[34,8,34,10],[97,8,97,10],[118,8,118,10],[54,2,54,4],[75,2,75,4],[97,2,97,4],[139,2,139,4],[138,2,138,4],[162,1,162,4],[30,3,30,4],[34,2,34,4],[55,2,55,4],[32,1,32,4],[33,2,33,4],[117,2,117,4],[161,1,161,4],[149,5,150,7],[44,5,45,7],[65,5,66,7],[86,5,87,7],[107,5,108,7],[128,5,129,7]]}
[]
[1.1000000000182899]
[" +     92.85714285700499 * x",null,null,3.5000000000171898,null,null,2.7000000000240898,null,null,null,null,13.0000000000278]
[" -    57.589285713967165 * x^2",null,null," +     89.58333333320397 * x",null,null," +    112.67857142839111 * x","Help",null,null,null," +    123.74999999979063 * x"]
[" +    15.624999999800524 * x^3",null,null," -     49.99999999970236 * x^2",null,null," -     70.98214285673158 * x^2","Copy Current to Modified",null,null,null," -     99.99999999951825 * x^2"]
[null,null,null," +    10.416666666480479 * x^3",null,null," +    15.624999999744734 * x^3","Done Entering Data",null,null,null," +    31.249999999699078 * x^3"]
["f(x) = ",null,null,"f(x) = ",null,null,"f(x) = ","Display Chart",null,null,null,"f(x) = "]
[null,null,null,null,null,null,null,"Print Sheet"]
[29.499999998982101,null,null,23.999999996563901,null,null,35.4999999992976,{"$f":" IF('Control page'!J2 = \"English\",#REF!,#REF!)","v":{"$error":"#REF!"}},null,null,null,26.999999990356699]
[" +     26.84166666841611 * x",null,null," +     39.39166667187432 * x",null,null," +    29.458333334781596 * x",null,null,null,null," +     64.56666668066461 * x"]
[" -     4.354166667853229 * x^2",null,null," -    11.604166669748727 * x^2",null,null," -     4.520833334469769 * x^2",null,null,null,null," -    29.916666674500892 * x^2"]
[" -    0.0833333330461522 * x^3",null,null," +    1.8541666670689478 * x^3",null,null," -    0.6874999996066529 * x^3",null,null,null,null," +     7.145833333961459 * x^3"]
[" +   0.10416666665553202 * x^4",null,null," -   0.14583333321793268 * x^4",null,null," +    0.2708333332730645 * x^4",null,null,null,null," -    0.8333333328744414 * x^4"]
[" -  0.008333333336867471 * x^5",null,null," +  0.004166666639021022 * x^5",null,null," -  0.020833333330372142 * x^5",null,null,null,null," +  0.037499999908537356 * x^5"]
[]
[]
["Ratio(Dia/Thk.)","Cylindrical","Square","2x1 Rectangular"]
[0,{"$f":" +     1.10000000001829\n +     92.8571428570049 *A18\n -    57.5892857139671 * A18^2\n +    15.6249999998005 *A18^3","v":1.1000000000182899},{"$f":" +     3.50000000001719\n +     89.5833333332039 * A18\n -     49.9999999997023 * A18^2\n +    10.4166666664804 * A18^3","v":3.5000000000171898},{"$f":" +    2.70000000002409\n +    112.678571428391 * A18\n -     70.9821428567315 * A18^2\n +    15.6249999997447 * A18^3","v":2.7000000000240898}]
[0.2,{"$f":" +     1.10000000001829\n +     92.8571428570049 *A19\n -    57.5892857139671 * A19^2\n +    15.6249999998005 *A19^3","v":17.492857142858995},{"$f":" +     3.50000000001719\n +     89.5833333332039 * A19\n -     49.9999999997023 * A19^2\n +    10.4166666664804 * A19^3","v":19.50000000000172},{"$f":" +    2.70000000002409\n +    112.678571428391 * A19\n -     70.9821428567315 * A19^2\n +    15.6249999997447 * A19^3","v":22.521428571430988}]
[0.4,{"$f":" +     1.10000000001829\n +     92.8571428570049 *A20\n -    57.5892857139671 * A20^2\n +    15.6249999998005 *A20^3","v":30.02857142857275},{"$f":" +     3.50000000001719\n +     89.5833333332039 * A20\n -     49.9999999997023 * A20^2\n +    10.4166666664804 * A20^3","v":32.000000000001123},{"$f":" +    2.70000000002409\n +    112.678571428391 * A20\n -     70.9821428567315 * A20^2\n +    15.6249999997447 * A20^3","v":37.414285714287104}]
[0.6,{"$f":" +     1.10000000001829\n +     92.8571428570049 *A21\n -    57.5892857139671 * A21^2\n +    15.6249999998005 *A21^3","v":39.457142857149982},{"$f":" +     3.50000000001719\n +     89.5833333332039 * A21\n -     49.9999999997023 * A21^2\n +    10.4166666664804 * A21^3","v":41.500000000006466},{"$f":" +    2.70000000002409\n +    112.678571428391 * A21\n -     70.9821428567315 * A21^2\n +    15.6249999997447 * A21^3","v":48.128571428580194}]
[0.8,{"$f":" +     1.10000000001829\n +     92.8571428570049 *A22\n -    57.5892857139671 * A22^2\n +    15.6249999998005 *A22^3","v":46.528571428581124},{"$f":" +     3.50000000001719\n +     89.5833333332039 * A22\n -     49.9999999997023 * A22^2\n +    10.4166666664804 * A22^3","v":48.500000000008804},{"$f":" +    2.70000000002409\n +    112.678571428391 * A22\n -     70.9821428567315 * A22^2\n +    15.6249999997447 * A22^3","v":55.414285714298011}]
[1,{"$f":" +    29.4999999989821\n +     26.8416666684161 * A23\n -     4.35416666785322 * A23^2\n -    0.0833333330461522 *A23^3\n +   0.104166666655532 * A23^4\n -  0.00833333333686747 *A23^5","v":51.99999999981749},{"$f":" +      23.9999999965639\n +     39.3916666718743 * A23\n -    11.6041666697487 * A23^2\n +    1.85416666706894 *A23^3\n -   0.145833333217932 * A23^4\n +  0.00416666663902102 *A23^5","v":53.499999999179529},{"$f":"  +      35.4999999992976\n +    29.4583333347815 * A23\n -     4.52083333446976 *A23^2\n -    0.687499999606652 *A23^3\n +    0.270833333273064 *A23^4\n -  0.0208333333303721 * A23^5","v":59.999999999945388}]
[2,66.49999999974095,68.999999998830972,74.49999999992545]
[3,74.999999999544627,76.999999997939469,81.499999999872429]
[4,79.999999998905139,81.499999995060989,84.999999999685059]
[5,83.49999999595974,84.499999981568621,87.999999998881819]
[6,85.999999986881932,86.499999938335094,89.999999996956006]
[]
[]
[null,"Number of Openings",{"$f":"'Control page'!D19","v":6},{"$f":"IF('Control page'!J2=\"English\", \"from control sheet\", \"来自控制页面\")","v":"来自控制页面"}]
[]
[null,"Radiation losses from openings"]
[null,"Equipment  name or designation",null,null,null,null,null,null,null,null,null,null,null,null,"Round",null,{"$f":"OR(C35=O$34,C35=P$34)","v":false}]
[null,"Shape of opening","Rectangular",null,null,null,null,null,"Calculations - Rectangular"]
[null,"Name or designation of the opening",null,"Current","Modified"]
[null,"Number of openings of same size and shape"]
[null,"Total opening area","ft^2",{"$f":"IF($C35=\"Rectangular\",D37*D42*D43/144,(D37*PI()*(D42^2)/4)/144)","v":0},{"$f":"IF($C35=\"Rectangular\",E37*E42*E43/144,(E37*PI()*(E42^2)/4)/144)","v":0},null,null,null,"ft^2",{"$f":"D38","v":0},0]
[null,"Average zone or radiation source temp.","deg. F.",null,null,null,null,null,"deg. F.",0,0]
[null,"Ambient Temperature","deg. F.",null,null,null,null,null,"deg. F.",0,0]
[null,"Wall thickness or opening depth (Thickness)","Inch"]
[null,{"$f":"IF(C35=\"Round\",\"Diameter of Opening\",\"Length of Opening (L)\")","v":"Length of Opening (L)"},"Inch"]
[null,{"$f":"IF(C35=\"Round\",\"\",\"Height of Opening (H)\")","v":"Height of Opening (H)"},"Inch"]
[null,"View factor - user defined if known or from chart",null,null,null,null,null,{"$f":"$H$7","v":"Display Chart"},null,{"$f":"D44","v":0},0,"Use user defined or calculated if user defined "]
[null,"Emissivity of the source  (Typical - 0.9)",null,null,null,{"$f":"IF(OR(D45>1,E45>1),\"Surface emmissivity cannot be greater than 1\",\"\")","v":""},null,null,null,0,0,{"$f":"IF($C$31=0,0,1)","v":1},"Control"]
[null,"% Open time  ","%",null,null,null,null,null,null,0,0]
[null,null,null,null,null,null,null,null,"Btu/hr",{"$f":"0.1713*10^-8*J45*((J39+460)^4 - (J40+460)^4)*J44*J38*D46/100","v":0},{"$f":"0.1713*10^-8*K45*((K39+460)^4 - (K40+460)^4)*K44*K38*K46/100","v":0}]
[null,null,null,null,null,null,null,null,"Btu/hr",{"$f":"J47","v":0},{"$f":"K47","v":0}]
[null,"View factor calculated",null,{"$f":"D44","v":0},{"$f":"E44","v":0}]
[null,"Ratio X (lowest of height or length/wall thickness)"," ",{"$f":"IF(C35=\"Rectangular\",(MIN(D42:D43)/(D41/1000)),D42/(D41/1000))","v":{"$error":"#DIV/0!"}},{"$f":"IF(C35=\"Rectangular\",(MIN(E42:E43)/(E41/1000)),E42/(E41/1000))","v":{"$error":"#DIV/0!"}}]
[null,"Radiation loss","Btu/hr",{"$f":"L45*J47","v":0},{"$f":"L45*K47","v":0}]
[null,"Radiation loss","Btu/hr",{"$f":"D51","v":0},{"$f":"E51","v":0}]
[]
[]
[null,"Equipment  name or designation",null,null,null,null,null,null,null,null,null,null,null,null,null," "]
[null,"Shape of opening","Rectangular",null,null,null,null,null,"Calculations - 2nd Opening"]
[null,"Name or designation of the opening",null,"Current","Modified"]
[null,"Number of openings of same size and shape"]
[" ","Total opening area","ft^2",{"$f":"IF($C56=\"Rectangular\",D58*D63*D64/144,(D58*PI()*(D63^2)/4)/144)","v":0},{"$f":"IF($C56=\"Rectangular\",E58*E63*E64/144,(E58*PI()*(E63^2)/4)/144)","v":0},null,null,null,"ft^2",{"$f":"D59","v":0},0,null,null,null,null,null,{"$f":"OR(C56=O$34,C56=P$34)","v":false}]
[null,"Average zone or radiation source temp.","deg. F.",null,null,null,null,null,"deg. F.",0,0]
[null,"Ambient Temperature","deg. F.",null,null,null,null,null,"deg. F.",0,0]
[null,"Wall thickness or opening depth (Thickness)","Inch",null,null,null,null,null,null,{"$f":"D65","v":0},0]
[null,{"$f":"IF(C56=\"Round\",\"Diameter of Opening\",\"Length of Opening (L)\")","v":"Length of Opening (L)"},"Inch",null,null,null,null,null,null,0,0]
[null,{"$f":"IF(C56=\"Round\",\"\",\"Height of Opening (H)\")","v":"Height of Opening (H)"},"Inch",null,null,null,null,null,null,0,0]
[null,"View factor - user defined if known or from chart",null,null,null,null,null,{"$f":"$H$7","v":"Display Chart"},"Btu/hr",{"$f":"0.1713*10^-8*J63*((J60+460)^4 - (J61+460)^4)*J62*J59*J64/100","v":0},{"$f":"0.1713*10^-8*K63*((K60+460)^4 - (K61+460)^4)*K62*K59*K64/100","v":0}]
[null,"Emissivity of the source  (Typical - 0.9)",null,null,null,{"$f":"IF(OR(D66>1,E66>1),\"Surface emmissivity cannot be greater than 1\",\"\")","v":""},null,null,"Btu/hr",{"$f":"J65","v":0},{"$f":"K65","v":0},{"$f":"IF($C$31>1,1,0)","v":1},"Control"]
[null,"% Open time  ","%"]
[]
[]
[null,"View factor calculated",null,{"$f":"D65","v":0},{"$f":"E65","v":0}]
[null,"Ratio X (lowest of height or length/wall thickness)"," ",{"$f":"IF(C56=\"Rectangular\",(MIN(D63:D64)/(D62/1000)),D63/(D62/1000))","v":{"$error":"#DIV/0!"}},{"$f":"IF(C56=\"Rectangular\",(MIN(E63:E64)/(E62/1000)),E63/(E62/1000))","v":{"$error":"#DIV/0!"}}]
[null,"Radiation loss","Btu/hr",{"$f":"J65*L66","v":0},{"$f":"K65*L66","v":0}]
[null,"Radiation loss","Btu/hr",{"$f":"D72","v":0},{"$f":"E72","v":0}]
[]
[]
[null,"Equipment  name or designation"]
[null,"Shape of opening","Rectangular",null,null,null,null,null,"Calculations - 3rd Opening"]
[null,"Name or designation of the opening",null,"Current","Modified"]
[null,"Number of openings of same size and shape",null,0,0]
[null,"Total opening area","ft^2",{"$f":"IF($C77=\"Rectangular\",D79*D84*D85/144,(D79*PI()*(D84^2)/4)/144)","v":0},{"$f":"IF($C77=\"Rectangular\",E79*E84*E85/144,(E79*PI()*(E84^2)/4)/144)","v":0},null,null,null,"ft^2",{"$f":"D80","v":0},0]
[null,"Average zone or radiation source temp.","deg. F.",null,null,null,null,null,"deg. F.",0,0]
[null,"Ambient Temperature","deg. F.",null,null,null,null,null,"deg. F.",0,0]
[null,"Wall thickness or opening depth (Thickness)","Inch",null,null,null,null,null,null,{"$f":"D86","v":0},0]
[null,{"$f":"IF(C77=\"Round\",\"Diameter of Opening\",\"Length of Opening (L)\")","v":"Length of Opening (L)"},"Inch",null,null,null,null,null,null,0.9,0.9]
[null,{"$f":"IF(C77=\"Round\",\"\",\"Height of Opening (H)\")","v":"Height of Opening (H)"},"Inch",null,null,null,null,null,null,100,100]
[null,"View factor - user defined if known or from chart",null,null,null,null,null,{"$f":"$H$7","v":"Display Chart"},"Btu/hr",{"$f":"0.1713*10^-8*J84*((J81+460)^4 - (J82+460)^4)*J83*J80*J85/100","v":0},{"$f":"0.1713*10^-8*K84*((K81+460)^4 - (K82+460)^4)*K83*K80*K85/100","v":0}]
[null,"Emissivity of the source  (Typical - 0.9)",null,0.9,0.9,{"$f":"IF(OR(D87>1,E87>1),\"Surface emmissivity cannot be greater than 1\",\"\")","v":""},null,null,"Btu/hr",{"$f":"J86","v":0},{"$f":"K86","v":0},{"$f":"IF($C$31>2,1,0)","v":1},"Control"]
[null,"% Open time  ","%",100,100]
[]
[]
[null,"View factor calculated",null,{"$f":"D86","v":0},{"$f":"E86","v":0}]
[null,"Ratio X (lowest of height or length/wall thickness)"," ",{"$f":"IF(C77=\"Rectangular\",(MIN(D84:D85)/(D83/1000)),D84/(D83/1000))","v":{"$error":"#DIV/0!"}},{"$f":"IF(C77=\"Rectangular\",(MIN(E84:E85)/(E83/1000)),E84/(E83/1000))","v":{"$error":"#DIV/0!"}}]
[null,"Radiation loss","Btu/hr",{"$f":"J86*L87","v":0},{"$f":"K86*L87","v":0}]
[null,"Radiation loss","Btu/hr",{"$f":"D93","v":0},{"$f":"E93","v":0}]
[]
[]
[null,"Equipment  name or designation"]
[null,"Shape of opening","Rectangular",null,null,null,null,null,"Calculations - 4th Opening"]
[null,"Name or designation of the opening",null,"Current","Modified"]
[null,"Number of openings of same size and shape",null,0,0]
[null,"Total opening area","ft^2",{"$f":"IF($C98=\"Rectangular\",D100*D105*D106/144,(D100*PI()*(D105^2)/4)/144)","v":0},{"$f":"IF($C98=\"Rectangular\",E100*E105*E106/144,(E100*PI()*(E105^2)/4)/144)","v":0},null,null,null,"ft^2",{"$f":"D101","v":0},0]
[null,"Average zone or radiation source temp.","deg. F.",null,null,null,null,null,"deg. F.",0,0]
[null,"Ambient Temperature","deg. F.",null,null,null,null,null,"deg. F.",0,0]
[null,"Wall thickness or opening depth (Thickness)","Inch",null,null,null,null,null,null,{"$f":"D107","v":0},0]
[null,{"$f":"IF(C98=\"Round\",\"Diameter of Opening\",\"Length of Opening (L)\")","v":"Length of Opening (L)"},"Inch",null,null,null,null,null,null,0.9,0.9]
[null,{"$f":"IF(C98=\"Round\",\"\",\"Height of Opening (H)\")","v":"Height of Opening (H)"},"Inch",null,null,null,null,null,null,100,100]
[null,"View factor - user defined if known or from chart",null,null,null,null,null,{"$f":"$H$7","v":"Display Chart"},"Btu/hr",{"$f":"0.1713*10^-8*J105*((J102+460)^4 - (J103+460)^4)*J104*J101*J106/100","v":0},{"$f":"0.1713*10^-8*K105*((K102+460)^4 - (K103+460)^4)*K104*K101*K106/100","v":0}]
[null,"Emissivity of the source  (Typical - 0.9)",null,0.9,0.9,{"$f":"IF(OR(D108>1,E108>1),\"Surface emmissivity cannot be greater than 1\",\"\")","v":""},null,null,"Btu/hr",{"$f":"J107","v":0},{"$f":"K107","v":0},{"$f":"IF($C$31>3,1,0)","v":1},"Control"]
[null,"% Open time  ","%",100,100]
[]
[]
[null,"View factor calculated",null,{"$f":"D107","v":0},{"$f":"E107","v":0}]
[null,"Ratio X (lowest of height or length/wall thickness)"," ",{"$f":"IF(C98=\"Rectangular\",(MIN(D105:D106)/(D104/1000)),D105/(D104/1000))","v":{"$error":"#DIV/0!"}},{"$f":"IF(C98=\"Rectangular\",(MIN(E105:E106)/(E104/1000)),E105/(E104/1000))","v":{"$error":"#DIV/0!"}}]
[null,"Radiation loss","Btu/hr",{"$f":"J107*L108","v":0},{"$f":"K107*L108","v":0}]
[null,"Radiation loss","Btu/hr",{"$f":"D114","v":0},{"$f":"E114","v":0}]
[]
[]
[null,"Equipment  name or designation"]
[null,"Shape of opening","Rectangular",null,null,null,null,null,"Calculations - 5th Opening"]
[null,"Name or designation of the opening",null,"Current","Modified"]
[null,"Number of openings of same size and shape",null,0,0]
[null,"Total opening area","ft^2",{"$f":"IF($C119=\"Rectangular\",D121*D126*D127/144,(D121*PI()*(D126^2)/4)/144)","v":0},{"$f":"IF($C119=\"Rectangular\",E121*E126*E127/144,(E121*PI()*(E126^2)/4)/144)","v":0},null,null,null,"ft^2",{"$f":"D122","v":0},0]
[null,"Average zone or radiation source temp.","deg. F.",null,null,null,null,null,"deg. F.",0,0]
[null,"Ambient Temperature","deg. F.",null,null,null,null,null,"deg. F.",0,0]
[null,"Wall thickness or opening depth (Thickness)","Inch",null,null,null,null,null,null,{"$f":"D128","v":0},0]
[null,{"$f":"IF(C119=\"Round\",\"Diameter of Opening\",\"Length of Opening (L)\")","v":"Length of Opening (L)"},"Inch",null,null,null,null,null,null,0.9,0.9]
[null,{"$f":"IF(C119=\"Round\",\"\",\"Height of Opening (H)\")","v":"Height of Opening (H)"},"Inch",null,null,null,null,null,null,100,100]
[null,"View factor - user defined if known or from chart",null,null,null,null,null,{"$f":"$H$7","v":"Display Chart"},"Btu/hr",{"$f":"0.1713*10^-8*J126*((J123+460)^4 - (J124+460)^4)*J125*J122*J127/100","v":0},{"$f":"0.1713*10^-8*K126*((K123+460)^4 - (K124+460)^4)*K125*K122*K127/100","v":0}]
[null,"Emissivity of the source  (Typical - 0.9)",null,0.9,0.9,{"$f":"IF(OR(D129>1,E129>1),\"Surface emmissivity cannot be greater than 1\",\"\")","v":""},null,null,"kJ/hr",{"$f":"J128","v":0},{"$f":"K128","v":0},{"$f":"IF($C$31>4,1,0)","v":1},"Control"]
[null,"% Open time  ","%",100,100]
[]
[]
[null,"View factor calculated",null,{"$f":"D128","v":0},{"$f":"E128","v":0}]
[null,"Ratio X (lowest of height or length/wall thickness)"," ",{"$f":"IF(C119=\"Rectangular\",(MIN(D126:D127)/(D125/1000)),D126/(D125/1000))","v":{"$error":"#DIV/0!"}},{"$f":"IF(C119=\"Rectangular\",(MIN(E126:E127)/(E125/1000)),E126/(E125/1000))","v":{"$error":"#DIV/0!"}}]
[null,"Radiation loss","Btu/hr",{"$f":"J129*L129","v":0},{"$f":"K129*L129","v":0}]
[null,"Radiation loss","Btu/hr",{"$f":"D135","v":0},{"$f":"E135","v":0}]
[]
[]
[null,"Equipment  name or designation"]
[null,"Shape of opening","Rectangular",null,null,null,null,null,"Calculations - 6th Opening"]
[null,"Name or designation of the opening",null,"Current","Modified"]
[null,"Number of openings of same size and shape",null,0,0]
[null,"Total opening area","ft^2",{"$f":"IF($C140=\"Rectangular\",D142*D147*D148/144,(D142*PI()*(D147^2)/4)/144)","v":0},{"$f":"IF($C140=\"Rectangular\",E142*E147*E148/144,(E142*PI()*(E147^2)/4)/144)","v":0},null,null,null,"ft^2",{"$f":"D143","v":0},0,null,null,null,null,null,{"$f":"OR(C140=O$34,C140=P$34)","v":false}]
[null,"Average zone or radiation source temp.","deg. F.",null,null,null,null,null,"deg. F.",0,0]
[null,"Ambient Temperature","deg. F.",null,null,null,null,null,"deg. F.",0,0]
[null,"Wall thickness or opening depth (Thickness)","Inch",null,null,null,null,null,null,{"$f":"D149","v":0},0]
[null,{"$f":"IF(C140=\"Round\",\"Diameter of Opening\",\"Length of Opening (L)\")","v":"Length of Opening (L)"},"Inch",null,null,null,null,null,null,0.9,0.9]
[null,{"$f":"IF(C140=\"Round\",\"\",\"Height of Opening (H)\")","v":"Height of Opening (H)"},"Inch",null,null,null,null,null,null,100,100]
[null,"View factor - user defined if known or from chart",null,null,null,null,null,{"$f":"$H$7","v":"Display Chart"},"Btu/hr",{"$f":"0.1713*10^-8*J147*((J144+460)^4 - (J145+460)^4)*J146*J143*J148/100","v":0},{"$f":"0.1713*10^-8*K147*((K144+460)^4 - (K145+460)^4)*K146*K143*K148/100","v":0}]
[null,"Emissivity of the source  (Typical - 0.9)",null,0.9,0.9,{"$f":"IF(OR(D150>1,E150>1),\"Surface emmissivity cannot be greater than 1\",\"\")","v":""},null,null,"Btu/hr",{"$f":"J149","v":0},{"$f":"K149","v":0},{"$f":"IF($C$31>5,1,0)","v":1},"Control"]
[null,"% Open time  ","%",100,100]
[]
[]
[null,"View factor calculated",null,{"$f":"D149","v":0},{"$f":"E149","v":0}]
[null,"Ratio X (lowest of height or length/wall thickness)"," ",{"$f":"IF(C140=\"Rectangular\",(MIN(D147:D148)/(D146/1000)),D147/(D146/1000))","v":{"$error":"#DIV/0!"}},{"$f":"IF(C140=\"Rectangular\",(MIN(E147:E148)/(E146/1000)),E147/(E146/1000))","v":{"$error":"#DIV/0!"}}]
[null,"Radiation loss","Btu/hr",{"$f":"J150*L150","v":0},{"$f":"K150*L150","v":0}]
[null,"Radiation loss","Btu/hr",{"$f":"D156","v":0},{"$f":"E156","v":0}]
[]
[]
[null,"Total Radiation Losses From Openings","Btu/hr",{"$f":"D73+D52+D94+D115+D136+D157","v":0},{"$f":"E73+E52+E94+E115+E136+E157","v":0},null,null,null," "]
[]
[null,"NOTES:"]
[null,"Enter notes here on proposed changes for the \"Modified\" conditions."]
[null,null,null,null,null,null,null,null,{"$f":"IF(B164=\"\",0,1)","v":0}]
[null,null,null,null,null,null,null,null,{"$f":"IF(B165=\"\",0,1)","v":0}]
[null,null,null,null,null,null,null,null,{"$f":"IF(B166=\"\",0,1)","v":0}]
[null,null,null,null,null,null,null,null,{"$f":"IF(B167=\"\",0,1)","v":0}]
[null,null,null,null,null,null,null,null,{"$f":"IF(B168=\"\",0,1)","v":0}]
[null,null,null,null,null,null,null,null,{"$f":"SUM(I164:I168)","v":0}]

{"sheet":"8- Power- Motor driven  systems","index":18,"n_rows":143,"n_cols":21,"rows_kept":143,"cut":false,"hidden":false,"merged":[[55,2,55,4],[66,4,67,4],[54,2,54,4],[66,3,67,3],[89,1,89,4],[90,1,90,4],[66,2,67,2],[86,1,86,4],[87,1,87,4],[88,1,88,4],[85,1,85,4],[84,1,84,4],[2,3,2,4],[23,2,23,4],[9,2,9,4],[6,4,7,4],[8,2,8,4],[4,1,4,4],[6,3,7,3],[21,4,22,4],[21,3,22,3],[6,2,7,2],[6,1,7,1],[21,2,22,2],[21,1,22,1],[37,1,38,1],[24,2,24,4],[39,2,39,4],[52,3,53,3],[52,4,53,4],[37,3,38,3],[37,4,38,4],[40,2,40,4],[37,2,38,2]]}
[]
[null,null,null,null,null,null,null,null,null,null,"Help"]
[null,"Number of Motors (from control page)",{"$f":"'Control page'!D20","v":10},"from control sheet ",null,null,null,null,null,null,"Copy Current to Modified"]
[null,null,null,null,null,null,null,null,null,null,"Print Sheet"]
[null,{"$f":"'Control page'!C20","v":"Power use by Electric Motors & Other Devices"},null,null,null,null,null,null,null,null,null,null,null,{"$f":"'Control page'!J2","v":0}]
[]
[null,null,null,"Current","Modified",null,null,null,null,null,"Done Entering Data"]
[]
[null,"Name or designation of the drive motor ","Fans for combustion air; exhaust; or other use"]
[null,"Electric motor or fan Model"]
[null,"Pressure (for fans only)","Psi",null,null,null,null,null,null,null,"Calcualtions",null,"Current ","Modified"]
[null,"Flow (for fans only)","ft^3/hr",null,null,null,null,null,null,null,"Power used ","kW",{"$f":"D14^0.5*D15*D17*D16*(D18/100)/1000","v":0},{"$f":"E14^0.5*E15*E17*E16*(E18/100)/1000","v":0}]
[null,"Motor power (name plate)","kW"]
[null,"Motor phase"]
[null,"Supply voltage ","Volts"]
[null,"Average current ","Amps"]
[null,"Power factor (average value)  (Typical - 0.85)",null,null,null,null,"Power Conversion",null,null,null,null,null,null,null,null,null,null,null,{"$f":"IF('Control page'!J2=\"English\",1,2)","v":2},1,{"$f":"VLOOKUP(T17,L$17:N$20,S$17+1)","v":{"$error":"#N/A"}}]
[null,"% Operating time (as % of total time) (Typical - 100%)",null,null,null,null,"HP","kW"]
[null,null,null,null,null,null,null,{"$f":"G19*0.74569987","v":0}]
[]
[]
[null,null,null,"Current","Modified"]
[]
[null,"Name or designation of the drive motor ","Fans for combustion air; exhaust; or other use",null,null,null,null,null,null,null,null,null,null,null,null,null,null,null,null,1,{"$f":"VLOOKUP(T24,L$17:N$20,S$17+1)","v":{"$error":"#N/A"}}]
[null,"Electric motor or fan Model"]
[null,"Pressure (for fans only)","Psi",null,null,null,null,null,null,null,"Calcualtions",null,"Current ","Modified"]
[null,"Flow (for fans only)","ft^3/hr",null,null,null,null,null,null,null,"Power used ","kW",{"$f":"D29^0.5*D30*D32*D31*(D33/100)/1000","v":0},{"$f":"E29^0.5*E30*E32*E31*(E33/100)/1000","v":0}]
[null,"Motor power (name plate)","kW"]
[null,"Motor phase"]
[null,"Supply voltage ","Volts"]
[null,"Average current ","Amps"]
[null,"Power factor (average value)  (Typical - 0.85)",null,null,null,null,null,null,null,null,"Default"]
[null,"% Operating time (as % of total time) (Typical - 100%)",null,null,null,null,null,null,null,null,"Default"]
[null,null,null,null,null,null,null,null,null,null,null,null,{"$f":"IF($C$3>1,1,0)","v":1},"Control"]
[]
[]
[]
[null,null,null,"Current","Modified"]
[]
[null,"Name or designation of the drive motor ","Fans for combustion air; exhaust; or other use",null,null,null,null,null,null,null,null,null,null,null,null,null,null,null,null,1,{"$f":"VLOOKUP(T40,L$17:N$20,S$17+1)","v":{"$error":"#N/A"}}]
[null,"Electric motor or fan Model"]
[null,"Pressure (for fans only)","Psi",null,null,null,null,null,null,null,"Calcualtions",null,"Current ","Modified"]
[null,"Flow (for fans only)","ft^3/hr",null,null,null,null,null,null,null,"Power used ","kW",{"$f":"D45^0.5*D46*D48*D47*(D49/100)/1000","v":0},{"$f":"E45^0.5*E46*E48*E47*(E49/100)/1000","v":0}]
[null,"Motor power (name plate)","kW"]
[null,"Motor phase"]
[null,"Supply voltage ","Volts"]
[null,"Average current ","Amps"]
[null,"Power factor (average value)  (Typical - 0.85)"]
[null,"% Operating time (as % of total time) (Typical - 100%)"]
[null,null,null,null,null,null,null,null,null,null,null,null,{"$f":"IF($C$3>2,1,0)","v":1},"Control"]
[]
[]
[null,null,null,"Current","Modified"]
[]
[null,"Name or designation of the drive motor ","Fans for combustion air; exhaust; or other use",null,null,null,null,null,null,null,null,null,null,null,null,null,null,null,null,1,{"$f":"VLOOKUP(T55,L$17:N$20,S$17+1)","v":{"$error":"#N/A"}}]
[null,"Electric motor or fan Model"]
[null,"Pressure (for fans only)","Psi",null,null,null,null,null,null,null,"Calcualtions",null,"Current ","Modified"]
[null,"Flow (for fans only)","ft^3/hr",null,null,null,null,null,null,null,"Power used ","kW",{"$f":"D60^0.5*D61*D63*D62*(D64/100)/1000","v":0},{"$f":"E60^0.5*E61*E63*E62*(E64/100)/1000","v":0}]
[null,"Motor power (name plate)","kW"]
[null,"Motor phase"]
[null,"Supply voltage ","Volts"]
[null,"Average current ","Amps"]
[null,"Power factor (average value)  (Typical - 0.85)"]
[null,"% Operating time (as % of total time) (Typical - 100%)"]
[null,null,null,null,null,null,null,null,null,null,null,null,{"$f":"IF($C$3>3,1,0)","v":1},"Control"]
[]
[null,"Equipment  name or designation",null,"Current","Modified"]
[null,"Motor driven system name designation -Enter Below"]
[null,null,"kW"]
[null,null,"kW"]
[null,null,"kW"]
[null,null,"kW"]
[null,null,"kW",null,null,null,null,null,null,null,null,null,{"$f":"IF($C$3>4,1,0)","v":1},"Control"]
[null,null,"kW"]
[null,null,"kW"]
[null,null,"kW"]
[null,null,"kW",null,null,null,null,null,null,null,null,null,"Current ","Modified"]
[null,null,"kW",null,null,null,null,null,null,null,"Power used ","kW",{"$f":"SUM(D69:D78)","v":0},{"$f":"SUM(E69:E78)","v":0}]
[]
[]
[]
[]
[null,"Total Power Use By Motors","Kw",{"$f":"SUM(M78+(M65*M58)+(M50*M43)+(M34*M27)+M12)","v":0},{"$f":"SUM(N78+(M65*N58)+(M50*N43)+(M34*N27)+N12)","v":0}]
[]
[null,"NOTES:"]
[null,"Enter notes here on proposed changes for the \"Modified\" conditions."]
[null,null,null,null,null,null,null,null,null,null,null,{"$f":"IF(B87=\"\",0,1)","v":0}]
[null,null,null,null,null,null,null,null,null,null,null,{"$f":"IF(B88=\"\",0,1)","v":0}]
[null,null,null,null,null,null,null,null,null,null,null,{"$f":"IF(B89=\"\",0,1)","v":0}]
[null,null,null,null,null,null,null,null,null,null,null,{"$f":"IF(B90=\"\",0,1)","v":0}]
[null,null,null,null,null,null,null,null,null,null,null,{"$f":"IF(B91=\"\",0,1)","v":0}]
[null,null,null,null,null,null,null,null,null,null,null,{"$f":"SUM(L87:L91)","v":0}]
[]
[null,"Type of equipment ","Drop Down Menu"]
[null,"Name of the equipment ","Cooling fan ","Cooling fan "]
[null,"Motor phase",3,3,"1) take the average amps"]
[null,"Supply voltage (volts)",480,480,"2) multiply by square root of 3,"]
[null,"Average current (amperes)",11.7,11.7,"3) multiply by the voltage (460; or whatever -- from the motor's nameplate)."]
[null,"Power factor (average value) ",0.85,0.85,"4) multiply by the power factor (from the motor's nameplate).  Assume 0.85 if you don't have that data available (or better yet consult the manufacturer's data)."]
[null,"% Operating time (as % of cycle time)",100,100,"5) divide by one thousand"]
[null,"Power used  (kW)",{"$f":"(C96^0.5*C97*C98*C99*C100/100)/1000","v":8.2681177350107919},{"$f":"($N$25*D96^0.5*D97*D98*D99*D100/100)/1000","v":0},"6) multiply by the number of anticipated operating hours per year."]
[null,null,null,null,"7) multipy by the cost of electricity per kWh."]
[]
[]
[]
[]
[]
[]
[null,null,null,null,null,null,null,null,null,null,null,null,{"$f":"#REF!","v":{"$error":"#REF!"}}]
[null,null,null,null,null,null,null,null,null,null,null,null,{"$f":"#REF!","v":{"$error":"#REF!"}}]
[null,null,null,null,null,null,null,null,null,null,null,null,{"$f":"#REF!","v":{"$error":"#REF!"}}]
[null,null,null,null,null,null,null,null,null,null,null,null,{"$f":"#REF!","v":{"$error":"#REF!"}}]
[null,null,null,null,null,null,null,null,null,null,null,null,{"$f":"#REF!","v":{"$error":"#REF!"}}]
[null,null,null,null,null,null,null,null,null,null,null,null,{"$f":"#REF!","v":{"$error":"#REF!"}}]
[null,null,null,null,null,null,null,null,null,null,null,null,{"$f":"#REF!","v":{"$error":"#REF!"}}]
[null,null,null,null,null,null,null,null,null,null,null,null,{"$f":"#REF!","v":{"$error":"#REF!"}}]
[null,null,null,null,null,null,null,null,null,null,null,null,{"$f":"#REF!","v":{"$error":"#REF!"}}]
[null,null,null,null,null,null,null,null,null,null,null,null,{"$f":"#REF!","v":{"$error":"#REF!"}}]
[null,null,null,null,null,null,null,null,null,null,null,null,{"$f":"#REF!","v":{"$error":"#REF!"}}]
[null,null,null,null,null,null,null,null,null,null,null,null,{"$f":"#REF!","v":{"$error":"#REF!"}}]
[null,null,null,null,null,null,null,null,null,null,null,null,{"$f":" IF('Control page'!J2=\"English\",#REF!,#REF!)","v":{"$error":"#REF!"}}]
[]
[]
[null,null,null,null,null,null,null,null,null,null,null,null,{"$f":" IF('Control page'!J2=\"English\",#REF!,#REF!)","v":{"$error":"#REF!"}}]
[null,null,null,null,null,null,null,null,null,null,null,null,{"$f":" IF('Control page'!J$2=\"English\",#REF!,#REF!)","v":{"$error":"#REF!"}}]
[null,null,null,null,null,null,null,null,null,null,null,null,{"$f":" IF('Control page'!J$2=\"English\",#REF!,#REF!)","v":{"$error":"#REF!"}}]
[null,null,null,null,null,null,null,null,null,null,null,null,{"$f":" IF('Control page'!J$2=\"English\",#REF!,#REF!)","v":{"$error":"#REF!"}}]
[null,null,null,null,null,null,null,null,null,null,null,null,{"$f":" IF('Control page'!J$2=\"English\",#REF!,#REF!)","v":{"$error":"#REF!"}}]
[null,null,null,null,null,null,null,null,null,null,null,null,{"$f":" IF('Control page'!J$2=\"English\",#REF!,#REF!)","v":{"$error":"#REF!"}}]
[null,null,null,null,null,null,null,null,null,null,null,null,{"$f":" IF('Control page'!J$2=\"English\",#REF!,#REF!)","v":{"$error":"#REF!"}}]
[]
[]
[]
[]
[]
[]
[]
[null,null,null,null,null,null,null,null,null,null,null,null,{"$f":" IF('Control page'!J2=\"English\",#REF!,#REF!)","v":{"$error":"#REF!"}}]
[]
[]
[]
[null,null,null,null,null,null,null,null,null,null,null,null,{"$f":" IF('Control page'!J2=\"English\",#REF!,#REF!)","v":{"$error":"#REF!"}}]
[null,null,null,null,null,null,null,null,null,null,null,null,{"$f":" IF('Control page'!J2=\"English\",#REF!,#REF!)","v":{"$error":"#REF!"}}]

{"sheet":"9- Other heat loss","index":19,"n_rows":110,"n_cols":20,"rows_kept":110,"cut":false,"hidden":false,"merged":[[1,2,1,4],[2,2,2,4],[3,2,3,4],[8,3,8,4],[53,4,54,4],[10,4,11,4],[10,5,11,5],[7,2,7,5],[25,4,26,4],[25,5,26,5],[9,2,9,5],[10,2,11,2],[10,3,11,3],[25,2,26,2],[25,3,26,3],[81,16,81,18],[76,16,76,18],[77,16,77,18],[67,2,67,5],[68,2,68,5],[72,2,72,5],[73,2,73,5],[69,2,69,5],[70,2,70,5],[71,2,71,5],[55,0,57,0],[62,2,62,5],[64,2,64,5],[63,2,63,5],[14,6,15,7],[29,6,30,7],[44,7,44,9],[49,7,49,9],[43,2,43,3],[43,4,43,5],[40,2,40,5],[44,2,44,3],[53,5,54,5],[53,2,54,2],[53,3,54,3]]}
[]
[null,null,null,null,null,null,null,null,null,null,null,"Help"]
[null,null,null,null,null,null,null,null,null,null,null,"Print Sheet"]
[]
[null,null,null,null,null,null,null,null,null,null,null,"Copy Current to Modified"]
[null,null,null,null,null,null,null,null,null,null,null,"Done Entering Data"]
[]
[12,null,"Other heat loss or generation"]
[null,null,null," "]
[null,null,"Note: Use positive (+ve) number for heat loss and negative (-ve) number for heat input or generation for the system  "]
[null,null,"Surface 1",null,"Current ","Modified "]
[]
[null,null,"Area of heat loss source (m2)","ft2"]
[null,null,"Average Temperature","deg. F."]
[null,null,"Ambient Temperature","deg. F.",null,null,{"$f":"IF(OR(E16>1,F16>1),\"Surface emmissivity cannot be greater than 1\",\"\")","v":""}]
[null,null,"Surface emissivity of the heat source (Typical - 0.9)"]
[null,null,"Heat Loss * ","Btu/hr",{"$f":"IFERROR(E22*E13,0)","v":0},{"$f":"IFERROR(F22*F13,0)","v":0},null,null,null,null,null,{"$f":"IF('Control page'!D21=0,0,1)","v":1},"Control"]
[]
[null,null,"Surface Temp. ","F",{"$f":"E14","v":0},{"$f":"F14","v":0}]
[null,null,"Ambient Temp. ","F",{"$f":"E15","v":0},{"$f":"F15","v":0}]
[]
[null,null,"Heat Required from equation","Btu/(hr-ft^2)",{"$f":"(1*(1/24)^0.2*(1/((E14+E15)/2)^0.181*(E14-E15)^0.266*((1+1.277*5))^0.5+(0.1713*10^-8*E16*((E14+460)^4-(E15+460)^4)/(E14-E15))))*(E19-E15)","v":{"$error":"#DIV/0!"}},{"$f":"(1*(1/24)^0.2*(1/((F14+F15)/2)^0.181*(F14-F15)^0.266*((1+1.277*5))^0.5+(0.1713*10^-8*F16*((F14+460)^4-(F15+460)^4)/(F14-F15))))*(F19-F15)","v":{"$error":"#DIV/0!"}}]
[null,null,"Conversion","kJ/(hr.m^2)",{"$f":"E22*11.3078","v":{"$error":"#DIV/0!"}},{"$f":"F22*11.3078","v":{"$error":"#DIV/0!"}}]
[null,null,"Total heat loss","kJ/(hr.m^2)",{"$f":"E23*E13","v":{"$error":"#DIV/0!"}},{"$f":"F23*F13","v":{"$error":"#DIV/0!"}}]
[]
[null,null,"Surface 2",null,"Current ","Modified "]
[]
[null,null,"Area of heat loss source (m2)","ft2",0,0]
[null,null,"Average Temperature","deg. F."]
[null,null,"Ambient Temperature","deg. F.",null,null,{"$f":"IF(OR(E31>1,F31>1),\"Surface emmissivity cannot be greater than 1\",\"\")","v":""}]
[null,null,"Surface emissivity of the heat source (Typical - 0.9)"]
[null,null,"Heat Loss *","Btu/hr",{"$f":"IFERROR(E37*E28,0)","v":0},{"$f":"IFERROR(F37*F28,0)","v":0},null,null,null,null,null,{"$f":"IF('Control page'!D21>1,1,0)","v":1},"Control"]
[]
[null,null,"Surface Temp. ","F",{"$f":"E29","v":0},{"$f":"F29","v":0}]
[null,null,"Ambient Temp. ","F",{"$f":"E30","v":0},{"$f":"F30","v":0}]
[]
[null,null,"Heat Required from equation","Btu/(hr-ft^2)",{"$f":"(1*(1/24)^0.2*(1/((E29+E30)/2)^0.181*(E29-E30)^0.266*((1+1.277*5))^0.5+(0.1713*10^-8*E31*((E29+460)^4-(E30+460)^4)/(E29-E30))))*(E34-E30)","v":{"$error":"#DIV/0!"}},{"$f":"(1*(1/24)^0.2*(1/((F29+F30)/2)^0.181*(F29-F30)^0.266*((1+1.277*5))^0.5+(0.1713*10^-8*F31*((F29+460)^4-(F30+460)^4)/(F29-F30))))*(F34-F30)","v":{"$error":"#DIV/0!"}}]
[null,null,"Conversion","kJ/(hr.m^2)",{"$f":"E37*11.3078","v":{"$error":"#DIV/0!"}},{"$f":"F37*11.3078","v":{"$error":"#DIV/0!"}}]
[null,null,"Total heat loss","kJ/(hr.m^2)",{"$f":"E38*E28","v":{"$error":"#DIV/0!"}},{"$f":"F38*F28","v":{"$error":"#DIV/0!"}}]
[]
[null,null,"* Based on assumptions: Wind velocity: 5 miles/hr., surface shape/orientation factor: 1.0.  For other conditions use \"Wall Loss\" section."]
[]
[]
[null,null,"Hot Flue Gases Leakage Heat Loss from Oven or Furnace (Select \"Yes\" or \"No\")",null,"Yes"]
[null,null,null,null,"Current","Modified",null,"Pressure Conversion "]
[null,null,"Furnace draft (+  positive. pressure) ","Inch W.C.",null,null,null,"Pascal","Inch w.c.*","mm w.c.*"]
[null,null,"Opening area","ft2",null,null,null,5,{"$f":"H47*0.00401574","v":2.0078700000000001E-2},{"$f":"I47*25.4","v":0.50999897999999999}]
[null,null,"Temperature of gases leaking from the furnace ","deg. F.",null,null,null,"mm w.c.*","Pascal","Inch w.c.*"]
[null,null,"Specific density of flue gases","Air =1.0",null,null,null,0.51,{"$f":"H49/0.102","v":5},{"$f":"H49/25.4","v":2.0078740157480318E-2}]
[null,null,"Ambient temperature","deg. F.",null,null,null,"* w.c. = Water Column"]
[null,null,"Hot flue gas leakage heat loss","Btu/hr",{"$f":"IFERROR(IF(E44=\"Yes\", E92,\"0\"),0)","v":0},{"$f":"IFERROR(IF(E44=\"Yes\", F92,\"0\"),0)","v":0}]
[]
[]
[null,null,"List of other heat loss (enter heat loss as a +ve value)",null,"Current ","Modified "]
[]
[null,null,null,"Btu/hr"]
[null,null,null,"Btu/hr",0,0,null,null,null,null,null,null,null,null,null,"Yes"]
[null,null,null,"Btu/hr",0,0,null,null,null,null,null,null,null,null,null,"No"]
[null,null,"Total heat loss","Btu/hr",{"$f":"IFERROR((SUM(E56:E58)*L59)+(E32*L32)+(E17*L17) + E51,0)","v":0},{"$f":"IFERROR((SUM(F56:F58)*L59)+(F32*L32)+(F17*L17) + F51,0)","v":0},null,null,null,null,null,{"$f":"IF('Control page'!D21=0,0,1)","v":1},"Control"]
[]
[]
[]
[null,null,"Note:"]
[null,null,"The heat loss is given as positive number"]
[null,null,"Heat generation or addition is given as negative number"]
[]
[]
[null,null,"NOTES:"]
[null,null,"Enter notes here on proposed changes for the \"Modified\" conditions."]
[null,null,null,null,null,null,null,null,null,null,null,{"$f":"IF(C70=\"\",0,1)","v":0}]
[null,null,null,null,null,null,null,null,null,null,null,{"$f":"IF(C71=\"\",0,1)","v":0}]
[null,null,null,null,null,null,null,null,null,null,null,{"$f":"IF(C72=\"\",0,1)","v":0}]
[null,null,null,null,null,null,null,null,null,null,null,{"$f":"IF(C73=\"\",0,1)","v":0}]
[null,null,null,null,null,null,null,null,null,null,null,{"$f":"IF(C74=\"\",0,1)","v":0}]
[null,null,null,null,null,null,null,null,null,null,null,{"$f":"SUM(L70:L74)","v":0}]
[]
[null,null,null,null,null,null,null,null,null,null,null,null,null,null,null,null,"Pressure Conversion "]
[]
[]
[null,null,null,null,null,null,null,null,null,null,null,null,null,null,null,null,"Inch w.c.*","Pascal","mm w.c."]
[null,null,null,null,null,null,null,null,null,null,null,null,null,null,null,null,{"$f":"0.02","v":0.02},{"$f":"Q81/0.00401574","v":4.9804021176669799},{"$f":"Q81*25.4","v":0.50800000000000001}]
[]
[]
[null,null,null,null,null,null,null,null,null,null,null,null,null,null,null,null,"mm w. c.","Pascal","in w.c. *"]
[null,null,null,null,null,null,null,null,null,null,null,null,null,null,null,null,0.51,{"$f":"Q85/0.102","v":5},{"$f":"Q85/25.4","v":2.0078740157480318E-2}]
[]
[]
[]
[]
[]
[null,null,"Results"]
[null,null,"Heat loss in hot gases Btu/hour",null,{"$f":"E103","v":{"$error":"#DIV/0!"}},{"$f":"F103","v":{"$error":"#DIV/0!"}}]
[null,null,"Heat loss in hot gases kgCE/hour",null,{"$f":"E92*3.41355*10^-5","v":{"$error":"#DIV/0!"}},{"$f":"F92*3.41355*10^-5","v":{"$error":"#DIV/0!"}}]
[]
[null,null,"Detail Calculations "]
[null,null,"Furnace draft (+ or - ve. pressure) inch. W.C.",null,{"$f":"E46","v":0},{"$f":"F46","v":0},null,null,null,null,null,null,"Specific heat of air ",null,null,null,"C","x","x^2","x^3"]
[null,null,"Opening size - area ft^2",null,{"$f":"E47","v":0},{"$f":"F47","v":0},null,null,null,null,null,null,"Cpm air ","Btu/(#-F)",null,null,{"$f":"0.2371","v":0.23710000000000001},{"$f":"(-0.000009)","v":-9.0000000000000002E-6},{"$f":"7*10^(-8)","v":7.0000000000000005E-8},-3E-11]
[null,null,"Air exfiltration from the opening (SCFH) - standard condition*",null,{"$f":"1655*0.8052*(E97*144)*(E96/(E49))^0.5","v":{"$error":"#DIV/0!"}},{"$f":"1655*0.8052*(F97*144)*(F96/(F49))^0.5","v":{"$error":"#DIV/0!"}}]
[null,null,"Temp of gases leaking from the furnace (F)",null,{"$f":"E48","v":0},{"$f":"F48","v":0},null,null,null,null,null,null,"Current ",null,null,null,"cpm","Cpsv"]
[null,null,"Density corrected flow (scfh)",null,{"$f":"E98*(520/(E99+460))^0.5","v":{"$error":"#DIV/0!"}},{"$f":"F98*(520/(F99+460))^0.5","v":{"$error":"#DIV/0!"}},null,null,null,null,null,null,"Average temperature (F) ",null,null,{"$f":"(E99+E102)/2","v":0},{"$f":"Q97+R97*P100+S97*P100^2+T97*P100^3","v":0.23710000000000001},{"$f":"Q100*0.0793","v":1.8802030000000001E-2}]
[null,null,"Density corrected flow (nm^3/hour)",null,{"$f":"E100/35.31","v":{"$error":"#DIV/0!"}},{"$f":"F100/35.31","v":{"$error":"#DIV/0!"}}]
[null,null,"Ambient temp (F)",null,{"$f":"E50","v":0},{"$f":"F50","v":0},null,null,null,null,null,null,"Modified ",null,null,null,"Cpm ","Cpsv"]
[null,null,"Heat in gases Btu/hr",null,{"$f":"R100*E100*(E99-E102)","v":{"$error":"#DIV/0!"}},{"$f":"R103*F100*(F99-F102)","v":{"$error":"#DIV/0!"}},null,null,null,null,null,null,"Average temperature (F) ",null,null,{"$f":"(F99+F102)/2","v":0},{"$f":"Q97+R97*P103+S97*P103^2+T97*P103^3","v":0.23710000000000001},{"$f":"Q103*0.0793","v":1.8802030000000001E-2}]
[null,null,"Number of operating hours per year",null,8000,8000]
[null,null,"Total energy loss MM Btu/year",null,{"$f":"E103*E104/10^6","v":{"$error":"#DIV/0!"}},{"$f":"F103*F104/10^6","v":{"$error":"#DIV/0!"}},null,null,null,null,null,null,"Cpm","Mass specific heat Btu/(lb. F)"]
[null,null,null,null,null,null,null,null,null,null,null,null,"cpsv","Standard volume specific heat Btu/(scf. F)"]
[null,null,"* Reference: North American Combustion Handbook, Page 187, Third Edition Volume 1"]
[null,null,"Formula: cu.ft./sec (cfs) = 1655* K * a*(inch w.c./[sp. Density or sp. Gravity])^0.5"]
[null,null,"K = flow coefficint used as 0.8052 based on data given in graphs (NA Handbook, Vol II page 62 Fig. 7.18 for air), "]
[null,null,"Sp. Garvity is based on air=1.0"]

{"sheet":"Flue gases","index":20,"n_rows":100,"n_cols":18,"rows_kept":100,"cut":false,"hidden":false,"merged":[[17,1,17,4],[18,1,18,4],[19,1,19,4],[20,1,20,4],[21,1,21,4],[16,1,16,4],[1,1,1,4],[3,3,3,4],[3,11,3,12],[15,1,15,4],[11,5,12,7],[99,1,99,4],[26,1,26,4],[67,2,67,3],[94,1,95,1],[97,2,98,2],[70,3,77,3],[64,1,64,3],[65,1,65,3],[47,1,47,4]]}
[]
[null,"Exhaust Gases Available Heat or Combustion Efficiency"]
[null,null,null,"Current","Modified"]
[null,null,null,"Please enter values in both Current and Modified columns.",null,null,null,null,null,null,null,"English Units",null,null,"Av. Heat 1","Xs air correction","Pht. Air correction ","Cp air"]
[null,"Furnace Flue Gas Temperature","deg. F.",null,null,null,null,null,"Copy Current to Modified",null,null,{"$f":"D5","v":0},{"$f":"E5","v":0},null,{"$f":"95-0.025*L5","v":95},{"$f":"-(-1.078914+R5*L5)*(L26/100)","v":0},{"$f":"(-1.078914+R5*L9)*(1+L26/100)","v":-1.0789139999999999},{"$f":"0.0178285179931519 + 0.00000255632*L9","v":1.78285179931519E-2}]
[null,"Select Input (% XS Air or % O2)",null,"% XS Air",{"$f":"D6","v":"% XS Air"}]
[null,"Oxygen in Flue Gases (%)","%",null,null,null,null,null,"Done Entering Data",null,null,{"$f":"D7","v":0},{"$f":"E7","v":0},null,{"$f":"95-0.025*M5","v":95},{"$f":"-(-1.078914+R7*M5)*(M26/100)","v":0},{"$f":"(-1.078914+R7*M9)*(1+M26/100)","v":-1.0789139999999999},{"$f":"0.0178285179931519 + 0.00000255632*M9","v":1.78285179931519E-2}]
[null,"% Excess Air","%",null,null,null,null,null,"Help",null,null,{"$f":"100*8.52381*(L7/100)/(2-9.52381*(L7/100))","v":0},{"$f":"100*8.52381*(M7/100)/(2-9.52381*(M7/100))","v":0}]
[null,"Combustion Air Temperature","deg. F.",null,null,null,null,null,"Print Sheet",null,null,{"$f":"D9","v":0},{"$f":"E9","v":0}]
[null,{"$f":"IF(D6=\"% XS Air\",\"Calculated % O2 in Flue Gas\",\"Calculated % XS Air\")","v":"Calculated % O2 in Flue Gas"},"%",{"$f":"IFERROR(IF(D6=\"% XS Air\",L20,L24),0)","v":0},{"$f":"IFERROR(IF(E6=\"% XS Air\",M20,M24),0)","v":0}]
[null,"Available Heat (%)","%",{"$f":"IF(OR((L11<0),(L11>100)),NA(),L11)","v":93.921086000000003},{"$f":"IF(OR((M11<0),(M11>100)),NA(),M11)","v":93.921086000000003},null,null,null,null,null,null,{"$f":"SUM(O5:Q5)","v":93.921086000000003},{"$f":"SUM(O7:Q7)","v":93.921086000000003}]
[null,"Available Heat (If User Defined) (%)","%",{"$f":"IFERROR(IF(I13 = 0, D60, D94 * 100),\"0\")","v":90.133904135354598},{"$f":"IFERROR(IF(I13 = 0, E60, E94 * 100),\"0\")","v":90.133904135354598},{"$f":"IF( OR(D13=\"User Defined\", E13=\"User Defined\"), \"   Click button below to calculate user defined available heat\", \"\")","v":"   Click button below to calculate user defined available heat"},null,null,null,null,null,{"$f":"IF(D6=\"% XS Air\",L17,D7)","v":{"$error":"#DIV/0!"}},{"$f":"IF(E6=\"% XS Air\",M16,E7)","v":{"$error":"#DIV/0!"}}]
[null,"Available Heat to Use In Calculation",null,"User Defined","Calculated",null,null,null,1,"The left cell (I13) is used to indicate optionbutton state"]
[null,"Available Heat","%",{"$f":"IF(D13=\"Calculated\",D11,D12)","v":90.133904135354598},{"$f":"IF(E13=\"Calculated\",E11,E12)","v":93.921086000000003},null,null,null,null,null,null,{"$f":"D8","v":0},{"$f":"E8","v":0},"% XS Air (Input)"]
[null,null,null,null,null,null,null,null,null,null,null,{"$f":"L14/100","v":0},{"$f":"M14/100","v":0}]
[null,"NOTES:",null,null,null,null,null,null,null,null,null,{"$f":"8.52381/L15","v":{"$error":"#DIV/0!"}},{"$f":"8.52381/M15","v":{"$error":"#DIV/0!"}}]
[null,"Enter notes here on proposed changes for the \"Modified\" conditions.",null,null,null,null,null,null,null,null,null,{"$f":"L16+9.52381","v":{"$error":"#DIV/0!"}},{"$f":"M16+9.52381","v":{"$error":"#DIV/0!"}}]
[null,null,null,null,null,null,null,null,{"$f":"IF(B18=\"\",0,1)","v":0},null,null,{"$f":"1/L17","v":{"$error":"#DIV/0!"}},{"$f":"1/M17","v":{"$error":"#DIV/0!"}}]
[null,null,null,null,null,null,null,null,{"$f":"IF(B19=\"\",0,1)","v":0},null,null,{"$f":"L18*2","v":{"$error":"#DIV/0!"}},{"$f":"M18*2","v":{"$error":"#DIV/0!"}}]
[null,null,null,null,null,null,null,null,{"$f":"IF(B20=\"\",0,1)","v":0},null,null,{"$f":"L19*100","v":{"$error":"#DIV/0!"}},{"$f":"M19*100","v":{"$error":"#DIV/0!"}},"% O2 (Output)"]
[null,null,null,null,null,null,null,null,{"$f":"IF(B21=\"\",0,1)","v":0}]
[null,null,null,null,null,null,null,null,{"$f":"IF(B22=\"\",0,1)","v":0},null,null,{"$f":"D7/100","v":0},{"$f":"E7/100","v":0},"% O2 (Input)"]
[null,null,null,null,null,null,null,null,{"$f":"SUM(I18:I22)","v":0},null,null,{"$f":"(8.52381*L22)/(2-(9.52381*L22))","v":0},{"$f":"(8.52381*M22)/(2-9.52381*M22)","v":0}]
[null,null,null,null,null,null,null,null,null,null,null,{"$f":"L23*100","v":0},{"$f":"M23*100","v":0},"% XS Air (Output)"]
[]
[null,null,null,null,null,null,null,null,null,null,null,{"$f":"IF(D6=\"% XS Air\",D8,L24)","v":0},{"$f":"IF(E6=\"% XS Air\",E8,M24)","v":0}]
[null,"Select Fuel Analysis by weight  (mass) percentage or by volume percentage."]
[]
[]
[]
[]
[]
[]
[]
[]
[null,"Fuel (for user defined available heat calculation)"]
[null,"Coal"]
[null,"Component - use ultimate analysis ","% by weight "]
[null,"C",75]
[null,"H2",5]
[null,"S",0.5]
[null,"Inerts - ash",10]
[null,"O2",8]
[null,"Moisture ",0]
[null,"N2",1.5]
[null,"Total % **",{"$f":"'Data Input & RESULTS '!C13 * 100","v":100}]
[]
[null,"User Defined Available Heat"]
[null,null,null,"Current","Modified "]
[null,"Excess air for combustion","%",{"$f":"IF(D6=\"% XS Air\", D8, D10)","v":0},{"$f":"IF(E6=\"% XS Air\", E8, E10)","v":0}]
[null,"Combustion air temperature","Deg. F",{"$f":"D9","v":0},{"$f":"E9","v":0}]
[null,"Flue gas temperature","Deg. F",{"$f":"D5","v":0},{"$f":"E5","v":0}]
[null,"Fuel temperature","Deg. F",70,70]
[null,"Moisture in air combustion (lb. H2O/lb. of dry air *)","%",1,1]
[null,"Ash discharge temperature","Deg. F",10,10]
[null,"Unburned carbon in ash","% of ash collected",0,0]
[null,"* See psychometric chart below. "]
[null,"** If the total is not exactly 100%, then the program will normalize the component values to get 100% total. "]
[]
[null,"Available Heat (User Defined) (%)*",null,{"$f":"'Data Input & RESULTS '!C27 * 100","v":96.505601675441028},{"$f":"'Data Input & RESULTS '!D27 * 100","v":96.505601675441028}]
[null,"* Based on higher heating value "]
[]
[]
[]
[null,"Available Heat Calculation for Gaseous Fuels"]
[null,"Given Volumetric Gas Analysis"]
[]
[null,"Name or designation of fuel ","Natural Gas - East Ohio"]
[]
[null,"Gas composition ","By volume"]
[null,"CH4  ",0.94099999999999995,"Note:\nThe gas analysis will be adjusted to make total 100% for the calculations."]
[null,"C2H6",3.0099999999999998E-2]
[null,"N2 and other inert",1.41E-2]
[null,"H2",1E-4]
[null,"C3H8",4.1999999999999997E-3]
[null,"C4H10 + CnH2n",2.8E-3]
[null,"H2O",0]
[null,"CO",0]
[null,"CO2",2.0000000000000002E-5]
[null,"SO2",0]
[null,"O2",1E-4]
[null,"Total of fuel components ",{"$f":"SUM(C71:C81)","v":0.99241999999999997}]
[null,"Difference ",{"$f":"1-C82","v":7.5800000000000312E-3}]
[]
[null,"Weight % for tar in gas-tar mixture","%",0]
[null,null,null,"Current","Modified "]
[null,"Fuel temperature","Deg. F."]
[null,"Combustion air temperature","Deg. F.",{"$f":"D9","v":0},{"$f":"E9","v":0}]
[null,"Flue gas temperature","Deg. F.",{"$f":"D5","v":0},{"$f":"E5","v":0}]
[null,"Excess air used for combustion","%",{"$f":"IF($D$6=\"% Oxygen\",D10/100,D8/100)","v":0},{"$f":"IF($D$6=\"% Oxygen\",E10/100,E8/100)","v":0}]
[null,"Percent O2 in flue gas ","%"]
[]
[null,"Results",null,"Current","Modified "]
[null,"Avaiable Heat","%",{"$f":"'Calculations - vol current'!H75","v":0.90133904135354603},{"$f":"'Calculations vol mod'!H75","v":0.90133904135354603}]
[null,"Higher (Gross) calorific (heating value) of the fuel ","Btu/ft3",{"$f":"'Calculations - vol current'!C48","v":1033.217268552},{"$f":"'Calculations vol mod'!C48","v":1033.217268552}]
[null,null,"kcal/m3",{"$f":"'Calculations - vol current'!C48*8.9","v":9195.6336901127997},{"$f":"'Calculations vol mod'!C48*8.9","v":9195.6336901127997}]
[null,"% O2 in Flue gases (dry basis)","%",{"$f":"'Calculations - vol current'!I14","v":0},{"$f":"'Calculations vol mod'!I14","v":0}]
[null,"Stoichiometric air required ","ft3 air/ft3 fuel gas",{"$f":"'Calculations - vol current'!C80","v":10.227344463652615},{"$f":"'Calculations vol mod'!C80","v":10.227344463652615}]
[null,"Actual air required ",null,{"$f":"'Calculations - vol current'!C83","v":10.227344463652615},{"$f":"'Calculations vol mod'!C83","v":10.227344463652615}]
[null,"Available heat based on higher calorific value of the fuel "]

{"sheet":"Av.Ht.Solid - current ","index":21,"n_rows":225,"n_cols":19,"rows_kept":225,"cut":false,"hidden":true,"merged":[[7,11,8,11],[20,5,20,11],[37,1,37,5],[7,1,8,1],[7,2,8,2],[85,8,85,9],[158,2,158,6],[150,1,150,11],[115,7,115,12],[59,1,59,11],[168,2,168,6],[135,7,135,18],[164,2,164,6],[165,2,165,6],[166,2,166,6],[167,2,167,6],[153,2,153,6],[154,2,154,6],[155,2,155,6],[156,2,156,6],[157,2,157,6],[159,2,159,6],[160,2,160,6],[161,2,161,6],[162,2,162,6],[163,2,163,6],[169,2,169,6],[175,1,175,4],[171,2,171,6],[172,2,172,6],[173,2,173,6],[174,2,174,6],[170,2,170,6]]}
[]
[]
[]
[]
[]
[]
[]
[null,"Data - Operating Parameters","Units",null,null,"Current","New",null,null,null,null,"Comments"]
[null,null,null,null,null,"No flue gas recirculation  ","With flue gas recirculation  "]
[null,"Heat input in the dryer/oven ","M Btu/hour",null,null,3500,{"$f":"G11","v":{"$error":"#REF!"}},null,null,null,null,"Note - M (Thousand) Btu and not MM (Million) Btu"]
[null,"Gas used in the dryer-oven","scfh",null,null,{"$f":"F10","v":3500},{"$f":"F44","v":{"$error":"#REF!"}},null,null,null,null,"Meter reading or estimate"]
[null,"Combustion air for the burners ","scfh",null,null,{"$f":"F11*(1+F16/100)*10","v":52500},null,null,null,null,null,"Based on excess air used and 10 scf/1000 Btu"]
[null,"Mass (Air + Gas) stoichiometric","#s/hr",null,null,{"$f":"0.0763*(0.6*F11+10*F11)","v":2830.7300000000005}]
[null,"Mass (Air + Gas) input ","#s/hr",null,null,{"$f":"0.0763*(0.6*F11+F12)","v":4165.9800000000005}]
[null,"Flue gas temperature from dryer/oven","Deg. F.",null,null,425,{"$f":"F15","v":425},null,null,null,null,"From FGA"]
[null,"% Excess air in burners","%",null,null,50,{"$f":"F16","v":50},null,null,null,null,"From burner setting.  DO NOT use FGA analysis numbers!"]
[null,"Av. Heat of the flue gases","%",null,null,{"$f":"#REF!","v":{"$error":"#REF!"}}]
[null,"Mass of water in comb. Products","#s/hr",null,null,{"$f":"G107","v":1926.5118790496763},null,null,null,null,null,"10% of the mass flow of POC of stoich comb. Of n. gas - by weight "]
[null,"Water evaporated from work-load","#s/hr",null,null,1000,{"$f":"F19","v":1000},null,null,null,null,"Using production data"]
[null,"Makeup air volume used in the dryer/oven","scfm",null,null,3500,{"$f":"F40","v":2258.8288964405783},null,null,null,null,"Using dryer design or other methods"]
[null,"Check on  heat input values",null,null,null,{"$f":"IF(F10<F35,\"Heat Input Values are Too Low. Check data input\",\"\")","v":""}]
[null,"Makeup air mass","#s/hr",null,null,{"$f":"0.0763*F20*60","v":16023}]
[null,"Mass flow of dry combustion products","#s/hr",null,null,{"$f":"F14-F18","v":2239.4681209503242}]
[null,"% moisture in flue gases (FG)","#s/# dry FG",null,null,{"$f":"(F19+F18)/(F22+F23)","v":0.16024733676016345},{"$f":"F50","v":{"$error":"#REF!"}}]
[null,"Total FG volume","scfh",null,null,{"$f":"(1/0.0763)*((F14-F18) +F22) +20*(F18+F19)","v":297881.06485426117}]
[null,"Total FG volume","scfm",null,null,{"$f":"F25/60","v":4964.6844142376858}]
[null,"% FG Recirculation by volume","%",null,null,0.25,{"$f":"F27","v":0.25},null,null,null,null,"Usually less than 40% "]
[null,"Recirculated volume","scfm",null,null,{"$f":"F27*F26","v":1241.1711035594215}]
[null,"% Gas savings","%",null,null,"Base",{"$f":"F51","v":{"$error":"#REF!"}}]
[null,"No. of operating hours per year","hrs/year",null,null,6500,{"$f":"F30","v":6500}]
[null,"Gas cost (Dollars per therm) ","$/therm",null,null,0.95,{"$f":"F31","v":0.95}]
[null,"Therms saved per year","Therms/year",null,null,"Base",{"$f":"G29*G30*F11/100","v":{"$error":"#REF!"}}]
[null,"Gas Cost savings ","$/year",null,null,"Base",{"$f":"G32*G31","v":{"$error":"#REF!"}}]
[]
[null,"Minimum total heat required in dryer/oven","M Btu/hr",null,null,{"$f":"(F19*1100 + 0.02*F20*(F15-60)*60)/1000","v":2633}]
[]
[]
[null,"New conditions with recycled flue gases"]
[null,"Reduction in make up air","scfm",null,null,{"$f":"F28","v":1241.1711035594215}]
[null,"New makeup air volume","scfm",null,null,{"$f":"F20-F39","v":2258.8288964405783}]
[null,"New makeup air mass","#s/hr",null,null,{"$f":"0.0763*F40*60","v":10340.918687904968}]
[null,"Reduction in net heat load","Btu/hr",null,null,{"$f":"F39*60*0.02* (F15-100)","v":484056.73038817442}]
[null,"Reduction in burner heat input","Btu/hr",null,null,{"$f":"F42/(F17/100)","v":{"$error":"#REF!"}}]
[null,"New value of gas input","scfh",null,null,{"$f":"F11-F43/1000","v":{"$error":"#REF!"}}]
[null,"New value of air input","scfh",null,null,{"$f":"F44*(1+F16/100)*10","v":{"$error":"#REF!"}}]
[null,"New value of (air+ gas) input - burner","#s/hr",null,null,{"$f":"0.0763*(0.6*F44+F45)","v":{"$error":"#REF!"}}]
[null,"New value of stoichiometric air + gas mass ","#s/hr",null,null,{"$f":"0.0763*(0.6*F44+10*F44)","v":{"$error":"#REF!"}}]
[null,"Mass of water in comb. Products","#s/hr",null,null,{"$f":"0.1*11*F44*0.0763","v":{"$error":"#REF!"}}]
[null,"Mass flow of dry combustion products","#s/hr",null,null,{"$f":"F46-F48","v":{"$error":"#REF!"}}]
[null,"New % moisture in flue gases","#s/# dry FG",null,null,{"$f":"(F19+F48)/(F41+F49)","v":{"$error":"#REF!"}}]
[null,"% gas savings",null,null,null,{"$f":"(F11-F44)/F11","v":{"$error":"#REF!"}}]
[]
[]
[]
[]
[]
[]
[null,null,null,"TENTATIVE",null,null,null,null,null,null,null,{"$f":"I69+J69","v":1.7278617710583153}]
[]
[null,"Carbon Dioxide and water vapor in stoich. Combustion of solid-liquid fuels "]
[null,null,null,null,null,"Coefficients "]
[null,null,"O2","N2","Ratio N2/O2"]
[null,"Composition of air - wt.",23.15,{"$f":"100-C63","v":76.849999999999994},{"$f":"D63/C63","v":3.3196544276457884}]
[null,"Composition of air - vol",20.99,{"$f":"100-C64","v":79.010000000000005},{"$f":"D64/C64","v":3.7641734159123397}]
[]
[null,"Fuel composition ","By weight - wet","By weight -dry","Heating value Bt/lb.","CO2 (Lbs/lb.)","H2O (Lbs/lb.)","SO2 (Lbs/lb.)","O2 (Lbs/lb.) required","N2 (Lbs/lb.)","Air","Heating value Btu/lb.","Comb. Products  (Lbs./lb.)","Vol air- ft3/lb. fuel"]
[null,"Bituminous Coal"]
[null,"C",{"$f":"'Data Input & RESULTS '!C6","v":0.75},{"$f":"C68/$C$82","v":0.75},14100,{"$f":"(D68)*44/12","v":2.75},null,null,{"$f":"D68*32/12","v":2},{"$f":"I68*$E$63","v":6.6393088552915769},{"$f":"I68+J68","v":8.6393088552915778},{"$f":"C68*E68","v":10575},{"$f":"D68*44/12","v":2.75},150,null,{"$f":"SUM(F68:H68)+J68","v":9.3893088552915778},{"$f":"D68*44/12","v":2.75}]
[null,"H",{"$f":"'Data Input & RESULTS '!C7","v":0.05},0.05,61100,null,{"$f":"D69*18/2","v":0.45},null,{"$f":"D69*16/2","v":0.4},{"$f":"I69*$E$63","v":1.3278617710583154},{"$f":"I69+J69","v":1.7278617710583153},3055,{"$f":"D69*18/2","v":0.45},451,null,1.7778617710583153]
[null,"S",{"$f":"'Data Input & RESULTS '!C8","v":5.0000000000000001E-3},5.0000000000000001E-3,3980,null,null,{"$f":"D70*64/32","v":0.01},{"$f":"D70*32/32","v":5.0000000000000001E-3},{"$f":"I70*$E$63","v":1.6598272138228943E-2},{"$f":"I70+J70","v":2.1598272138228944E-2},19.900000000000002,5.2999999999999999E-2,56.4,null,2.6598272138228941E-2]
[null,"Inerts",{"$f":"'Data Input & RESULTS '!C9","v":0.1},0.1,null,null,null,null,null,{"$f":"I71*$E$63","v":0},{"$f":"I71+J71","v":0},0,0.01,0,null,0]
[null,"O2",{"$f":"'Data Input & RESULTS '!C10","v":0.08},0.08,null,null,null,null,{"$f":"-(C72)","v":-0.08},{"$f":"I72*$E$63","v":-0.26557235421166309},{"$f":"I72+J72","v":-0.3455723542116631},0,-3.3099999999999997E-2,{"$f":"-1/0.0763","v":-13.10615989515072},null,-0.26557235421166309]
[null,"Moisture ",{"$f":"'Data Input & RESULTS '!C11","v":0},0,null,null,{"$f":"D73","v":0},null,null,null,null,0,null,0,null,0]
[null,"N",{"$f":"'Data Input & RESULTS '!C12","v":1.4999999999999999E-2},1.4999999999999999E-2,null,null,null,null,null,null,null,null,null,0,null,0]
[null,"Total",null,null,null,{"$f":"SUM(F68:F74)","v":2.75},0.45,0.01,2.3249999999999997,7.7181965442764575,10.043196544276459,13649.9]
[null,"Excess air contributions",null,null,null,null,null,null,{"$f":"($C$83)*I75","v":0},{"$f":"($C$83)*J75","v":0},{"$f":"($C$83)*K75","v":0}]
[null,"Total with Xs air",null,null,null,null,null,null,{"$f":"I75+I76","v":2.3249999999999997},{"$f":"J75+J76","v":7.7181965442764575},{"$f":"K75+K76","v":10.043196544276459}]
[null,"Moisture in air lb./lb of air",{"$f":"'Data Input & RESULTS '!C21","v":0.01},null,null,null,{"$f":"(C78*K77)","v":0.10043196544276459},null,null,null,null,"lb. /lb of fuel"]
[null,null,"Comb producta incl. Xs air",null,null,{"$f":"F75","v":2.75},{"$f":"G75+G78","v":0.55043196544276463},{"$f":"H75","v":0.01},{"$f":"I76","v":0},{"$f":"J77","v":7.7181965442764575},null,{"$f":"SUM(F79:J79)","v":11.028628509719223}]
[null,null,"Wet",null,null,null,null,null,null,null,null,{"$f":"L79","v":11.028628509719223}]
[null,null,"Dry",null,null,null,null,null,null,null,null,{"$f":"L80-G79","v":10.478196544276457}]
[null,"Total of fuel components ",{"$f":"SUM(C68:C74)","v":1},{"$f":"SUM(D68:D81)","v":1}]
[null,"Excess air %",{"$f":"'Data Input & RESULTS '!C17","v":0}]
[null,null,null,null,null,null,null,null,null,null,null,null,1.8190000000000001E-3]
[null,"Total incl. effect of Excess air ",null,null,null,{"$f":"SUM(F68:F74)","v":2.75},{"$f":"SUM(G68:G74)","v":0.45},{"$f":"SUM(H68:H74)","v":0.01},{"$f":"SUM(I68:I74)","v":2.3249999999999997},{"$f":"SUM(J68:J75)","v":15.436393088552915},null,{"$f":"SUM(L68:L73)","v":13649.9},{"$f":"100*(C68*M68+M69*C69+C70*M70+C71*M71+C72*M72)","v":208.36169999999998},{"$f":"($C$68*N68+0.5*$C$69*N69+$C$70*N70+$C$71*N71+$C$72*N72+$C$73*N73+$C$74*N74+$C$75*N75+$C$76*N76+$C$77*N77+$C$81*N81)*(1+$C$83/100)","v":{"$error":"#VALUE!"}},null,{"$f":"SUM(P68:P75)","v":10.928196544276458},{"$f":"I86+F85+G85+H85-I85","v":18.646393088552916}]
[null,"Temperature of combustion air (F)",{"$f":"'Data Input & RESULTS '!C18","v":0},null,null,null,null,"Ait ",{"$f":"I85+J85","v":17.761393088552914}]
[null,"Fuel temperature (F)",{"$f":"'Data Input & RESULTS '!C20","v":70},null,null,null,null,null,null,null,null,null,null,{"$f":"100*N85/L85","v":{"$error":"#VALUE!"}}]
[null,"Flue gas temperature (F)",{"$f":"'Data Input & RESULTS '!C19","v":0}]
[]
[]
[null,"Excess air used %",{"$f":"C83","v":0},null,null,null,null,null,null,null,null,null,null,{"$f":"1/N87","v":{"$error":"#VALUE!"}}]
[null,"Additional O2 lbs./lb of fuel",{"$f":"I85*C91","v":0}]
[null,"Additioanl N2 in excess air lbs./lb. of fuel",{"$f":"C92*H206","v":0},null,null,null,null,null,null,null,null,{"$f":"16/0.23","v":69.565217391304344}]
[null,"Ttaol additional air  lb of lb. of fuel",{"$f":"C92+C93","v":0},null,null,null,null,null,null,null,null,null,null,"Component","o2","n2","co2","fg","fg per #"]
[null,null,null,null,null,null,null,null,null,null,null,null,null,12,32,{"$f":"O95*3.3103","v":105.92959999999999},44,{"$f":"P95+Q95","v":149.92959999999999},{"$f":"R95/N95","v":12.494133333333332}]
[null,null,null,null,null,null,null,null,null,null,null,null,null,2,16,{"$f":"O96*3.3103","v":52.964799999999997},18,{"$f":"P96+Q96","v":70.964799999999997},{"$f":"R96/N96","v":35.482399999999998}]
[null,null,null,null,null,null,null,null,null,null,null,null,null,32,32,{"$f":"O97*3.3103","v":105.92959999999999},64,{"$f":"P97+Q97","v":169.92959999999999},{"$f":"R97/N97","v":5.3102999999999998}]
[null,"Flue gas composition - content",null,null,null,"CO2","H2O","SO2","O2","N2",null,"Total ","Diff "]
[null,"Lbs./lb. of fuel ",null,null,null,{"$f":"F79","v":2.75},{"$f":"G79","v":0.55043196544276463},{"$f":"H79","v":0.01},{"$f":"I79","v":0},{"$f":"J79","v":7.7181965442764575},null,{"$f":"SUM(F99:J99)","v":11.028628509719223},{"$f":"(M85-L99)/L99","v":17.892802474612019}]
[null,"Composition by weight (wet) ",null,null,null,{"$f":"F99/$L$99","v":0.2493510410271324},{"$f":"G99/$L$99","v":4.9909375853732341E-2},{"$f":"H99/$L$99","v":9.0673105828048149E-4},{"$f":"I99/$L$99","v":0},{"$f":"J99/$L$99","v":0.69983285206085477},null,{"$f":"L99/$L$99","v":1}]
[null,"Composition by weight (dry) ",null,null,null,{"$f":"F99/$L$81","v":0.26244974394015758},0,{"$f":"H99/$L$81","v":9.5436270523693661E-4},{"$f":"I99/$L$81","v":0},{"$f":"J99/$L$81","v":0.73659589335460551},null,{"$f":"L100","v":1}]
[null,"Volume per lb. of fuel (scf/lb of fuel) -wet",null,null,null,{"$f":"F99*'Cp calculationsHTcurrent'!H14","v":37.144642857142856},{"$f":"G99*'Cp calculationsHTcurrent'!H20","v":11.565187185025199},{"$f":"H99*'Cp calculationsHTcurrent'!H14","v":0.13507142857142856},{"$f":"I99*'Cp calculationsHTcurrent'!H8","v":0},{"$f":"J99*'Cp calculationsHTcurrent'!H11","v":104.25078332304842},null,{"$f":"SUM(F102:J102)","v":153.09568479378791}]
[null,"Composition by volume (wet) ",null,null,null,{"$f":"F102/$L$102","v":0.24262370887314555},{"$f":"G102/$L$102","v":7.5542215318497821E-2},{"$f":"H102/$L$102","v":8.8226803226598379E-4},{"$f":"I102/$L$102","v":0},{"$f":"J102/$L$102","v":0.68095180777609066},null,{"$f":"L102/$L$102","v":1}]
[null,"Composition by volume (dry) ",null,null,null,{"$f":"F103/(1-$G$103)","v":0.26244974394015752},0,{"$f":"H103/(1-$G$103)","v":9.543627052369365E-4},{"$f":"I103/(1-$G$103)","v":0},{"$f":"J103/(1-$G$103)","v":0.73659589335460551},null,{"$f":"SUM(H104:J104)+F104","v":1}]
[null,"Heating value (Btu/lb of fuel)",null,null,null,null,null,null,null,null,null,{"$f":"L85","v":13649.9}]
[null,"Cu. ft. of fuel ",null,null,null,{"$f":"F11","v":3500},{"$f":"F11","v":3500}]
[null,"Total in flue gases (Lbs.) ",null,null,null,{"$f":"F99*F11","v":9625},{"$f":"G99*F11","v":1926.5118790496763}]
[null,"Heat in the flue gas components (Btu/lb of fuel) ",null,null,null,{"$f":"F99*'Cp calculationsHTcurrent'!G24*('Av.Ht.Solid - current '!C88-60)","v":-32.504489603024574},{"$f":"'Av.Ht.Solid - current '!G75*(J121+'Cp calculationsHTcurrent'!G94*('Av.Ht.Solid - current '!C88-60))+G78*'Cp calculationsHTcurrent'!G94*('Av.Ht.Solid - current '!C88-60)","v":483.49392302392437},{"$f":"H99*'Cp calculationsHTcurrent'!G24*('Av.Ht.Solid - current '!C88-60)","v":-0.11819814401099844},{"$f":"I99*'Cp calculationsHTcurrent'!G9*('Av.Ht.Solid - current '!C88-60)","v":0},{"$f":"J99*'Cp calculationsHTcurrent'!G12*('Av.Ht.Solid - current '!C88-60)","v":-115.49563084029703},null,{"$f":"SUM(F108:J108)","v":335.37560443659174}]
[]
[null,"CO2 and H2O values (Lbs./MM Btu) ",null,null,null,{"$f":"F99*10^6/$L$105","v":201.46667741155613},{"$f":"G99*10^6/$L$105","v":40.324981534133187}]
[null,"Carbon equivalent -  (Lbs. of Carbon/MM Btu)",null,null,null,{"$f":"F110*12/44","v":54.945457475878946}]
[]
[]
[null,"Heat entering the system "]
[null,"Sensible heat "]
[null,"Air ",null,"Btu/lb. of fuel ",{"$f":"K77*'Cp calculationsHTcurrent'!F68*('Av.Ht.Solid - current '!C86-60)/0.075","v":-144.25627246738483},null,null,"Calculations for Water vapor - steam enthalpy etc. "]
[null,"Fuel ",null,"Btu/lb. of fuel ",{"$f":"0.24*(1-C73)*(C87-60)","v":2.4},null,null,"Equation coeff for enthalpy @ saturation calculations ",null,"Enthalpy",null,1096.7,1.2999999999999999E-2,"Equation: Enthalpy = 1096 * Partial pressure (inch HG) ^ 0.013"]
[null,"Moisturer  in fuel",null,"Btu/lb. of fuel ",{"$f":"C73*(C87-60)","v":0}]
[null,"Chemical heat or heating value of fuel",null,"Btu/lb. of fuel ",{"$f":"L105","v":13649.9},null,null,"Partial pressure of H2O",null,{"$f":"G103","v":7.5542215318497821E-2},null,"atm",null,"From volumetric wet analysis "]
[null,"Total heat in ",null,"Btu/lb. of fuel ",{"$f":"SUM(E116:E119)","v":13508.043727532615},null,null,null,null,{"$f":"J119*29.926","v":2.2606763356213655},null,"inch HG",null,"Conversion from atm to inch HG"]
[null,"Heat in flue gases ",null,"Btu/lb. of fuel ",{"$f":"L108","v":335.37560443659174},null,null,"Enthalpy at saturated  condition",null,{"$f":"L117*J120^M117","v":1108.3908770123517},null,"Btu/lb of steam",null,"Enthalpy for partial pressure using coeffs. "]
[null,"Heating value of carbon ",null,"Btu/lb. ",14093]
[null,"Sensible heat in ash discharged  ",null,"Btu/lb of fuel",{"$f":"'Data Input & RESULTS '!C9*0.25*(1.8*'Data Input & RESULTS '!C22+32-60)","v":-0.25}]
[null,"Chemical heat in unburned carbon ",null,"Btu/lb. of fuel ",{"$f":"'Data Input & RESULTS '!C23*'Data Input & RESULTS '!C9*'Av.Ht.Solid - current '!E122","v":0}]
[]
[null,"Available heat ",null,"%",{"$f":"(E120-E121-E124-E123)/E119","v":0.96505601675441022},null,null,"Saturation temperature",null,{"$f":"J127*LN(J120)+J128","v":110.42524613055899},null,"deg. F.",null,"Equation: Sat. Temp (F) = 36.009 * LN(partial pressure inch HG)  + 81.054"]
[null,null,null,null,null,null,null,null,"Coeff for satuation temp (F) calculation",36.009]
[null,null,null,null,null,null,null,null,null,81.054000000000002]
[]
[]
[]
[]
[]
[]
[]
[null,null,null,null,null,null,null,"Total heat content of water vapor  = Mass or weight of water/lb of fuel * (Enthalpy at saturation + Sp. Heat of vapor *(flue gas temp. [F] - 60 [F]) "]
[null,null,null,null,null,null,null,{"$f":"G99*(J121+'Cp calculationsHTcurrent'!G94*('Av.Ht.Solid - current '!C88-60))","v":594.81179728110442},"E111*(M120+E112*(C89-M121))"]
[]
[]
[]
[]
[null,"Emission ","CO2 equivalnet in Lbs. ",null,null,"2001 values *"]
[null,"Carbon dioxide (CO2)         ",1,null,null,1]
[null,"Methane (CH4)                    ",21,null,null,23]
[null,"Nitrous oxide (N2O)           ",310,null,null,296]
[null,"Hydrofluorocarbon (HFC)-134a   (used in mobile source air conditioning)  ",1300,null,null,1300]
[]
[]
[]
[null,"* See note below"]
[null,"These estimates are from the IPCC’s Second Assessment Report (1996). These are the values used internationally for reporting greenhouse gas (GHG) emissions to the United Nations. (EPA also uses them for the Inventory of U.S. Greenhouse Gas Emissions and S"]
[]
[null,"Relationship Between Ultimate Analysis and Proximate Analysis"]
[null,"%C",{"$f":"B156","v":"0.97C+ 0.7(VM - 0.1A) - M(0.6-0.01M)"}]
[null,"="]
[null,"0.97C+ 0.7(VM - 0.1A) - M(0.6-0.01M)"]
[null,"%H",{"$f":"B159","v":"0.036C + 0.086 (VM -0.1xA) - 0.0035M2 (1-0.02M)"}]
[null,"="]
[null,"0.036C + 0.086 (VM -0.1xA) - 0.0035M2 (1-0.02M)"]
[null,"%N2",{"$f":"B162","v":"2.10 -0.020 VM"}]
[null,"="]
[null,"2.10 -0.020 VM"]
[null,"where"]
[null,"C",{"$f":"B166","v":"% of fixed carbon"}]
[null,"="]
[null,"% of fixed carbon"]
[null,"A",{"$f":"B169","v":"% of ash"}]
[null,"="]
[null,"% of ash"]
[null,"VM",{"$f":"B172","v":"% of volatile matter"}]
[null,"="]
[null,"% of volatile matter"]
[null,"M",{"$f":"B175","v":"% of moisture"}]
[null,"="]
[null,"% of moisture"]
[null,"Relationship Between Ultimate Analysis and Proximate Analysis"]
[null,"%C","0.97+ 0.7(VM - 0.1A) - M(0.6-0.01M)"]
[null,"="]
[null,"0.97C+ 0.7(VM - 0.1A) - M(0.6-0.01M)"]
[null,"%H"]
[null,"="]
[null,"0.036C + 0.086 (VM -0.1xA) - 0.0035M2 (1-0.02M)"]
[null,"%N2"]
[null,"="]
[null,"2.10 -0.020 VM"]
[null,"where"]
[null,"C"]
[null,"="]
[null,"% of fixed carbon"]
[null,"A"]
[null,"="]
[null,"% of ash"]
[null,"VM"]
[null,"="]
[null,"% of volatile matter"]
[null,"M"]
[null,"="]
[null,"% of moisture"]
[]
[]
[]
[]
[null,"Table 1: Standard Composition of Dry Air (Detailed Analysis):"]
[null,"Gas","% by Volume","% by Weight ","Parts per Million (by Volume)","Chemical Symbol","Molecular Weight"]
[null,"Nitrogen",78.08,75.47,780805,"N2",28.01,"Ratio N2/O2 wt."]
[null,"Oxygen",20.95,23.2,209450,"O2",32,{"$f":"(100-D206)/D206","v":3.3103448275862069}]
[null,"Argon",0.93,1.28,9340,"Ar",39.950000000000003]
[null,"Carbon Dioxide ",3.9E-2,6.0600000000000001E-2,390,"CO2",44.01]
[null,"Neon",1.8E-3,1.1999999999999999E-3,18.21,"Ne",20.18]
[null,"Helium",5.0000000000000001E-4,6.9999999999999994E-5,5.24,"He",4]
[null,"Krypton",1E-4,2.9999999999999997E-4,1.1399999999999999,"Kr",83.8]
[null,"Hydrogen","0.00005 ","Negligible",0.5,"H2",2.02]
[null,"Xenon","8.7 x 10-6",4.0000000000000003E-5,8.6999999999999994E-2,"Xe",131.30000000000001]
[]
[]
[null,"C","% Fixed carbon",null,0.67500000000000004]
[null,"A","% Ash",null,0.1]
[null,"VM","% Volatime matter",null,0.15]
[null,"M","% Moisture",null,7.4999999999999997E-2]
[null,"Total ",null,null,{"$f":"SUM(E216:E219)","v":1}]
[null,"C "]
[null,"H2",null,null,{"$f":"0.97*E216+0.7*(E218-0.1*E217)-E219*(0.6 - 0.01*E219)","v":0.70780625000000008}]
[null,"N2",null,null,{"$f":"0.036*E216+0.086*(E218-0.1*E217)-0.0035*E219^2*(1-0.02*E219)","v":3.6320342031249994E-2}]
[null,null,null,null,{"$f":"(2.1-0.02*E218)/100","v":2.0969999999999999E-2}]
[null,null,null,null,null,{"$f":"SUM(E222:E224)","v":0.76509659203125013}]

{"sheet":"Av.Ht.Solid - modified","index":22,"n_rows":225,"n_cols":19,"rows_kept":225,"cut":false,"hidden":true,"merged":[[173,2,173,6],[174,2,174,6],[175,1,175,4],[167,2,167,6],[168,2,168,6],[169,2,169,6],[170,2,170,6],[171,2,171,6],[172,2,172,6],[166,2,166,6],[155,2,155,6],[156,2,156,6],[157,2,157,6],[158,2,158,6],[159,2,159,6],[160,2,160,6],[161,2,161,6],[162,2,162,6],[163,2,163,6],[164,2,164,6],[165,2,165,6],[154,2,154,6],[7,1,8,1],[7,2,8,2],[153,2,153,6],[135,7,135,18],[150,1,150,11],[7,11,8,11],[20,5,20,11],[37,1,37,5],[59,1,59,11],[85,8,85,9],[115,7,115,12]]}
[]
[]
[]
[]
[]
[]
[]
[null,"Data - Operating Parameters","Units",null,null,"Current","New",null,null,null,null,"Comments"]
[null,null,null,null,null,"No flue gas recirculation  ","With flue gas recirculation  "]
[null,"Heat input in the dryer/oven ","M Btu/hour",null,null,3500,{"$f":"G11","v":{"$error":"#REF!"}},null,null,null,null,"Note - M (Thousand) Btu and not MM (Million) Btu"]
[null,"Gas used in the dryer-oven","scfh",null,null,{"$f":"F10","v":3500},{"$f":"F44","v":{"$error":"#REF!"}},null,null,null,null,"Meter reading or estimate"]
[null,"Combustion air for the burners ","scfh",null,null,{"$f":"F11*(1+F16/100)*10","v":52500},null,null,null,null,null,"Based on excess air used and 10 scf/1000 Btu"]
[null,"Mass (Air + Gas) stoichiometric","#s/hr",null,null,{"$f":"0.0763*(0.6*F11+10*F11)","v":2830.7300000000005}]
[null,"Mass (Air + Gas) input ","#s/hr",null,null,{"$f":"0.0763*(0.6*F11+F12)","v":4165.9800000000005}]
[null,"Flue gas temperature from dryer/oven","Deg. F.",null,null,425,{"$f":"F15","v":425},null,null,null,null,"From FGA"]
[null,"% Excess air in burners","%",null,null,50,{"$f":"F16","v":50},null,null,null,null,"From burner setting.  DO NOT use FGA analysis numbers!"]
[null,"Av. Heat of the flue gases","%",null,null,{"$f":"#REF!","v":{"$error":"#REF!"}}]
[null,"Mass of water in comb. Products","#s/hr",null,null,{"$f":"G107","v":1926.5118790496763},null,null,null,null,null,"10% of the mass flow of POC of stoich comb. Of n. gas - by weight "]
[null,"Water evaporated from work-load","#s/hr",null,null,1000,{"$f":"F19","v":1000},null,null,null,null,"Using production data"]
[null,"Makeup air volume used in the dryer/oven","scfm",null,null,3500,{"$f":"F40","v":2258.8288964405783},null,null,null,null,"Using dryer design or other methods"]
[null,"Check on  heat input values",null,null,null,{"$f":"IF(F10<F35,\"Heat Input Values are Too Low. Check data input\",\"\")","v":""}]
[null,"Makeup air mass","#s/hr",null,null,{"$f":"0.0763*F20*60","v":16023}]
[null,"Mass flow of dry combustion products","#s/hr",null,null,{"$f":"F14-F18","v":2239.4681209503242}]
[null,"% moisture in flue gases (FG)","#s/# dry FG",null,null,{"$f":"(F19+F18)/(F22+F23)","v":0.16024733676016345},{"$f":"F50","v":{"$error":"#REF!"}}]
[null,"Total FG volume","scfh",null,null,{"$f":"(1/0.0763)*((F14-F18) +F22) +20*(F18+F19)","v":297881.06485426117}]
[null,"Total FG volume","scfm",null,null,{"$f":"F25/60","v":4964.6844142376858}]
[null,"% FG Recirculation by volume","%",null,null,0.25,{"$f":"F27","v":0.25},null,null,null,null,"Usually less than 40% "]
[null,"Recirculated volume","scfm",null,null,{"$f":"F27*F26","v":1241.1711035594215}]
[null,"% Gas savings","%",null,null,"Base",{"$f":"F51","v":{"$error":"#REF!"}}]
[null,"No. of operating hours per year","hrs/year",null,null,6500,{"$f":"F30","v":6500}]
[null,"Gas cost (Dollars per therm) ","$/therm",null,null,0.95,{"$f":"F31","v":0.95}]
[null,"Therms saved per year","Therms/year",null,null,"Base",{"$f":"G29*G30*F11/100","v":{"$error":"#REF!"}}]
[null,"Gas Cost savings ","$/year",null,null,"Base",{"$f":"G32*G31","v":{"$error":"#REF!"}}]
[]
[null,"Minimum total heat required in dryer/oven","M Btu/hr",null,null,{"$f":"(F19*1100 + 0.02*F20*(F15-60)*60)/1000","v":2633}]
[]
[]
[null,"New conditions with recycled flue gases"]
[null,"Reduction in make up air","scfm",null,null,{"$f":"F28","v":1241.1711035594215}]
[null,"New makeup air volume","scfm",null,null,{"$f":"F20-F39","v":2258.8288964405783}]
[null,"New makeup air mass","#s/hr",null,null,{"$f":"0.0763*F40*60","v":10340.918687904968}]
[null,"Reduction in net heat load","Btu/hr",null,null,{"$f":"F39*60*0.02* (F15-100)","v":484056.73038817442}]
[null,"Reduction in burner heat input","Btu/hr",null,null,{"$f":"F42/(F17/100)","v":{"$error":"#REF!"}}]
[null,"New value of gas input","scfh",null,null,{"$f":"F11-F43/1000","v":{"$error":"#REF!"}}]
[null,"New value of air input","scfh",null,null,{"$f":"F44*(1+F16/100)*10","v":{"$error":"#REF!"}}]
[null,"New value of (air+ gas) input - burner","#s/hr",null,null,{"$f":"0.0763*(0.6*F44+F45)","v":{"$error":"#REF!"}}]
[null,"New value of stoichiometric air + gas mass ","#s/hr",null,null,{"$f":"0.0763*(0.6*F44+10*F44)","v":{"$error":"#REF!"}}]
[null,"Mass of water in comb. Products","#s/hr",null,null,{"$f":"0.1*11*F44*0.0763","v":{"$error":"#REF!"}}]
[null,"Mass flow of dry combustion products","#s/hr",null,null,{"$f":"F46-F48","v":{"$error":"#REF!"}}]
[null,"New % moisture in flue gases","#s/# dry FG",null,null,{"$f":"(F19+F48)/(F41+F49)","v":{"$error":"#REF!"}}]
[null,"% gas savings",null,null,null,{"$f":"(F11-F44)/F11","v":{"$error":"#REF!"}}]
[]
[]
[]
[]
[]
[]
[null,null,null,"TENTATIVE",null,null,null,null,null,null,null,{"$f":"I69+J69","v":1.7278617710583153}]
[]
[null,"Carbon Dioxide and water vapor in stoich. Combustion of solid-liquid fuels "]
[null,null,null,null,null,"Coefficients "]
[null,null,"O2","N2","Ratio N2/O2"]
[null,"Composition of air - wt.",23.15,{"$f":"100-C63","v":76.849999999999994},{"$f":"D63/C63","v":3.3196544276457884}]
[null,"Composition of air - vol",20.99,{"$f":"100-C64","v":79.010000000000005},{"$f":"D64/C64","v":3.7641734159123397}]
[]
[null,"Fuel composition ","By weight - wet","By weight -dry","Heating value Bt/lb.","CO2 (Lbs/lb.)","H2O (Lbs/lb.)","SO2 (Lbs/lb.)","O2 (Lbs/lb.) required","N2 (Lbs/lb.)","Air","Heating value Btu/lb.","Comb. Products  (Lbs./lb.)","Vol air- ft3/lb. fuel"]
[null,"Bituminous Coal"]
[null,"C",{"$f":"'Data Input & RESULTS '!C6","v":0.75},{"$f":"C68/$C$82","v":0.75},14100,{"$f":"(D68)*44/12","v":2.75},null,null,{"$f":"D68*32/12","v":2},{"$f":"I68*$E$63","v":6.6393088552915769},{"$f":"I68+J68","v":8.6393088552915778},{"$f":"C68*E68","v":10575},{"$f":"D68*44/12","v":2.75},150,null,{"$f":"SUM(F68:H68)+J68","v":9.3893088552915778},{"$f":"D68*44/12","v":2.75}]
[null,"H",{"$f":"'Data Input & RESULTS '!C7","v":0.05},0.05,61100,null,{"$f":"D69*18/2","v":0.45},null,{"$f":"D69*16/2","v":0.4},{"$f":"I69*$E$63","v":1.3278617710583154},{"$f":"I69+J69","v":1.7278617710583153},3055,{"$f":"D69*18/2","v":0.45},451,null,1.7778617710583153]
[null,"S",{"$f":"'Data Input & RESULTS '!C8","v":5.0000000000000001E-3},5.0000000000000001E-3,3980,null,null,{"$f":"D70*64/32","v":0.01},{"$f":"D70*32/32","v":5.0000000000000001E-3},{"$f":"I70*$E$63","v":1.6598272138228943E-2},{"$f":"I70+J70","v":2.1598272138228944E-2},19.900000000000002,5.2999999999999999E-2,56.4,null,2.6598272138228941E-2]
[null,"Inerts",{"$f":"'Data Input & RESULTS '!C9","v":0.1},0.1,null,null,null,null,null,{"$f":"I71*$E$63","v":0},{"$f":"I71+J71","v":0},0,0.01,0,null,0]
[null,"O2",{"$f":"'Data Input & RESULTS '!C10","v":0.08},0.08,null,null,null,null,{"$f":"-(C72)","v":-0.08},{"$f":"I72*$E$63","v":-0.26557235421166309},{"$f":"I72+J72","v":-0.3455723542116631},0,-3.3099999999999997E-2,{"$f":"-1/0.0763","v":-13.10615989515072},null,-0.26557235421166309]
[null,"Moisture ",{"$f":"'Data Input & RESULTS '!C11","v":0},0,null,null,{"$f":"D73","v":0},null,null,null,null,0,null,0,null,0]
[null,"N",{"$f":"'Data Input & RESULTS '!C12","v":1.4999999999999999E-2},1.4999999999999999E-2,null,null,null,null,null,null,null,null,null,0,null,0]
[null,"Total",null,null,null,{"$f":"SUM(F68:F74)","v":2.75},0.45,0.01,2.3249999999999997,7.7181965442764575,10.043196544276459,13649.9]
[null,"Excess air contributions",null,null,null,null,null,null,{"$f":"($C$83)*I75","v":0},{"$f":"($C$83)*J75","v":0},{"$f":"($C$83)*K75","v":0}]
[null,"Total with Xs air",null,null,null,null,null,null,{"$f":"I75+I76","v":2.3249999999999997},{"$f":"J75+J76","v":7.7181965442764575},{"$f":"K75+K76","v":10.043196544276459}]
[null,"Moisture in air lb./lb of air",{"$f":"'Data Input & RESULTS '!D21","v":0.01},null,null,null,{"$f":"C78*K77","v":0.10043196544276459},null,null,null,null,"lb. /lb of fuel"]
[null,null,"Comb producta incl. Xs air",null,null,{"$f":"F75","v":2.75},{"$f":"G75+G78","v":0.55043196544276463},{"$f":"H75","v":0.01},{"$f":"I76","v":0},{"$f":"J77","v":7.7181965442764575},null,{"$f":"SUM(F79:J79)","v":11.028628509719223}]
[null,null,"Wet",null,null,null,null,null,null,null,null,{"$f":"L79","v":11.028628509719223}]
[null,null,"Dry",null,null,null,null,null,null,null,null,{"$f":"L80-G79","v":10.478196544276457}]
[null,"Total of fuel components ",{"$f":"SUM(C68:C74)","v":1},{"$f":"SUM(D68:D81)","v":1}]
[null,"Excess air %",{"$f":"'Data Input & RESULTS '!D17","v":0}]
[null,null,null,null,null,null,null,null,null,null,null,null,1.8190000000000001E-3]
[null,"Total incl. effect of Excess air ",null,null,null,{"$f":"SUM(F68:F74)","v":2.75},{"$f":"SUM(G68:G74)","v":0.45},{"$f":"SUM(H68:H74)","v":0.01},{"$f":"SUM(I68:I74)","v":2.3249999999999997},{"$f":"SUM(J68:J75)","v":15.436393088552915},null,{"$f":"SUM(L68:L73)","v":13649.9},{"$f":"100*(C68*M68+M69*C69+C70*M70+C71*M71+C72*M72)","v":208.36169999999998},{"$f":"($C$68*N68+0.5*$C$69*N69+$C$70*N70+$C$71*N71+$C$72*N72+$C$73*N73+$C$74*N74+$C$75*N75+$C$76*N76+$C$77*N77+$C$81*N81)*(1+$C$83/100)","v":{"$error":"#VALUE!"}},null,{"$f":"SUM(P68:P75)","v":10.928196544276458},{"$f":"I86+F85+G85+H85-I85","v":18.646393088552916}]
[null,"Temperature of combustion air (F)",{"$f":"'Data Input & RESULTS '!D18","v":0},null,null,null,null,"Ait ",{"$f":"I85+J85","v":17.761393088552914}]
[null,"Fuel temperature (F)",{"$f":"'Data Input & RESULTS '!D20","v":70},null,null,null,null,null,null,null,null,null,null,{"$f":"100*N85/L85","v":{"$error":"#VALUE!"}}]
[null,"Flue gas temperature (F)",{"$f":"'Data Input & RESULTS '!D19","v":0}]
[]
[]
[null,"Excess air used %",{"$f":"C83","v":0},null,null,null,null,null,null,null,null,null,null,{"$f":"1/N87","v":{"$error":"#VALUE!"}}]
[null,"Additional O2 lbs./lb of fuel",{"$f":"I85*C91","v":0}]
[null,"Additioanl N2 in excess air lbs./lb. of fuel",{"$f":"C92*H206","v":0},null,null,null,null,null,null,null,null,{"$f":"16/0.23","v":69.565217391304344}]
[null,"Ttaol additional air  lb of lb. of fuel",{"$f":"C92+C93","v":0},null,null,null,null,null,null,null,null,null,null,"Component","o2","n2","co2","fg","fg per #"]
[null,null,null,null,null,null,null,null,null,null,null,null,null,12,32,{"$f":"O95*3.3103","v":105.92959999999999},44,{"$f":"P95+Q95","v":149.92959999999999},{"$f":"R95/N95","v":12.494133333333332}]
[null,null,null,null,null,null,null,null,null,null,null,null,null,2,16,{"$f":"O96*3.3103","v":52.964799999999997},18,{"$f":"P96+Q96","v":70.964799999999997},{"$f":"R96/N96","v":35.482399999999998}]
[null,null,null,null,null,null,null,null,null,null,null,null,null,32,32,{"$f":"O97*3.3103","v":105.92959999999999},64,{"$f":"P97+Q97","v":169.92959999999999},{"$f":"R97/N97","v":5.3102999999999998}]
[null,"Flue gas composition - content",null,null,null,"CO2","H2O","SO2","O2","N2",null,"Total ","Diff "]
[null,"Lbs./lb. of fuel ",null,null,null,{"$f":"F79","v":2.75},{"$f":"G79","v":0.55043196544276463},{"$f":"H79","v":0.01},{"$f":"I79","v":0},{"$f":"J79","v":7.7181965442764575},null,{"$f":"SUM(F99:J99)","v":11.028628509719223},{"$f":"(M85-L99)/L99","v":17.892802474612019}]
[null,"Composition by weight (wet) ",null,null,null,{"$f":"F99/$L$99","v":0.2493510410271324},{"$f":"G99/$L$99","v":4.9909375853732341E-2},{"$f":"H99/$L$99","v":9.0673105828048149E-4},{"$f":"I99/$L$99","v":0},{"$f":"J99/$L$99","v":0.69983285206085477},null,{"$f":"L99/$L$99","v":1}]
[null,"Composition by weight (dry) ",null,null,null,{"$f":"F99/$L$81","v":0.26244974394015758},0,{"$f":"H99/$L$81","v":9.5436270523693661E-4},{"$f":"I99/$L$81","v":0},{"$f":"J99/$L$81","v":0.73659589335460551},null,{"$f":"L100","v":1}]
[null,"Volume per lb. of fuel (scf/lb of fuel) -wet",null,null,null,{"$f":"F99*'Cp calculationsHTmod'!H14","v":37.144642857142856},{"$f":"G99*'Cp calculationsHTmod'!H20","v":11.565187185025199},{"$f":"H99*'Cp calculationsHTmod'!H14","v":0.13507142857142856},{"$f":"I99*'Cp calculationsHTmod'!H8","v":0},{"$f":"J99*'Cp calculationsHTmod'!H11","v":104.25078332304842},null,{"$f":"SUM(F102:J102)","v":153.09568479378791}]
[null,"Composition by volume (wet) ",null,null,null,{"$f":"F102/$L$102","v":0.24262370887314555},{"$f":"G102/$L$102","v":7.5542215318497821E-2},{"$f":"H102/$L$102","v":8.8226803226598379E-4},{"$f":"I102/$L$102","v":0},{"$f":"J102/$L$102","v":0.68095180777609066},null,{"$f":"L102/$L$102","v":1}]
[null,"Composition by volume (dry) ",null,null,null,{"$f":"F103/(1-$G$103)","v":0.26244974394015752},0,{"$f":"H103/(1-$G$103)","v":9.543627052369365E-4},{"$f":"I103/(1-$G$103)","v":0},{"$f":"J103/(1-$G$103)","v":0.73659589335460551},null,{"$f":"SUM(H104:J104)+F104","v":1}]
[null,"Heating value (Btu/lb of fuel)",null,null,null,null,null,null,null,null,null,{"$f":"L85","v":13649.9}]
[null,"Cu. ft. of fuel ",null,null,null,{"$f":"F11","v":3500},{"$f":"F11","v":3500}]
[null,"Total in flue gases (Lbs.) ",null,null,null,{"$f":"F99*F11","v":9625},{"$f":"G99*F11","v":1926.5118790496763}]
[null,"Heat in the flue gas components (Btu/lb of fuel) ",null,null,null,{"$f":"F99*'Cp calculationsHTmod'!G24*('Av.Ht.Solid - modified'!C88-60)","v":-32.504489603024574},{"$f":"'Av.Ht.Solid - modified'!G75*(J121+'Cp calculationsHTmod'!G94*('Av.Ht.Solid - modified'!C88-60))+G78*'Cp calculationsHTmod'!G94*('Av.Ht.Solid - modified'!C88-60)","v":483.49392302392437},{"$f":"H99*'Cp calculationsHTmod'!G24*('Av.Ht.Solid - modified'!C88-60)","v":-0.11819814401099844},{"$f":"I99*'Cp calculationsHTmod'!G9*('Av.Ht.Solid - modified'!C88-60)","v":0},{"$f":"J99*'Cp calculationsHTmod'!G12*('Av.Ht.Solid - modified'!C88-60)","v":-115.49563084029703},null,{"$f":"SUM(F108:J108)","v":335.37560443659174}]
[]
[null,"CO2 and H2O values (Lbs./MM Btu) ",null,null,null,{"$f":"F99*10^6/$L$105","v":201.46667741155613},{"$f":"G99*10^6/$L$105","v":40.324981534133187}]
[null,"Carbon equivalent -  (Lbs. of Carbon/MM Btu)",null,null,null,{"$f":"F110*12/44","v":54.945457475878946}]
[]
[]
[null,"Heat entering the system "]
[null,"Sensible heat "]
[null,"Air ",null,"Btu/lb. of fuel ",{"$f":"K77*'Cp calculationsHTmod'!F68*('Av.Ht.Solid - modified'!C86-60)/0.075","v":-144.25627246738483},null,null,"Calculations for Water vapor - steam enthalpy etc. "]
[null,"Fuel ",null,"Btu/lb. of fuel ",{"$f":"0.24*(1-C73)*(C87-60)","v":2.4},null,null,"Equation coeff for enthalpy @ saturation calculations ",null,"Enthalpy",null,1096.7,1.2999999999999999E-2,"Equation: Enthalpy = 1096 * Partial pressure (inch HG) ^ 0.013"]
[null,"Moisturer  in fuel",null,"Btu/lb. of fuel ",{"$f":"C73*(C87-60)","v":0}]
[null,"Chemical heat or heating value of fuel",null,"Btu/lb. of fuel ",{"$f":"L105","v":13649.9},null,null,"Partial pressure of H2O",null,{"$f":"G103","v":7.5542215318497821E-2},null,"atm",null,"From volumetric wet analysis "]
[null,"Total heat in ",null,"Btu/lb. of fuel ",{"$f":"SUM(E116:E119)","v":13508.043727532615},null,null,null,null,{"$f":"J119*29.926","v":2.2606763356213655},null,"inch HG",null,"Conversion from atm to inch HG"]
[null,"Heat in flue gases ",null,"Btu/lb. of fuel ",{"$f":"L108","v":335.37560443659174},null,null,"Enthalpy at saturated  condition",null,{"$f":"L117*J120^M117","v":1108.3908770123517},null,"Btu/lb of steam",null,"Enthalpy for partial pressure using coeffs. "]
[null,"Heating value of carbon ",null,"Btu/lb. ",14093]
[null,"Sensible heat in ash discharged  ",null,"Btu/lb of fuel",{"$f":"'Data Input & RESULTS '!C9*0.25*(1.8*'Data Input & RESULTS '!D22+32-60)","v":-0.25}]
[null,"Chemical heat in unburned carbon ",null,"Btu/lb. of fuel ",{"$f":"'Data Input & RESULTS '!D23*'Data Input & RESULTS '!C9*'Av.Ht.Solid - modified'!E122","v":0}]
[]
[null,"Available heat ",null,"%",{"$f":"(E120-E121-E124-E123)/E119","v":0.96505601675441022},null,null,"Saturation temperature",null,{"$f":"J127*LN(J120)+J128","v":110.42524613055899},null,"deg. F.",null,"Equation: Sat. Temp (F) = 36.009 * LN(partial pressure inch HG)  + 81.054"]
[null,null,null,null,null,null,null,null,"Coeff for satuation temp (F) calculation",36.009]
[null,null,null,null,null,null,null,null,null,81.054000000000002]
[]
[]
[]
[]
[]
[]
[]
[null,null,null,null,null,null,null,"Total heat content of water vapor  = Mass or weight of water/lb of fuel * (Enthalpy at saturation + Sp. Heat of vapor *(flue gas temp. [F] - 60 [F]) "]
[null,null,null,null,null,null,null,{"$f":"G99*(J121+'Cp calculationsHTcurrent'!G94*('Av.Ht.Solid - modified'!C88-60))","v":594.81179728110442},"E111*(M120+E112*(C89-M121))"]
[]
[]
[]
[]
[null,"Emission ","CO2 equivalnet in Lbs. ",null,null,"2001 values *"]
[null,"Carbon dioxide (CO2)         ",1,null,null,1]
[null,"Methane (CH4)                    ",21,null,null,23]
[null,"Nitrous oxide (N2O)           ",310,null,null,296]
[null,"Hydrofluorocarbon (HFC)-134a   (used in mobile source air conditioning)  ",1300,null,null,1300]
[]
[]
[]
[null,"* See note below"]
[null,"These estimates are from the IPCC’s Second Assessment Report (1996). These are the values used internationally for reporting greenhouse gas (GHG) emissions to the United Nations. (EPA also uses them for the Inventory of U.S. Greenhouse Gas Emissions and S"]
[]
[null,"Relationship Between Ultimate Analysis and Proximate Analysis"]
[null,"%C",{"$f":"B156","v":"0.97C+ 0.7(VM - 0.1A) - M(0.6-0.01M)"}]
[null,"="]
[null,"0.97C+ 0.7(VM - 0.1A) - M(0.6-0.01M)"]
[null,"%H",{"$f":"B159","v":"0.036C + 0.086 (VM -0.1xA) - 0.0035M2 (1-0.02M)"}]
[null,"="]
[null,"0.036C + 0.086 (VM -0.1xA) - 0.0035M2 (1-0.02M)"]
[null,"%N2",{"$f":"B162","v":"2.10 -0.020 VM"}]
[null,"="]
[null,"2.10 -0.020 VM"]
[null,"where"]
[null,"C",{"$f":"B166","v":"% of fixed carbon"}]
[null,"="]
[null,"% of fixed carbon"]
[null,"A",{"$f":"B169","v":"% of ash"}]
[null,"="]
[null,"% of ash"]
[null,"VM",{"$f":"B172","v":"% of volatile matter"}]
[null,"="]
[null,"% of volatile matter"]
[null,"M",{"$f":"B175","v":"% of moisture"}]
[null,"="]
[null,"% of moisture"]
[null,"Relationship Between Ultimate Analysis and Proximate Analysis"]
[null,"%C","0.97+ 0.7(VM - 0.1A) - M(0.6-0.01M)"]
[null,"="]
[null,"0.97C+ 0.7(VM - 0.1A) - M(0.6-0.01M)"]
[null,"%H"]
[null,"="]
[null,"0.036C + 0.086 (VM -0.1xA) - 0.0035M2 (1-0.02M)"]
[null,"%N2"]
[null,"="]
[null,"2.10 -0.020 VM"]
[null,"where"]
[null,"C"]
[null,"="]
[null,"% of fixed carbon"]
[null,"A"]
[null,"="]
[null,"% of ash"]
[null,"VM"]
[null,"="]
[null,"% of volatile matter"]
[null,"M"]
[null,"="]
[null,"% of moisture"]
[]
[]
[]
[]
[null,"Table 1: Standard Composition of Dry Air (Detailed Analysis):"]
[null,"Gas","% by Volume","% by Weight ","Parts per Million (by Volume)","Chemical Symbol","Molecular Weight"]
[null,"Nitrogen",78.08,75.47,780805,"N2",28.01,"Ratio N2/O2 wt."]
[null,"Oxygen",20.95,23.2,209450,"O2",32,{"$f":"(100-D206)/D206","v":3.3103448275862069}]
[null,"Argon",0.93,1.28,9340,"Ar",39.950000000000003]
[null,"Carbon Dioxide ",3.9E-2,6.0600000000000001E-2,390,"CO2",44.01]
[null,"Neon",1.8E-3,1.1999999999999999E-3,18.21,"Ne",20.18]
[null,"Helium",5.0000000000000001E-4,6.9999999999999994E-5,5.24,"He",4]
[null,"Krypton",1E-4,2.9999999999999997E-4,1.1399999999999999,"Kr",83.8]
[null,"Hydrogen","0.00005 ","Negligible",0.5,"H2",2.02]
[null,"Xenon","8.7 x 10-6",4.0000000000000003E-5,8.6999999999999994E-2,"Xe",131.30000000000001]
[]
[]
[null,"C","% Fixed carbon",null,0.67500000000000004]
[null,"A","% Ash",null,0.1]
[null,"VM","% Volatime matter",null,0.15]
[null,"M","% Moisture",null,7.4999999999999997E-2]
[null,"Total ",null,null,{"$f":"SUM(E216:E219)","v":1}]
[null,"C "]
[null,"H2",null,null,{"$f":"0.97*E216+0.7*(E218-0.1*E217)-E219*(0.6 - 0.01*E219)","v":0.70780625000000008}]
[null,"N2",null,null,{"$f":"0.036*E216+0.086*(E218-0.1*E217)-0.0035*E219^2*(1-0.02*E219)","v":3.6320342031249994E-2}]
[null,null,null,null,{"$f":"(2.1-0.02*E218)/100","v":2.0969999999999999E-2}]
[null,null,null,null,null,{"$f":"SUM(E222:E224)","v":0.76509659203125013}]

{"sheet":"Data Input & RESULTS ","index":23,"n_rows":30,"n_cols":6,"rows_kept":30,"cut":false,"hidden":true,"merged":[]}
[]
[]
[null,"Fuel Name or description "]
[null,{"$f":"'Flue gases'!B37","v":"Coal"}]
[null,"Component - use ultimate analysis ","% by weight "]
[null,"C",{"$f":"'Flue gases'!C39 / 100","v":0.75},"User defined "]
[null,"H2",{"$f":"'Flue gases'!C40 / 100","v":0.05}]
[null,"S",{"$f":"'Flue gases'!C41 / 100","v":5.0000000000000001E-3}]
[null,"Inerts - ash",{"$f":"'Flue gases'!C42 / 100","v":0.1}]
[null,"O2",{"$f":"'Flue gases'!C43 / 100","v":0.08}]
[null,"Moisture ",{"$f":"'Flue gases'!C44 / 100","v":0}]
[null,"N2",{"$f":"'Flue gases'!C45 / 100","v":1.4999999999999999E-2}]
[null,"Total**",{"$f":"SUM(C6:C12)","v":1}]
[]
[]
[null,null,"Current","Modified "]
[null,"Excess air for combustion (%) ",{"$f":"'Flue gases'!D50 / 100","v":0},{"$f":"'Flue gases'!E50 / 100","v":0},"D8 and E8 ","flue gas tab"]
[null,"Combustion air temperature (oF)",{"$f":"'Flue gases'!D51","v":0},{"$f":"'Flue gases'!E51","v":0},"D9 and E9","flue gas tab"]
[null,"Flue gas temperature (oF)",{"$f":"'Flue gases'!D52","v":0},{"$f":"'Flue gases'!E52","v":0},"D5 and E5","flue gas tab"]
[null,"Fuel temperature (0F)",{"$f":"'Flue gases'!D53","v":70},{"$f":"'Flue gases'!E53","v":70},"User defined "]
[null,"Moisture in air combustion lb H2O/lb of dry air  * ",{"$f":"'Flue gases'!D54 / 100","v":0.01},{"$f":"'Flue gases'!E54 / 100","v":0.01},"User defined "]
[null,"Ash discharge temperature (oF)",{"$f":"'Flue gases'!D55","v":10},{"$f":"'Flue gases'!E55","v":10},"User defined "]
[null,"Unburned carbon in ash (% of ash collected) ",{"$f":"'Flue gases'!D56 / 100","v":0},{"$f":"'Flue gases'!E56 / 100","v":0},"User defined "]
[null,"* See psychometric chart below. "]
[null,"** If the total is not exactly 100%, then the program will normalize the component values to get 100% total. "]
[]
[null,"Available heat*",{"$f":"'Av.Ht.Solid - current '!E126","v":0.96505601675441022},{"$f":"'Av.Ht.Solid - modified'!E126","v":0.96505601675441022},"This goes back to PHASTEx Flue gas tab"]
[null,"* Based on higher heating value ",null,null,"D12 (for current) and E12 (for modified )"]
[]
[null,"© Arvind Thekdi (E3M Inc.) "]

{"sheet":"Data-Results vol current ","index":24,"n_rows":37,"n_cols":3,"rows_kept":37,"cut":false,"hidden":true,"merged":[[30,0,30,2],[35,1,36,1],[2,0,2,2],[3,0,3,2],[5,1,5,2],[32,0,33,0]]}
[]
[]
["Available Heat Calculation for Gaseous Fuels"]
["Given Volumetric Gas Analysis"]
[]
["Name or designation of fuel ",{"$f":"'Flue gases'!C68","v":"Natural Gas - East Ohio"}]
[]
["Gas composition ","By volume"]
["CH4  ",{"$f":"'Flue gases'!C71","v":0.94099999999999995}]
["C2H6",{"$f":"'Flue gases'!C72","v":3.0099999999999998E-2}]
["N2 and other inert",{"$f":"'Flue gases'!C73","v":1.41E-2},"Note:"]
["H2",{"$f":"'Flue gases'!C74","v":1E-4},"The gas analysis "]
["C3H8",{"$f":"'Flue gases'!C75","v":4.1999999999999997E-3},"will be adjusted to "]
["C4H10 + CnH2n",{"$f":"'Flue gases'!C76","v":2.8E-3},"make total 100%"]
["H2O",{"$f":"'Flue gases'!C77","v":0},"for the calculations"]
["CO",{"$f":"'Flue gases'!C78","v":0}]
["CO2",{"$f":"'Flue gases'!C79","v":2.0000000000000002E-5}]
["SO2",{"$f":"'Flue gases'!C80","v":0}]
["O2",{"$f":"'Flue gases'!C81","v":1E-4}]
["Total of fuel components ",{"$f":"SUM(B9:B19)","v":0.99241999999999997}]
["Difference ",{"$f":"1-B20","v":7.5800000000000312E-3}]
[]
["Weight % for tar in gas-tar mixture","%",0]
[]
["Fuel gas temperature","Deg. F.",{"$f":"'Flue gases'!D87","v":0}]
["Combustion air temperature","Deg. F.",{"$f":"'Flue gases'!D88","v":0}]
["Flue gas temperature","Deg. F.",{"$f":"'Flue gases'!D89","v":0}]
["Excess air used for combustion","%",{"$f":"'Flue gases'!D90","v":0}]
["Percent O2 in flue gas ","%"]
[]
["Results"]
["Avaiable Heat","%",{"$f":"'Calculations - vol current'!H75","v":0.90133904135354603}]
["Higher (Gross) calorific (heating value) of the fuel ","Btu/ft3",{"$f":"'Calculations - vol current'!C48*37.3","v":38539.004116989592}]
[null,"kcal/m3",{"$f":"'Calculations - vol current'!C48*8.9","v":9195.6336901127997}]
["% O2 in Flue gases (dry basis)","%",{"$f":"'Calculations - vol current'!I14","v":0}]
["Stoichiometric air required ","ft3 air/m3 fuel gas",{"$f":"'Calculations - vol current'!C80","v":10.227344463652615}]
["Actual air required ",null,{"$f":"'Calculations - vol current'!C83","v":10.227344463652615}]

{"sheet":"Calculations - vol current","index":25,"n_rows":102,"n_cols":31,"rows_kept":102,"cut":false,"hidden":true,"merged":[[103,0,103,7],[101,0,101,13],[22,14,22,15],[27,12,27,13],[28,12,28,13],[22,0,22,7],[22,12,22,13],[23,12,23,13],[24,12,24,13],[36,12,36,13],[32,12,32,13],[97,0,97,7],[98,0,98,7],[35,12,35,13],[25,12,25,13],[26,12,26,13],[100,0,100,7],[93,0,93,7],[91,0,91,13],[96,0,96,7],[102,0,102,7],[0,2,0,4],[0,5,0,7],[22,16,22,19],[22,25,22,28],[94,16,96,20],[89,0,89,13],[50,0,50,13],[94,0,94,7],[95,0,95,7],[92,0,92,7],[29,12,29,13],[30,12,30,13],[90,0,90,13],[33,12,33,13],[34,12,34,13],[31,12,31,13]]}
[null,null,"Per # of  other vapor at stoich ratio",null,null,"# Per # of gas from gasifier at stoich ratio",null,null,null,"Total "," "]
[null,null,"CO2","H2O","N2","CO2","H2O","N2","Excess O2 in FG",null,"SO2","O2 supplied for comb","Comb air required","Stoich air"]
["Wt. of other vapors",{"$f":"'Data-Results vol current '!C23","v":0},3.18,0.57199999999999995,9.3000000000000007,{"$f":"$B$3*C3","v":0},{"$f":"$B$3*D3","v":0},{"$f":"$B$3*E3","v":0},0,{"$f":"SUM(F3:H3)","v":0},0,{"$f":"0.231*12.052*B3","v":0},{"$f":"L3/0.231","v":0},{"$f":"M3","v":0}]
["With Excess air",{"$f":"C57","v":0},null,null,null,{"$f":"F3","v":0},{"$f":"G3","v":0},{"$f":"H3+I4/(1-0.231)","v":0},{"$f":"B4*L3","v":0},{"$f":"SUM(F4:I4)","v":0},0,{"$f":"I4","v":0},{"$f":"L4/0.231","v":0}]
[]
[]
["Wt. of gases from gas combustion",{"$f":"1-B3","v":1},null,null,null,{"$f":"$B$7*Q40","v":2.7095835212488995},{"$f":"$B$7*R40","v":2.1253493533810555},{"$f":"B7*T40","v":12.864032287414576},{"$f":"B7*U40","v":0},{"$f":"SUM(F7:I7)+K7","v":17.69896516204453},{"$f":"B7*S40","v":0},{"$f":"I7+B7*U36","v":3.8574609524322874},{"$f":"L7/0.231","v":16.698965162044534},{"$f":"M7-I7/0.231","v":16.698965162044534}]
[]
["Total wt. of FG # per # of fuel",null,null,null,null,{"$f":"F4+F7","v":2.7095835212488995},2.1253493533810555,12.864032287414576,0,17.69896516204453,0,{"$f":"SUM(L3:L7)","v":3.8574609524322874},{"$f":"SUM(M3:M7)","v":16.698965162044534},{"$f":"M9/(1+B4)","v":16.698965162044534}]
["Wet analysis % by weight",null,null,null,null,{"$f":"F9/$J$9","v":0.15309276539283817},0.1200832553724029,0.72682397923475894,0,1,0]
["dry analysis % by weight",null,null,null,null,{"$f":"F9/($J$9-$G$9)","v":0.17398551206981622},0,{"$f":"H9/($J$9-$G$9)","v":0.82601448793018384},{"$f":"I9/($J$9-$G$9)","v":0},{"$f":"SUM(F11:I11)","v":1},{"$f":"K9/($J$9-$G$9)","v":0}]
["Volume scf /#of Fuel",null,null,null,null,{"$f":"F9*'Cp calculations  (2)'!H23","v":23.290101994007586},{"$f":"G9*'Cp calculations  (2)'!H20","v":44.655951413817505},{"$f":"H9*'Cp calculations  (2)'!H11","v":173.75632182500686},{"$f":"I9*'Cp calculations  (2)'!H8","v":0},{"$f":"SUM(F12:I12)+K12","v":241.70237523283197},{"$f":"K9*'Cp calculations  (2)'!H41","v":0}]
["Wet analysis % by volume",null,null,null,null,{"$f":"F12/$J$12","v":9.6358597930914919E-2},0.18475594776758156,0.71888545430150341,0,1,0,null,null," "]
["Dry analysis % by volume",null,null,null,null,{"$f":"F12/($J$12-$G$12)","v":0.11819601463764373},0,{"$f":"H12/($J$12-$G$12)","v":0.88180398536235616},{"$f":"I12/($J$12-$G$12)","v":0},{"$f":"SUM(F14:I14)","v":0.99999999999999989},{"$f":"K12/($J$12-$G$12)","v":0}]
[null,null,null,null,null,null,null,null,null,null,null,null,null,null,null,null,null,null,null,null,null,null,null,null,null,null,null,null,{"$f":"T39*'Cp calculations  (2)'!H11","v":0},{"$f":"U39*'Cp calculations  (2)'!H8","v":0}]
["Heating value of fuel (higher)",null,null,null,null,null,null,null,"Density of FG",{"$f":"J9/J12","v":7.3226277337966217E-2},"#/scf of FG"]
["Other vapors","Btu/#",15720,null,null,null,null,null,"Sp. Volume of FG",{"$f":"1/J16","v":13.656299846906487},"SCF/lb of FG"]
["Gas fuel","Btu/#",{"$f":"C47","v":23081.065532346693}]
["Total heating value Higher for mixed fuel","Btu/#",{"$f":"C17*B3+C18*B7","v":23081.065532346693}]
[]
[]
[]
["Gas (Fuel) Analysis (See note below) ",null,null,null,null,null,null,null,null,null,"Heating value Btu/lb.",null,"Comment ",null,"By weight analysis",null,"By weight #s/# of component",null,null,null,"required",null,"Total",null,null,"By volume scf/# of component"]
["Gas composition ","Mol wt","O2 reqd","CO2","H2O","SO2","By volume","Adjusted by volume","Heat value Btu/scf comp.","Heat value Btu/scf fuel",null,"Ht. value /lb of fuel",null,null,"lbs./cu.ft.","%","CO2","H2O","SO2","N2","O2"," ",null,null,null,"CO2","H2O","SO2","N2","O2","Total"]
["CH4  ",{"$f":"16.042","v":16.042000000000002},64,{"$f":"B33","v":44.01},{"$f":"2*B31","v":36.031999999999996},null,{"$f":"'Data-Results vol current '!B9","v":0.94099999999999995},{"$f":"G25*(1+$G$37)","v":0.9481327799999999},1012,{"$f":"I25*H25","v":959.5103733599999},23875,{"$f":"K25*P25","v":20511.620828220701},null,null,{"$f":"H25*'Cp calculations  (2)'!I26","v":4.0111381491274453E-2},{"$f":"O25/$O$36","v":0.85912547971605036},{"$f":"P25*D25/B25","v":2.3569450419089497},{"$f":"P25*E25/B25","v":1.929685156783987},null,{"$f":"U25*(1-0.231)/0.231","v":11.410178047156821},{"$f":"P25*C25/B25","v":3.4275047189768868},{"$f":"T25/U25","v":3.3290043290043285},null,null,null,{"$f":"Q25*'Cp calculations  (2)'!$H$23","v":20.259013973862835},{"$f":"R25*'Cp calculations  (2)'!$H$20","v":40.544829238650209},{"$f":"S25*'Cp calculations  (2)'!H41","v":0},{"$f":"T25*'Cp calculations  (2)'!$H$11","v":154.11890490838249},{"$f":"U25*'Cp calculations  (2)'!$H$8","v":40.508821397408077}]
["C2H6",30.068000000000001,112,{"$f":"2*B33","v":88.02},{"$f":"3*B31","v":54.047999999999995},null,{"$f":"'Data-Results vol current '!B10","v":3.0099999999999998E-2},3.0328157999999997E-2,1773,53.771824133999992,22323,1073.5544575546983,null,null,{"$f":"H26*'Cp calculations  (2)'!I29","v":2.2453422104706505E-3},4.8091854031926631E-2,{"$f":"P26*D26/B26","v":0.14078239297226891},{"$f":"P26*E26/B26","v":8.6446339188425245E-2},null,{"$f":"U26*(1-0.231)/0.231","v":0.59634744277498808},{"$f":"P26*C26/B26","v":0.17913687812876755},null,null,null,null,{"$f":"Q26*'Cp calculations  (2)'!$H$23","v":1.2100886595934568},{"$f":"R26*'Cp calculations  (2)'!$H$20","v":1.8163336378368014},{"$f":"S26*'Cp calculations  (2)'!H42","v":0},{"$f":"T26*'Cp calculations  (2)'!$H$11","v":8.0549501020535885},{"$f":"U26*'Cp calculations  (2)'!$H$8","v":2.1171739783843715}]
["N2 and other inert",28.015999999999998,0,0,0,null,{"$f":"'Data-Results vol current '!B11","v":1.41E-2},1.4206877999999999E-2,0,0,0,0,null,null,{"$f":"H27*'Cp calculations  (2)'!I11","v":1.0518048228450555E-3},2.2528077802331077E-2,null,null,null,{"$f":"P27","v":2.2528077802331077E-2},null,null,null,null,null,{"$f":"Q27*'Cp calculations  (2)'!$H$23","v":0},{"$f":"R27*'Cp calculations  (2)'!$H$20","v":0},{"$f":"S27*'Cp calculations  (2)'!H43","v":0},{"$f":"T27*'Cp calculations  (2)'!$H$11","v":0.30428996517291473},{"$f":"U27*'Cp calculations  (2)'!$H$8","v":0}]
["H2",2.016,16,0,{"$f":"B31","v":18.015999999999998},null,{"$f":"'Data-Results vol current '!B12","v":1E-4},1.00758E-4,325,3.274635E-2,61095,0.69724058426211621,null,null,{"$f":"H28*'Cp calculations  (2)'!I17","v":5.3282919090428349E-7},1.1412400102498015E-5,null,{"$f":"P28*E28/B28","v":1.0198700409057748E-4},null,{"$f":"U28*(1-0.231)/0.231","v":3.0152324877416933E-4},{"$f":"P28*C28/B28","v":9.0574603988079485E-5},null,null,null,null,{"$f":"Q28*'Cp calculations  (2)'!$H$23","v":0},{"$f":"R28*'Cp calculations  (2)'!$H$20","v":2.1428602748364669E-3},{"$f":"S28*'Cp calculations  (2)'!H44","v":0},{"$f":"T28*'Cp calculations  (2)'!$H$11","v":4.0727175959425297E-3},{"$f":"U28*'Cp calculations  (2)'!$H$8","v":1.0704786008841143E-3}]
["C3H8",44.094000000000001,160,{"$f":"3*B33","v":132.03},{"$f":"4*B31","v":72.063999999999993},null,{"$f":"'Data-Results vol current '!B13","v":4.1999999999999997E-3},4.2318359999999992E-3,2523,10.676922227999999,21669,155.79603762724855,null,null,{"$f":"H29*'Cp calculations  (2)'!I32","v":3.3568239026969852E-4},7.1898120645737477E-3,{"$f":"P29*D29/B29","v":2.1528345962844649E-2},{"$f":"P29*E29/B29","v":1.1750501578932338E-2},null,{"$f":"U29*(1-0.231)/0.231","v":8.6850512043157108E-2},{"$f":"P29*C29/B29","v":2.6089035477203239E-2},null,null,null,null,{"$f":"Q29*'Cp calculations  (2)'!$H$23","v":0.18504591916245106},{"$f":"R29*'Cp calculations  (2)'!$H$20","v":0.24689109428623388},{"$f":"S29*'Cp calculations  (2)'!H47","v":0},{"$f":"T29*'Cp calculations  (2)'!$H$11","v":1.1731022733829291},{"$f":"U29*'Cp calculations  (2)'!$H$8","v":0.30833978804619577}]
["C4H10 + CnH2n",58.12,208,{"$f":"4*B33","v":176.04},{"$f":"5*B31","v":90.079999999999984},null,{"$f":"'Data-Results vol current '!B14","v":2.8E-3},2.8212239999999998E-3,3270,9.2254024799999996,21321,1339.3969683597807,null,null,{"$f":"H30*'Cp calculations  (2)'!J32","v":2.933004720574037E-3},6.2820551022924845E-2,{"$f":"P30*D30/B30","v":0.19027752584438556},{"$f":"P30*E30/B30","v":9.7365368825620593E-2},null,{"$f":"U30*(1-0.231)/0.231","v":0.74843455525803271},{"$f":"P30*C30/B30","v":0.22482234364708137},null,null,null,null,{"$f":"Q30*'Cp calculations  (2)'!$H$23","v":1.6355218244169687},{"$f":"R30*'Cp calculations  (2)'!$H$20","v":2.0457545827694279},{"$f":"S30*'Cp calculations  (2)'!H48","v":0},{"$f":"T30*'Cp calculations  (2)'!$H$11","v":10.109212457092427},{"$f":"U30*'Cp calculations  (2)'!$H$8","v":2.6571190739789428}]
["H2O",18.015999999999998,null,null,{"$f":"B31","v":18.015999999999998},null,{"$f":"'Data-Results vol current '!B15","v":0},0,0,0,0,0,null,null,{"$f":"H31*'Cp calculations  (2)'!I20","v":0},0,null,{"$f":"O31","v":0},null,null,null,null,null,null,null,{"$f":"Q31*'Cp calculations  (2)'!$H$23","v":0},{"$f":"R31*'Cp calculations  (2)'!$H$20","v":0},{"$f":"S31*'Cp calculations  (2)'!H49","v":0},{"$f":"T31*'Cp calculations  (2)'!$H$11","v":0},{"$f":"U31*'Cp calculations  (2)'!$H$8","v":0}]
["CO",28.01,16,{"$f":"B33","v":44.01},null,null,{"$f":"'Data-Results vol current '!B16","v":0},0,321,0,4347,0,null,null,{"$f":"H32*'Cp calculations  (2)'!I14","v":0},0,{"$f":"P32*D32/B32","v":0},null,null,{"$f":"U32*(1-0.231)/0.231","v":0},{"$f":"P32*C32/B32","v":0},null,null,null,null,{"$f":"Q32*'Cp calculations  (2)'!$H$23","v":0},{"$f":"R32*'Cp calculations  (2)'!$H$20","v":0},{"$f":"S32*'Cp calculations  (2)'!H50","v":0},{"$f":"T32*'Cp calculations  (2)'!$H$11","v":0},{"$f":"U32*'Cp calculations  (2)'!$H$8","v":0}]
["CO2",44.01,null,{"$f":"B33","v":44.01},null,null,{"$f":"'Data-Results vol current '!B17","v":2.0000000000000002E-5},2.0151599999999999E-5,0,0,0,0,null,null,{"$f":"H33*'Cp calculations  (2)'!I23","v":2.344448439978847E-6},5.0214560450991257E-5,{"$f":"P33*D33/B33","v":5.0214560450991257E-5},null,null,null,null,null,null,null,null,{"$f":"Q33*'Cp calculations  (2)'!$H$23","v":4.3161697187647487E-4},{"$f":"R33*'Cp calculations  (2)'!$H$20","v":0},{"$f":"S33*'Cp calculations  (2)'!H51","v":0},{"$f":"T33*'Cp calculations  (2)'!$H$11","v":0},{"$f":"U33*'Cp calculations  (2)'!$H$8","v":0}]
["SO2",64.06,null,null,null,64,{"$f":"'Data-Results vol current '!B18","v":0},0,0,0,0,0,null,null,{"$f":"H34*'Cp calculations  (2)'!I14","v":0},0,null,null,{"$f":"P34","v":0},null,null,null,null,null,null,{"$f":"Q34*'Cp calculations  (2)'!$H$23","v":0},{"$f":"R34*'Cp calculations  (2)'!$H$20","v":0},{"$f":"S34*'Cp calculations  (2)'!H52","v":0},{"$f":"T34*'Cp calculations  (2)'!$H$11","v":0},{"$f":"U34*'Cp calculations  (2)'!$H$8","v":0}]
["O2",32,-32,null,null,null,{"$f":"'Data-Results vol current '!B19","v":1E-4},1.00758E-4,0,0,0,0,null,null,{"$f":"H35*'Cp calculations  (2)'!I8","v":8.5252670544685359E-6},1.8259840163996823E-4,null,null,null,{"$f":"U35*(1-0.231)/0.231","v":-6.0787086952872544E-4},{"$f":"P35*C35/B35","v":-1.8259840163996823E-4},null,null,null,null,{"$f":"Q35*'Cp calculations  (2)'!$H$23","v":0},{"$f":"R35*'Cp calculations  (2)'!$H$20","v":0},{"$f":"S35*'Cp calculations  (2)'!H53","v":0},{"$f":"T35*'Cp calculations  (2)'!$H$11","v":-8.2105986734201403E-3},{"$f":"U35*'Cp calculations  (2)'!$H$8","v":-2.1580848593823745E-3}]
["Total of fuel components ",null,null,null,null,null,{"$f":"SUM(G25:G35)","v":0.99241999999999997},{"$f":"SUM(H25:H35)","v":0.99994254359999979}," ",{"$f":"SUM(J25:J35)","v":1033.217268552},null,{"$f":"SUM(L25:L35)","v":23081.065532346693},null,null,{"$f":"SUM(O25:O35)","v":4.668861818011924E-2},1,{"$f":"SUM(Q25:Q35)","v":2.7095835212488995},{"$f":"SUM(R25:R35)","v":2.1253493533810555},{"$f":"SUM(S25:S35)","v":0},{"$f":"SUM(T25:T35)","v":12.864032287414576},{"$f":"SUM(U25:U35)","v":3.8574609524322874},null,{"$f":"SUM(Q36:T36)","v":17.69896516204453},null,null,{"$f":"Q36*'Cp calculations  (2)'!$H$23","v":23.290101994007586},{"$f":"R36*'Cp calculations  (2)'!$H$20","v":44.655951413817505},{"$f":"S36*'Cp calculations  (2)'!H54","v":0},{"$f":"T36*'Cp calculations  (2)'!$H$11","v":173.75632182500686},{"$f":"U36*'Cp calculations  (2)'!$H$8","v":45.590366631559093},{"$f":"SUM(Z36:AC36)","v":241.70237523283197}]
["Difference ",null,null,null,null,null,{"$f":"1-G36","v":7.5800000000000312E-3},{"$f":"1-H36","v":5.7456400000210905E-5},null,null,null,null,null,null,null,{"$f":"SUM(P25:P35)","v":1},{"$f":"Q36/$W$36","v":0.15309276539283817},{"$f":"R36/$W$36","v":0.1200832553724029},{"$f":"S36/$W$36","v":0},{"$f":"T36/$W$36","v":0.72682397923475894},null,null,{"$f":"SUM(Q37:T37)","v":1},null,null,{"$f":"Z36/$AE$36","v":9.6358597930914919E-2},{"$f":"AA36/$AE$36","v":0.18475594776758156},{"$f":"AB36/$AE$36","v":0},{"$f":"AC36/$AE$36","v":0.71888545430150341},null,{"$f":"SUM(Z37:AC37)","v":0.99999999999999989}]
[]
["Excess air",null,null,null,null,null,null,null,null,null,null,null,"Excess air","%",{"$f":"C57","v":0},null,null,null,null,{"$f":"U39*(1-0.231)/0.231","v":0},{"$f":"U36*O39","v":0},null,null,"Excess air %",{"$f":"O39","v":0},0,0,0,{"$f":"T39*'Cp calculations  (2)'!H11","v":0},{"$f":"Y39*AD36","v":0}]
[null,null,null,null,null,null,null,null,null,null,null,null,"Weight of FG with Xs air",null,null,null,{"$f":"Q36","v":2.7095835212488995},{"$f":"R36+R38","v":2.1253493533810555},{"$f":"S36","v":0},{"$f":"T36+T39","v":12.864032287414576},{"$f":"U39","v":0},null,{"$f":"SUM(Q40:U40)","v":17.69896516204453},"Volume of FG with Xs air",null,{"$f":"Z36 +Z39","v":23.290101994007586},{"$f":"AA36 +AA39","v":44.655951413817505},{"$f":"AB36 +AB39","v":0},{"$f":"AC36 +AC39","v":173.75632182500686},{"$f":"AD39","v":0},{"$f":"SUM(Z40:AD40)","v":241.70237523283197}]
[null,null,null,null,null,null,null,null,null,null,null,null,"Weight % - wet","%",null,null,{"$f":"Q40/$W$40","v":0.15309276539283817},{"$f":"R40/$W$40","v":0.1200832553724029},{"$f":"S40/$W$40","v":0},{"$f":"T40/$W$40","v":0.72682397923475894},{"$f":"U40/$W$40","v":0},null,null,"Volume % - wet",null,{"$f":"Z40/$AE$40","v":9.6358597930914919E-2},{"$f":"AA40/$AE$40","v":0.18475594776758156},{"$f":"AB40/$AE$40","v":0},{"$f":"AC40/$AE$40","v":0.71888545430150341},{"$f":"AD40/$AE$40","v":0}]
[null,null,null,null,null,null,null,null,null,null,null,null,"Weight of FG- dry",null,null,null,{"$f":"Q40","v":2.7095835212488995},0,{"$f":"S40","v":0},{"$f":"T40","v":12.864032287414576},{"$f":"U40","v":0},null,{"$f":"SUM(Q42:U42)","v":15.573615808663476},"Volume of FG- dry",null,{"$f":"Z40","v":23.290101994007586},0,{"$f":"AB40","v":0},{"$f":"AC40","v":173.75632182500686},{"$f":"AD40","v":0},{"$f":"SUM(Z42:AD42)","v":197.04642381901445}]
[null,null,null,null,null,null,null,null,null,null,null,null,"Weight % - dry","%",null,null,{"$f":"Q42/$W$42","v":0.17398551206981619},{"$f":"R42/$W$42","v":0},{"$f":"S42/$W$42","v":0},{"$f":"T42/$W$42","v":0.82601448793018373},{"$f":"U42/$W$42","v":0},null,null,"Volume % - dry",null,{"$f":"Z42/$AE$42","v":0.11819601463764375},{"$f":"AA42/$AE$42","v":0},{"$f":"AB42/$AE$42","v":0},{"$f":"AC42/$AE$42","v":0.88180398536235627},{"$f":"AD42/$AE$42","v":0}]
[]
[]
[null,null,null,null,null,null,null,null,null,null,null,null,"fuel sp. Volume ",null,{"$f":"1/O36","v":21.418496391178611},"scf/#",null,null,null,"Air used #s/# fuel",null,{"$f":"U36*(1+O39)/0.231","v":16.698965162044534}]
["Heating value of fuel  - GAS only","Btu/#",{"$f":"L36","v":23081.065532346693}]
[null,"Btu/scf",{"$f":"J36","v":1033.217268552},null," ",null,null,null,null,null,null,null,null,null,null,null,null,null,null,null,null,null,null,null,null,null,null,null,{"$f":"AC40*O36","v":8.1124425660696655}]
["Heating value for mixed gas","Btu/#",{"$f":"C19","v":23081.065532346693}]
[]
[null,null,null,null,null,null,null,null,null,null,null,null,null,null,null,null,null,null,null,null,null,null,null,null,null," "]
["Fuel temperature ","Deg. F",{"$f":"'Data-Results vol current '!C25","v":0},null,null,null,null,null,null,null,null,null,"#s/ scf of fuel ",null,null,null,{"$f":"Q40*$O$36","v":0.12650671045073286},9.9229624459371418E-2,0,0.600603891723825,0,0,0.82634022663392936]
["Combustion air temperature",{"$f":"B52","v":"Deg. F"},{"$f":"'Data-Results vol current '!C26","v":0},null,null,null,null,null,null,null,null,null,"Avg Cp/# of gas"]
[null,null,null,null,null,null,null,null,null,null,null,null,null,null,null,null,null,null,null,null," "]
["Flue gas temperature",{"$f":"B52","v":"Deg. F"},{"$f":"'Data-Results vol current '!C27","v":0}]
[]
["Excess air ","%",{"$f":"'Data-Results vol current '!C28","v":0}]
[]
["Mass flow of fuel","lbs./hr",1]
["Mass flow of combustion air","lbs./hr",{"$f":"C78*(1+C57)","v":16.698965162044534},null,null,"By vol ht value"]
["Avg. sp. Heat of fuel ","Btu/(#-deg. F)",{"$f":"(P25*'Cp calculations  (2)'!G26+'Calculations - vol current'!P26*'Cp calculations  (2)'!G32+'Calculations - vol current'!P27*'Cp calculations  (2)'!G11+'Calculations - vol current'!P28*'Cp calculations  (2)'!G17+'Calculations - vol current'!P29*'Cp calculations  (2)'!G35+'Calculations - vol current'!P30*'Cp calculations  (2)'!G38+'Calculations - vol current'!P31*'Cp calculations  (2)'!G20+'Calculations - vol current'!P32*'Cp calculations  (2)'!G14+'Calculations - vol current'!P33*'Cp calculations  (2)'!G23+'Calculations - vol current'!P34*'Cp calculations  (2)'!G41+'Calculations - vol current'!P35*'Cp calculations  (2)'!G8)","v":0.66085062346213552}]
["Sensible heat in fuel","Btu/hr",{"$f":"C61*(C52-32)*C59","v":-21.147219950788337},null,null,{"$f":"C62","v":-21.147219950788337},{"$f":"F62/F64","v":-9.1621506473138384E-4}]
["Heat in combustion air","Btu/hr",{"$f":"'Cp calculations  (2)'!Q55*('Calculations - vol current'!C53-32)*C60","v":-128.79979978335206},null,null,{"$f":"C63","v":-128.79979978335206},{"$f":"F63/F64","v":-5.5803229535849232E-3}]
["Heating value (chem heat) of fuel ","Btu/hr",{"$f":"C19","v":23081.065532346693},null,null,{"$f":"C19","v":23081.065532346693}]
["Total heat coming in ","Btu/hr",{"$f":"SUM(C62:C64)","v":22931.118512612553},null,null,{"$f":"SUM(F62:F64)","v":22931.118512612553}]
[]
["Heat in FG",null,null,null,"Avg. ",null,null,"Based on sat temp"]
["Heat in water vapor ","Btu/hr",{"$f":"G9*(K73+(('Cp calculations  (2)'!G21+'Cp calculations  (2)'!G20)/2)*('Calculations - vol current'!C55-212))","v":2179.0479672972228},{"$f":"G9*(970+'Cp calculations  (2)'!G20*('Calculations - vol current'!C55-212))","v":1861.6447034200116},null,{"$f":"C68","v":2179.0479672972228},null,{"$f":"G9*(K73+(('Cp calculations  (2)'!G21+'Cp calculations  (2)'!G20)/2)*('Calculations - vol current'!C55-K74))","v":2245.8719985527573},"Calculations for Water vapor - steam enthalpy etc. ",null,null,"const","power"]
["Heat in CO2","Btu/hr",{"$f":"F9*(('Cp calculations  (2)'!G23+'Cp calculations  (2)'!G24)/2)*('Calculations - vol current'!C55-32)","v":-17.638105097522882},{"$f":"C69","v":-17.638105097522882},null,-17.638105097522882,null,{"$f":"F69","v":-17.638105097522882},"Equation ",null,"Enthalpy",1096.7,1.2999999999999999E-2]
["Heat in N2","Btu/hr",{"$f":"H9*(('Cp calculations  (2)'!G12 + 'Cp calculations  (2)'!G11)/2)*('Calculations - vol current'!C55-32)","v":-100.98086118642294},{"$f":"C70","v":-100.98086118642294},null,-100.98086118642294,null,{"$f":"F70","v":-100.98086118642294}]
["Heat in O2","Btu/hr",{"$f":"I9*(('Cp calculations  (2)'!G9+'Cp calculations  (2)'!G8)/2)*('Calculations - vol current'!C55-32)","v":0},{"$f":"C71","v":0},null,0,null,{"$f":"F71","v":0},"Partial pressure of H2O",null,{"$f":"G13","v":0.18475594776758156},"tam"]
["Heat in SO2","Btu/hr",{"$f":"K9*'Cp calculations  (2)'!G41*('Calculations - vol current'!C55-32)","v":0},{"$f":"C72","v":0},null,0,null,{"$f":"F72","v":0},"Base",null,{"$f":"K71*29.926","v":5.5290064928926457},"inch HG"]
["TOTAL","Btu/hr",{"$f":"SUM(C68:C72)","v":2060.4290010132772},{"$f":"SUM(D68:D72)","v":1743.0257371360658},null,2060.4290010132772,null,{"$f":"SUM(H68:H72)","v":2127.2530322688117},"Enthalpy at saturated  condition",null,{"$f":"L69*K72^M69","v":1121.3527585645638},"Btu/lb of steam"]
[null,null,null,null,null,null,null,null,"Saturation temperature",null,{"$f":"K75*LN(K72) +L76","v":142.62968317408277},"deg. F."]
["Av. Heat ","%",{"$f":"(C65-C73)/C64","v":0.90423422966978229},{"$f":"(C65-D73)/C64","v":0.9179859025911381},{"$f":"AVERAGE(C75:D75)","v":0.91111006613046019},{"$f":"(F65-F73)/F64","v":0.90423422966978229},null,{"$f":"(F65-H73)/F64","v":0.90133904135354603},null,"Coeff",36.009]
[null,null,null,null,null,null,null,null,null,null,null,{"$f":"81.054","v":81.054000000000002}]
["O2 required @ stoich condition","#s/# of fuel ",{"$f":"U36","v":3.8574609524322874}]
["Stoich air required ","#s/# of fuel ",{"$f":"C77/0.231","v":16.698965162044534},null,null,null,null,null,"Equation: steam enthalpy =",null,"const * base^power"]
["Stoich air required ","scf/# of fuel",{"$f":"C78*'Cp calculations  (2)'!M58","v":219.05434048608407},null,null,null,null,null,"Saturation temperature = ",null,"36.009*Ln(base) = 81.054"]
[null,"scf/scf of fuel",{"$f":"C79*O36","v":10.227344463652615}]
[null,null,null,null,null,null,null,null,null,"N59*LN(N56) +N60"]
["Actual air required ","scf/# of fuel",{"$f":"C79*(1+$C$57)","v":219.05434048608407}]
[null,"scf/scf of fuel",{"$f":"C80*(1+$C$57)","v":10.227344463652615}]
[]
[]
["Volume of FG ","scf/# of fuel",{"$f":"J12","v":241.70237523283197}]
[]
["Mass of FG","#s/# of fuel mix",{"$f":"J9","v":17.69896516204453}]
[null,"Scf/scf of gaseous fuel",{"$f":"C86*O36","v":11.2847499104736}]
["Note: The fuel gas composition is in volume %.  The higher hydrocarbons in fuel are treated as same as C4H10 and all other inert gases are treated as N2.",null,null,null,null,null,null,null,null,null,null,null,null,null,null,null,null,null,null,null,null,null,null,null,null,null,{"$f":"12*14*0.6","v":100.8}]
[]
[]
["Combustion air temperature  ",null,null,null,null,null,null,null,null,null,null,null,60,"Deg. F. "]
["% Oxygen in COMBUSTION AIR ",null,null,null,null,null,null,null,null,null,null,null,20.9,"% "]
["% O2 in flue gases (ONLY for combustion with ambient air containing approximately 21% O2) ",null,null,null,null,null,null,null,null,null,null,null," ","%"]
["Calculated value of excess air used. (ONLY for combustion with ambient air containing approximately 21% O2) ",null,null,null,null,null,null,null,null,null,null,null,{"$f":"O39","v":0},"%"]
["% Excess air used for combustion.  (Give this number if O2 in combustion air is higher than approximately 21%.)",null,null,null,null,null,null,null,null,null,null,null,0,"% "]
["Exhaust (flue) gas temperature ",null,null,null,null,null,null,null,null,null,null,null,1400,"Deg. F. "]
["% Excess air used for calculations",null,null,null,null,null,null,null,null,null,null,null,{"$f":"IF(M94>21.1,M97,M96)","v":0},"Deg. F. "]
[]
[]
["©  Developed by: Arvind Thekdi, E3M Inc. "]

{"sheet":"Cp calculations  (2)","index":26,"n_rows":88,"n_cols":22,"rows_kept":88,"cut":false,"hidden":true,"merged":[[22,11,23,11],[25,11,26,11],[28,11,29,11],[49,13,49,17],[34,11,35,11],[37,11,38,11],[40,11,41,11],[31,11,32,11],[19,11,20,11],[7,11,8,11],[10,11,11,11],[13,11,14,11],[16,11,17,11]]}
[]
[null,"Initial Gas temperature (F)",60]
[null,"Final Gas temperature (F)",{"$f":"'Calculations - vol current'!C55","v":0}]
[]
[]
[null,null,null,null,"Cp",null,"Cp","Sp. Vol","Sp. Wt","Sp. Gravity","Cp","Mean CP"]
[null,"Gas","Temp (F)","Temp ®","Btu/(#mole.F)","Mol wt","Btu/(#F)","SCF/#","#/SCF","wrt Air @stp","Btu/SCF","Btu/SCF"]
[null,"Oxygen",{"$f":"C2","v":60},{"$f":"460+C8","v":520},{"$f":"11.515-172/D8^0.5 +1530/D8","v":6.9146087262672413},32,{"$f":"E8/F8","v":0.21608152269585129},{"$f":"378.2/F8","v":11.81875},{"$f":"1/H8","v":8.4611316763617134E-2},{"$f":"I8/0.0763","v":1.1089294464432127},{"$f":"G8/H8","v":1.82829421635834E-2},{"$f":"(K8+K9)/2","v":1.8159907895190751E-2}]
[null,"Oxygen",{"$f":"C3","v":0},{"$f":"460+C9","v":460},{"$f":"11.515-172/D9^0.5 +1530/D9","v":6.8215456056550403},32,{"$f":"E9/F9","v":0.21317330017672001},{"$f":"378.2/F9","v":11.81875},{"$f":"1/H9","v":8.4611316763617134E-2},{"$f":"I9/0.0763","v":1.1089294464432127},{"$f":"G9/H9","v":1.8036873626798098E-2},null,null,{"$f":"G9/G8","v":0.98654108651749561}]
[]
[null,"Nitrogen",{"$f":"C8","v":60},{"$f":"460+C11","v":520},{"$f":"9.47-3.47*10^3/D11 +1.07*10^6/D11^2","v":6.7540236686390536},28,{"$f":"E11/F11","v":0.24121513102282335},{"$f":"378.2/F11","v":13.507142857142856},{"$f":"1/H11","v":7.4034902168164995E-2},{"$f":"I11/0.0763","v":0.97031326563781117},{"$f":"G11/H11","v":1.7858338626755829E-2},{"$f":"(K11+K12)/2","v":1.8161364599176031E-2}]
[null,"Nitrogen",{"$f":"C9","v":0},{"$f":"460+C12","v":460},{"$f":"9.47-3.47*10^3/D12 +1.07*10^6/D12^2","v":6.9832325141776943},28,{"$f":"E12/F12","v":0.24940116122063194},{"$f":"378.2/F12","v":13.507142857142856},{"$f":"1/H12","v":7.4034902168164995E-2},{"$f":"I12/0.0763","v":0.97031326563781117},{"$f":"G12/H12","v":1.8464390571596233E-2},null,null,{"$f":"G12/G11","v":1.0339366364087419}]
[]
[null,"Carbon Monoxide",{"$f":"C11","v":60},{"$f":"460+C14","v":520},{"$f":"9.46-3.29*10^3/D14+1.07*10^6/D14^2","v":7.0901775147929005},28,{"$f":"E14/F14","v":0.25322062552831787},{"$f":"378.2/F14","v":13.507142857142856},{"$f":"1/H14","v":7.4034902168164995E-2},{"$f":"I14/0.0763","v":0.97031326563781117},{"$f":"G14/H14","v":1.8747164237950559E-2},{"$f":"(K14+K15)/2","v":1.9109881513480545E-2}]
[null,"Carbon Monoxide",{"$f":"C12","v":0},{"$f":"460+C15","v":460},{"$f":"9.46-3.29*10^3/D15+1.07*10^6/D15^2","v":7.3645368620037814},28,{"$f":"E15/F15","v":0.26301917364299221},{"$f":"378.2/F15","v":13.507142857142856},{"$f":"1/H15","v":7.4034902168164995E-2},{"$f":"I15/0.0763","v":0.97031326563781117},{"$f":"G15/H15","v":1.9472598789010531E-2},null,null,{"$f":"G15/G14","v":1.0386956950849904}]
[]
[null,"Hydrogen",{"$f":"C14","v":60},{"$f":"460+C17","v":520},{"$f":"5.76+0.578*D17/10^3+20/D17^0.5","v":6.9376180193070294},2,{"$f":"E17/F17","v":3.4688090096535147},{"$f":"378.2/F17","v":189.1},{"$f":"1/H17","v":5.2882072977260709E-3},{"$f":"I17/0.0763","v":6.9308090402700792E-2},{"$f":"G17/H17","v":1.8343781119267662E-2},{"$f":"(K17+K18)/2","v":1.8371235890464493E-2}]
[null,"Hydrogen",{"$f":"C15","v":0},{"$f":"460+C18","v":460},{"$f":"5.76+0.578*D18/10^3+20/D18^0.5","v":6.9583848082403135},2,{"$f":"E18/F18","v":3.4791924041201567},{"$f":"378.2/F18","v":189.1},{"$f":"1/H18","v":5.2882072977260709E-3},{"$f":"I18/0.0763","v":6.9308090402700792E-2},{"$f":"G18/H18","v":1.8398690661661325E-2},null,null,{"$f":"G18/G17","v":1.002993360094991}]
[]
[null,"Water vapor (H2O)",{"$f":"140","v":140},{"$f":"460+C20","v":600},{"$f":"19.86-597/D20^0.5+7500/D20","v":7.9875770593073767},18,{"$f":"E20/F20","v":0.44375428107263204},{"$f":"378.2/F20","v":21.011111111111109},{"$f":"1/H20","v":4.7593865679534643E-2},{"$f":"I20/0.0763","v":0.62377281362430714},{"$f":"G20/H20","v":2.1119981648089311E-2},{"$f":"(K20+K21)/2","v":2.1571465308594613E-2},null," "]
[null,"Water vapor (H2O)",{"$f":"C18","v":0},{"$f":"460+C21","v":460},{"$f":"19.86-597/D21^0.5+7500/D21","v":8.3290793001135874},18,{"$f":"E21/F21","v":0.46272662778408818},{"$f":"378.2/F21","v":21.011111111111109},{"$f":"1/H21","v":4.7593865679534643E-2},{"$f":"I21/0.0763","v":0.62377281362430714},{"$f":"G21/H21","v":2.2022948969099915E-2},null,null,{"$f":"G21/G20","v":1.0427541716681508}]
[]
[null,"Carbon Dioxide",{"$f":"C20","v":140},{"$f":"460+C23","v":600},{"$f":"16.2-6.53*10^3/D23+1.41*10^6/D23^2","v":9.2333333333333325},44,{"$f":"E23/F23","v":0.20984848484848484},{"$f":"378.2/F23","v":8.5954545454545457},{"$f":"1/H23","v":0.11634056054997356},{"$f":"I23/0.0763","v":1.5247779888594175},{"$f":"G23/H23","v":2.4413890357835359E-2},{"$f":"(K23+K24)/2","v":2.3666310454089394E-2}]
[null,"Carbon Dioxide",{"$f":"C21","v":0},{"$f":"460+C24","v":460},{"$f":"16.2-6.53*10^3/D24+1.41*10^6/D24^2","v":8.6678638941398862},44,{"$f":"E24/F24","v":0.19699690668499742},{"$f":"378.2/F24","v":8.5954545454545457},{"$f":"1/H24","v":0.11634056054997356},{"$f":"I24/0.0763","v":1.5247779888594175},{"$f":"G24/H24","v":2.2918730550343432E-2},null,null,{"$f":"G24/G23","v":0.93875782247002382}]
[]
[null,"Methane - CH4",{"$f":"C23","v":140},{"$f":"460+C26","v":600},{"$f":"4.23+0.01177*D26","v":11.292},16,{"$f":"E26/F26","v":0.70574999999999999},{"$f":"378.2/F26","v":23.637499999999999},{"$f":"1/H26","v":4.2305658381808567E-2},{"$f":"I26/0.0763","v":0.55446472322160634},{"$f":"G26/H26","v":2.9857218402961398E-2},{"$f":"(K26+K27)/2","v":2.767874140666314E-2}]
[null,"Methane - CH4",{"$f":"C24","v":0},{"$f":"460+C27","v":460},{"$f":"4.23+0.01177*D27","v":9.6441999999999997},16,{"$f":"E27/F27","v":0.60276249999999998},{"$f":"378.2/F27","v":23.637499999999999},{"$f":"1/H27","v":4.2305658381808567E-2},{"$f":"I27/0.0763","v":0.55446472322160634},{"$f":"G27/H27","v":2.5500264410364886E-2},null,null,{"$f":"G27/G26","v":0.85407368048175702}]
[]
[null,"Ethylene C2H4",{"$f":"C26","v":140},{"$f":"460+C29","v":600},{"$f":"4.52+0.00737*D29","v":8.9420000000000002},28,{"$f":"E29/F29","v":0.31935714285714284},{"$f":"378.2/F29","v":13.507142857142856},{"$f":"1/H29","v":7.4034902168164995E-2},{"$f":"I29/0.0763","v":0.97031326563781117},{"$f":"G29/H29","v":2.3643574828133264E-2},{"$f":"(K29+K30)/2","v":2.2279481755684824E-2}]
[null,"Ethylene C2H4",{"$f":"C27","v":0},{"$f":"460+C30","v":460},{"$f":"4.52+0.00737*D30","v":7.9101999999999997},28,{"$f":"E30/F30","v":0.28250714285714285},{"$f":"378.2/F30","v":13.507142857142856},{"$f":"1/H30","v":7.4034902168164995E-2},{"$f":"I30/0.0763","v":0.97031326563781117},{"$f":"G30/H30","v":2.0915388683236384E-2},null,null,{"$f":"G30/G29","v":0.88461194363677031}]
[]
[null,"Ethane C2H6",{"$f":"C29","v":140},{"$f":"460+C32","v":600},{"$f":"4.04+0.01636*D32","v":13.855999999999998},30,{"$f":"E32/F32","v":0.46186666666666659},{"$f":"378.2/F32","v":12.606666666666666},{"$f":"1/H32","v":7.9323109465891065E-2},{"$f":"I32/0.0763","v":1.0396213560405119},{"$f":"G32/H32","v":3.6636700158646215E-2},{"$f":"(K32+K33)/2","v":3.3608672659968267E-2}]
[null,"Ethane C2H6",{"$f":"C30","v":0},{"$f":"460+C33","v":460},{"$f":"4.04+0.01636*D33","v":11.5656},30,{"$f":"E33/F33","v":0.38551999999999997},{"$f":"378.2/F33","v":12.606666666666666},{"$f":"1/H33","v":7.9323109465891065E-2},{"$f":"I33/0.0763","v":1.0396213560405119},{"$f":"G33/H33","v":3.0580645161290321E-2},null,null,{"$f":"G33/G32","v":0.83469976905311782}]
[]
[null,"Propane C3H8",{"$f":"C32","v":140},{"$f":"460+C35","v":600}," ",44,0.38800000000000001,{"$f":"378.2/F35","v":8.5954545454545457},{"$f":"1/H35","v":0.11634056054997356},{"$f":"I35/0.0763","v":1.5247779888594175},{"$f":"G35/H35","v":4.5140137493389743E-2},{"$f":"(K35+K36)/2","v":{"$error":"#VALUE!"}}]
[null,"Propane C3H8",{"$f":"C33","v":0},{"$f":"460+C36","v":460}," ",44,{"$f":"E36/F36","v":{"$error":"#VALUE!"}},{"$f":"378.2/F36","v":8.5954545454545457},{"$f":"1/H36","v":0.11634056054997356},{"$f":"I36/0.0763","v":1.5247779888594175},{"$f":"G36/H36","v":{"$error":"#VALUE!"}}]
[]
[null,"Butane C4H10",{"$f":"C35","v":140},{"$f":"460+C38","v":600}," ",58,0.38200000000000001,{"$f":"378.2/F38","v":6.5206896551724132},{"$f":"1/H38","v":0.15335801163405607},{"$f":"I38/0.0763","v":2.0099346216783234},{"$f":"G38/H38","v":5.8582760444209417E-2},{"$f":"(K38+K39)/2","v":{"$error":"#VALUE!"}}]
[null,"Butane C4H10",{"$f":"C36","v":0},{"$f":"460+C39","v":460}," ",58,{"$f":"E39/F39","v":{"$error":"#VALUE!"}},{"$f":"378.2/F39","v":6.5206896551724132},{"$f":"1/H39","v":0.15335801163405607},{"$f":"I39/0.0763","v":2.0099346216783234},{"$f":"G39/H39","v":{"$error":"#VALUE!"}}]
[]
[null,"Sulfur Dioxide",{"$f":"C38","v":140},{"$f":"460+C41","v":600}," ",64,0.27300000000000002,{"$f":"378.2/F41","v":5.9093749999999998},{"$f":"1/H41","v":0.16922263352723427},{"$f":"I41/0.0763","v":2.2178588928864253},{"$f":"G41/H41","v":4.6197778952934962E-2},{"$f":"(K41+K42)/2","v":{"$error":"#VALUE!"}}]
[null,"Sulfur Dioxide",{"$f":"C39","v":0},{"$f":"460+C42","v":460}," ",64,{"$f":"E42/F42","v":{"$error":"#VALUE!"}},{"$f":"378.2/F42","v":5.9093749999999998},{"$f":"1/H42","v":0.16922263352723427},{"$f":"I42/0.0763","v":2.2178588928864253},{"$f":"G42/H42","v":{"$error":"#VALUE!"}}]
[]
[null,"Air",{"$f":"C2","v":60},null,null,null,{"$f":"J52*G8+(1-J52)*G11","v":0.2354199130627195}]
[null,null,{"$f":"C3","v":0},null,null,null,{"$f":"J52*G9+(1-J52)*G12","v":0.24104786995236152}]
[null,"Comb air",{"$f":"'Calculations - vol current'!C53","v":0},null,null,null,{"$f":"G83","v":0.23548139090679829}]
[]
[null,"Source - Gas Engineers Handbook "]
[]
[null,"For Air at 60 F., 80% Humidity ",null,null,null,null,null,null,null,null,null,null,null,"Specific Heat (Btu/[F-#])for Comb. Air"]
[null,"Composition of gas mixture ","% Vol","% mass","Mean CP Btu/scf","Cp-60 F","Cp 1000F",null,"mass","% mass",null,"Ratio","sp. Vol scf/#","By mass","Cp fraction","Temp (R)","Cp Btu/(#F)"]
[null,"Oxygen ",20.7,null,{"$f":"L8","v":1.8159907895190751E-2},{"$f":"K8","v":1.82829421635834E-2},{"$f":"K9","v":1.8036873626798098E-2},null,{"$f":"C52*I8","v":1.7514542570068745},{"$f":"I52/I58","v":0.23057644110275691},null,"Ratio",{"$f":"J52*H8","v":2.7251253132832081},0.23100000000000001,{"$f":"N52*(G8+G9)/2","v":4.9578932041781994E-2},{"$f":"'Calculations - vol current'!C53 +460","v":460},{"$f":"N52*(11.515-172/P52^0.5 +1530/P52)/32","v":4.9243032340822328E-2},"O2 in air"]
[null,"Carbon Dioxide",0,null,{"$f":"L23","v":2.3666310454089394E-2},{"$f":"K23","v":2.4413890357835359E-2},{"$f":"K24","v":2.2918730550343432E-2}]
[null,"Nitrogen & Other",78.3,null,{"$f":"L11","v":1.8161364599176031E-2},{"$f":"K11","v":1.7858338626755829E-2},{"$f":"K12","v":1.8464390571596233E-2},null,{"$f":"C54*I11","v":5.7969328397673188},{"$f":"I54/I58","v":0.76315789473684215},null,{"$f":"(J54+J55)/J52","v":3.3369565217391304},{"$f":"(1-J52)*H11","v":10.392713927676333},{"$f":"1-N52","v":0.76900000000000002},{"$f":"N54*(G11+G12)/2","v":0.18864196436760855},{"$f":"P52","v":460},{"$f":"N54*(9.47-3.47*10^3/P54 +1.07*10^6/P54^2)/28","v":0.19178949297866596},"N2 in air"]
[null,"Water vapor",1,null,{"$f":"L20","v":2.1571465308594613E-2},{"$f":"K20","v":2.1119981648089311E-2},{"$f":"K21","v":2.2022948969099915E-2},null,{"$f":"C55*I20","v":4.7593865679534643E-2},{"$f":"I55/I58","v":6.2656641604010039E-3},null,null,null,"Total ",{"$f":"O52+O54","v":0.23822089640939054},null,{"$f":"SUM(Q52:Q54)","v":0.24103252531948829}]
[]
[null,"Total",{"$f":"SUM(C52:C56)","v":100}]
[null,"Mean value",null,null,{"$f":"($C$52*E52+$C$53*E53+$C$54*E54+$C$55*E55)/100","v":1.8195164068545263E-2},{"$f":"($C$52*F52+$C$53*F53+$C$54*F54+$C$55*F55)/100","v":1.7978847989092474E-2},{"$f":"($C$52*G52+$C$53*G53+$C$54*G54+$C$55*G55)/100","v":1.8411480147998052E-2},null,{"$f":"SUM(I52:I55)","v":7.5959809624537273},null,null,null,{"$f":"M52+M54","v":13.11783924095954}]
[]
[null,null,null,null,null,"B",{"$f":"(G58-F58)/(1000-60)","v":4.6024697755912597E-7},null,null,null,null,null,null,null,null,null,null,null,"C","x","x^2","x^3"]
[null,null,null,null,null,"A",{"$f":"G58-G60*1000","v":1.7951233170438927E-2},null,null,null,null,null,null,"Specific heat of air ","Cp ","Btu/(#-F)",null,null,{"$f":"0.2371","v":0.23710000000000001},{"$f":"(-0.000009)","v":-9.0000000000000002E-6},{"$f":"7*10^(-8)","v":7.0000000000000005E-8},-3E-11]
[]
[null,null,null,null,"cp for air",null,null,null,null,null,null,null,null,null,"Specific heat of air ","Cp ","Btu/(#-F)"]
[null,null,null,null,"Temp","Cp (Btu/scf)",null,null,null,null,null,null,null,"Temp (F) ","Temp - R","Cpo2","Cpn2","Cpair","Cp calculated","Error"]
[null,null,null,null,60,{"$f":"$G$61+$G$60*E65","v":1.7978847989092474E-2},{"$f":"F65*M58","v":0.23584363765856378},null,null,null,null,null,null,0,{"$f":"N65+460","v":460},{"$f":"0.231*(11.515-172/O65^0.5 +1530/O65)/32","v":4.9243032340822328E-2},{"$f":"0.769*(9.47-3.47*10^3/O65 +1.07*10^6/O65^2)/28","v":0.19178949297866596},{"$f":"P65+Q65","v":0.24103252531948829},{"$f":"$S$61+$T$61*N65+$U$61*N65^2+$V$61*N65^3","v":0.23710000000000001},{"$f":"(R65-S65)/R65","v":1.6315330531743517E-2}]
[null,null,null,null,100,1.7997257868194842E-2,0,null,null,null,null,null,null,100,{"$f":"N66+460","v":560},{"$f":"0.231*(11.515-172/O66^0.5 +1530/O66)/32","v":5.0378329923635286E-2},{"$f":"0.769*(9.47-3.47*10^3/O66 +1.07*10^6/O66^2)/28","v":0.18361416362973765},{"$f":"P66+Q66","v":0.23399249355337293},{"$f":"$S$61+$T$61*N66+$U$61*N66^2+$V$61*N66^3","v":0.23687},{"$f":"(R66-S66)/R66","v":-1.2297430583903413E-2}]
[null,null,null,null,{"$f":"100+E66","v":200},1.8043282565950752E-2,0,null,null,null,null,null,null,{"$f":"100+N66","v":200},{"$f":"N67+460","v":660},{"$f":"0.231*(11.515-172/O67^0.5 +1530/O67)/32","v":5.152809367277246E-2},{"$f":"0.769*(9.47-3.47*10^3/O67 +1.07*10^6/O67^2)/28","v":0.18315400006559099},{"$f":"P67+Q67","v":0.23468209373836346},0.23786000000000002,-1.3541323971565803E-2]
[null,null,null,null,300,1.8089307263706667E-2,0,null,null,null,null,null,null,{"$f":"100+N67","v":300},{"$f":"N68+460","v":760},{"$f":"0.231*(11.515-172/O68^0.5 +1530/O68)/32","v":5.2617917350489422E-2},{"$f":"0.769*(9.47-3.47*10^3/O68 +1.07*10^6/O68^2)/28","v":0.1855680381875742},{"$f":"P68+Q68","v":0.23818595553806363},0.23988999999999999,-7.1542608718760028E-3]
[null,null,null,null,400,1.8135331961462577E-2,0,null,null,null,null,null,null,400,860,5.3627505046469605E-2,0.18900493645213631,0.24263244149860591,0.24278000000000002,-6.0815652054904852E-4]
[null,null,null,null,500,1.8181356659218492E-2,0,null,null,null,null,null,null,500,960,5.4555514502210141E-2,0.19270153955853173,0.24725705406074186,0.24634999999999999,3.6684658570713406E-3]
[null,null,null,null,600,1.8227381356974402E-2,0,null,null,null,null,null,null,600,1060,5.540721403748624E-2,0.19633424922443171,0.25174146326191793,0.25042000000000003,5.2492872838473034E-3]
[null,null,null,null,700,1.8273406054730316E-2,0,null,null,null,null,null,null,700,1160,5.6189823324839031E-2,0.1997698585867165,0.25595968191155555,0.25480999999999998,4.4916523687227759E-3]
[null,null,null,null,800,1.8319430752486227E-2,0,null,null,null,null,null,null,800,1260,5.6910709532423526E-2,0.20296120982255336,0.25987191935497689,0.25934000000000001,2.0468519888456587E-3]
[null,null,null,null,900,1.8365455450242141E-2,0,null,null,null,null,null,null,900,1360,5.7576715038863885E-2,0.20590065280523978,0.26347736784410369,0.26383000000000001,-1.3383774051703877E-3]
[null,null,null,null,1000,1.8411480147998052E-2,0,null,null,null,null,null,null,1000,1460,5.819394930775109E-2,0.20859833639385575,0.26679228570160685,0.2681,-4.9016196062571637E-3]
[null,null,null,null,1100,1.8457504845753966E-2,0,null,null,null,null,null,null,1100,1560,5.8767771218233948E-2,0.2110717932281394,0.26983956444637336,0.27196999999999999,-7.8951934198293709E-3]
[null,null,null,null,1200,1.8503529543509877E-2,0,null,null,null,null,null,null,1200,1660,5.9302845390681695E-2,0.21334088904672047,0.27264373443740214,0.27526,-9.5959130254597777E-3]
[null,null,null,null,1300,1.8549554241265791E-2,0,null,null,null,null,null,null,1300,1760,5.9803222190698536E-2,0.21542540270808738,0.27522862489878591,0.27778999999999998,-9.3063543160018473E-3]
[null,null,null,null,1400,1.8595578939021702E-2,0,null,null,null,null,null,null,1400,1860,6.0272419959847119E-2,0.21734392320334311,0.27761634316319023,0.27938000000000002,-6.352856667999068E-3]
[null,null,null,null,1500,1.8641603636777616E-2,0,null,null,null,null,null,null,1500,1960,6.0713500894238832E-2,0.21911341152495986,0.27982691241919871,0.27984999999999999,-8.2506648848294022E-5]
[null,null,null,null,1600,1.8687628334533531E-2,0,null,null,null,null,null,null,1600,2060,6.1129137755824715E-2,0.22074909568021761,0.28187823343604235,0.27902000000000005,1.0139957957026253E-2]
[null,null,null,null,null,null,"Btu/#",null,null,null,null,null,null,1700,2160,6.1521671126473436E-2,0.2222645273613561,0.28378619848782954,0.27671000000000001,2.4934963453245605E-2]
[null,null,null,"Cob air temp",{"$f":"'Calculations - vol current'!C53","v":0},{"$f":"$G$61+$G$60*E83","v":1.7951233170438927E-2},{"$f":"F83*M58","v":0.23548139090679829},null,null,null,null,null,null,1800,2260,6.1893157946827704E-2,0.22367171097971653,0.2855648689265442,0.27273999999999998,4.491052759659718E-2]
[null,null,null,null,null,null,null,null,null,null,null,null,null,1900,2360,6.2245412427497614E-2,0.22498125877210984,0.28722667119960743,0.26693,7.0664298391364608E-2]
[null,null,null,null,null,null,null,null,null,null,null,null,null,2000,2460,6.2580040458751887E-2,0.22620254848776714,0.28878258894651904,0.25910000000000005,0.102785244272521]
[null,null,null,null,null,null,null,null,null,null,null,null,null,2100,2560,6.2898468555896481E-2,0.22734387233189177,0.29024234088778822]
[null,null,null,null,null,null,null,null,null,null,null,null,null,2200,2660,6.3201968245098689E-2,0.22841257232097428,0.29161454056607294]
[null,null,null,null,null,null,null,null,null,null,null,null,null,2300,2760,6.3491676656759588E-2,0.22941516060551509,0.29290683726227468,{"$f":"$T$65-$T$64*N88+$T$63*N88^2-$T$62*N88^3+$T$61*N88^4","v":{"$error":"#VALUE!"}}]

{"sheet":"Data-Results vol mod ","index":27,"n_rows":37,"n_cols":3,"rows_kept":37,"cut":false,"hidden":true,"merged":[[30,0,30,2],[35,1,36,1],[2,0,2,2],[3,0,3,2],[5,1,5,2],[32,0,33,0]]}
[]
[]
["Available Heat Calculation for Gaseous Fuels"]
["Given Volumetric Gas Analysis"]
[]
["Name or designation of fuel ",{"$f":"'Flue gases'!C68","v":"Natural Gas - East Ohio"}]
[]
["Gas composition ","By volume"]
["CH4  ",{"$f":"'Flue gases'!C71","v":0.94099999999999995}]
["C2H6",{"$f":"'Flue gases'!C72","v":3.0099999999999998E-2}]
["N2 and other inert",{"$f":"'Flue gases'!C73","v":1.41E-2},"Note:"]
["H2",{"$f":"'Flue gases'!C74","v":1E-4},"The gas analysis "]
["C3H8",{"$f":"'Flue gases'!C75","v":4.1999999999999997E-3},"will be adjusted to "]
["C4H10 + CnH2n",{"$f":"'Flue gases'!C76","v":2.8E-3},"make total 100%"]
["H2O",{"$f":"'Flue gases'!C77","v":0},"for the calculations"]
["CO",{"$f":"'Flue gases'!C78","v":0}]
["CO2",{"$f":"'Flue gases'!C79","v":2.0000000000000002E-5}]
["SO2",{"$f":"'Flue gases'!C80","v":0}]
["O2",{"$f":"'Flue gases'!C81","v":1E-4}]
["Total of fuel components ",{"$f":"SUM(B9:B19)","v":0.99241999999999997}]
["Difference ",{"$f":"1-B20","v":7.5800000000000312E-3}]
[]
["Weight % for tar in gas-tar mixture","%",0]
[]
["Fuel gas temperature","Deg. F.",{"$f":"'Flue gases'!E87","v":0}]
["Combustion air temperature","Deg. F.",{"$f":"'Flue gases'!E88","v":0}]
["Flue gas temperature","Deg. F.",{"$f":"'Flue gases'!E89","v":0}]
["Excess air used for combustion","%",{"$f":"'Flue gases'!E90","v":0}]
["Percent O2 in flue gas ","%"]
[]
["Results"]
["Avaiable Heat","%",{"$f":"'Calculations vol mod'!H75","v":0.90133904135354603}]
["Higher (Gross) calorific (heating value) of the fuel ","kJ/m3",{"$f":"'Calculations vol mod'!C48*37.3","v":38539.004116989592}]
[null,"kcal/m3",{"$f":"'Calculations vol mod'!C48*8.9","v":9195.6336901127997}]
["% O2 in Flue gases (dry basis)","%",{"$f":"'Calculations vol mod'!I14","v":0}]
["Stoichiometric air required ","m3 air/m3 fuel gas",{"$f":"'Calculations vol mod'!C80","v":10.227344463652615}]
["Actual air required ",null,{"$f":"'Calculations vol mod'!C83","v":10.227344463652615}]

{"sheet":"Calculations vol mod","index":28,"n_rows":102,"n_cols":31,"rows_kept":102,"cut":false,"hidden":true,"merged":[[103,0,103,7],[101,0,101,13],[22,14,22,15],[27,12,27,13],[28,12,28,13],[22,0,22,7],[22,12,22,13],[23,12,23,13],[24,12,24,13],[36,12,36,13],[32,12,32,13],[97,0,97,7],[98,0,98,7],[35,12,35,13],[25,12,25,13],[26,12,26,13],[100,0,100,7],[93,0,93,7],[91,0,91,13],[96,0,96,7],[102,0,102,7],[0,2,0,4],[0,5,0,7],[22,16,22,19],[22,25,22,28],[94,16,96,20],[89,0,89,13],[50,0,50,13],[94,0,94,7],[95,0,95,7],[92,0,92,7],[29,12,29,13],[30,12,30,13],[90,0,90,13],[33,12,33,13],[34,12,34,13],[31,12,31,13]]}
[null,null,"Per # of  other vapor at stoich ratio",null,null,"# Per # of gas from gasifier at stoich ratio",null,null,null,"Total "," "]
[null,null,"CO2","H2O","N2","CO2","H2O","N2","Excess O2 in FG",null,"SO2","O2 supplied for comb","Comb air required","Stoich air"]
["Wt. of other vapors",{"$f":"'Data-Results vol mod '!C23","v":0},3.18,0.57199999999999995,9.3000000000000007,{"$f":"$B$3*C3","v":0},{"$f":"$B$3*D3","v":0},{"$f":"$B$3*E3","v":0},0,{"$f":"SUM(F3:H3)","v":0},0,{"$f":"0.231*12.052*B3","v":0},{"$f":"L3/0.231","v":0},{"$f":"M3","v":0}]
["With Excess air",{"$f":"C57","v":0},null,null,null,{"$f":"F3","v":0},{"$f":"G3","v":0},{"$f":"H3+I4/(1-0.231)","v":0},{"$f":"B4*L3","v":0},{"$f":"SUM(F4:I4)","v":0},0,{"$f":"I4","v":0},{"$f":"L4/0.231","v":0}]
[]
[]
["Wt. of gases from gas combustion",{"$f":"1-B3","v":1},null,null,null,{"$f":"$B$7*Q40","v":2.7095835212488995},{"$f":"$B$7*R40","v":2.1253493533810555},{"$f":"B7*T40","v":12.864032287414576},{"$f":"B7*U40","v":0},{"$f":"SUM(F7:I7)+K7","v":17.69896516204453},{"$f":"B7*S40","v":0},{"$f":"I7+B7*U36","v":3.8574609524322874},{"$f":"L7/0.231","v":16.698965162044534},{"$f":"M7-I7/0.231","v":16.698965162044534}]
[]
["Total wt. of FG # per # of fuel",null,null,null,null,{"$f":"F4+F7","v":2.7095835212488995},2.1253493533810555,12.864032287414576,0,17.69896516204453,0,{"$f":"SUM(L3:L7)","v":3.8574609524322874},{"$f":"SUM(M3:M7)","v":16.698965162044534},{"$f":"M9/(1+B4)","v":16.698965162044534}]
["Wet analysis % by weight",null,null,null,null,{"$f":"F9/$J$9","v":0.15309276539283817},0.1200832553724029,0.72682397923475894,0,1,0]
["dry analysis % by weight",null,null,null,null,{"$f":"F9/($J$9-$G$9)","v":0.17398551206981622},0,{"$f":"H9/($J$9-$G$9)","v":0.82601448793018384},{"$f":"I9/($J$9-$G$9)","v":0},{"$f":"SUM(F11:I11)","v":1},{"$f":"K9/($J$9-$G$9)","v":0}]
["Volume scf /#of Fuel",null,null,null,null,{"$f":"F9*'Cp calculations  (3)'!H23","v":23.290101994007586},{"$f":"G9*'Cp calculations  (3)'!H20","v":44.655951413817505},{"$f":"H9*'Cp calculations  (3)'!H11","v":173.75632182500686},{"$f":"I9*'Cp calculations  (3)'!H8","v":0},{"$f":"SUM(F12:I12)+K12","v":241.70237523283197},{"$f":"K9*'Cp calculations  (3)'!H41","v":0}]
["Wet analysis % by volume",null,null,null,null,{"$f":"F12/$J$12","v":9.6358597930914919E-2},0.18475594776758156,0.71888545430150341,0,1,0,null,null," "]
["Dry analysis % by volume",null,null,null,null,{"$f":"F12/($J$12-$G$12)","v":0.11819601463764373},0,{"$f":"H12/($J$12-$G$12)","v":0.88180398536235616},{"$f":"I12/($J$12-$G$12)","v":0},{"$f":"SUM(F14:I14)","v":0.99999999999999989},{"$f":"K12/($J$12-$G$12)","v":0}]
[null,null,null,null,null,null,null,null,null,null,null,null,null,null,null,null,null,null,null,null,null,null,null,null,null,null,null,null,{"$f":"T39*'Cp calculations  (3)'!H11","v":0},{"$f":"U39*'Cp calculations  (3)'!H8","v":0}]
["Heating value of fuel (higher)",null,null,null,null,null,null,null,"Density of FG",{"$f":"J9/J12","v":7.3226277337966217E-2},"#/scf of FG"]
["Other vapors","Btu/#",15720,null,null,null,null,null,"Sp. Volume of FG",{"$f":"1/J16","v":13.656299846906487},"SCF/lb of FG"]
["Gas fuel","Btu/#",{"$f":"C47","v":23081.065532346693}]
["Total heating value Higher for mixed fuel","Btu/#",{"$f":"C17*B3+C18*B7","v":23081.065532346693}]
[]
[]
[]
["Gas (Fuel) Analysis (See note below) ",null,null,null,null,null,null,null,null,null,"Heating value Btu/lb.",null,"Comment ",null,"By weight analysis",null,"By weight #s/# of component",null,null,null,"required",null,"Total",null,null,"By volume scf/# of component"]
["Gas composition ","Mol wt","O2 reqd","CO2","H2O","SO2","By volume","Adjusted by volume","Heat value Btu/scf comp.","Heat value Btu/scf fuel",null,"Ht. value /lb of fuel",null,null,"lbs./cu.ft.","%","CO2","H2O","SO2","N2","O2"," ",null,null,null,"CO2","H2O","SO2","N2","O2","Total"]
["CH4  ",{"$f":"16.042","v":16.042000000000002},64,{"$f":"B33","v":44.01},{"$f":"2*B31","v":36.031999999999996},null,{"$f":"'Data-Results vol mod '!B9","v":0.94099999999999995},{"$f":"G25*(1+$G$37)","v":0.9481327799999999},1012,{"$f":"I25*H25","v":959.5103733599999},23875,{"$f":"K25*P25","v":20511.620828220701},null,null,{"$f":"H25*'Cp calculations  (3)'!I26","v":4.0111381491274453E-2},{"$f":"O25/$O$36","v":0.85912547971605036},{"$f":"P25*D25/B25","v":2.3569450419089497},{"$f":"P25*E25/B25","v":1.929685156783987},null,{"$f":"U25*(1-0.231)/0.231","v":11.410178047156821},{"$f":"P25*C25/B25","v":3.4275047189768868},{"$f":"T25/U25","v":3.3290043290043285},null,null,null,{"$f":"Q25*'Cp calculations  (3)'!$H$23","v":20.259013973862835},{"$f":"R25*'Cp calculations  (3)'!$H$20","v":40.544829238650209},{"$f":"S25*'Cp calculations  (3)'!H41","v":0},{"$f":"T25*'Cp calculations  (3)'!$H$11","v":154.11890490838249},{"$f":"U25*'Cp calculations  (3)'!$H$8","v":40.508821397408077}]
["C2H6",30.068000000000001,112,{"$f":"2*B33","v":88.02},{"$f":"3*B31","v":54.047999999999995},null,{"$f":"'Data-Results vol mod '!B10","v":3.0099999999999998E-2},3.0328157999999997E-2,1773,53.771824133999992,22323,1073.5544575546983,null,null,{"$f":"H26*'Cp calculations  (3)'!I29","v":2.2453422104706505E-3},4.8091854031926631E-2,{"$f":"P26*D26/B26","v":0.14078239297226891},{"$f":"P26*E26/B26","v":8.6446339188425245E-2},null,{"$f":"U26*(1-0.231)/0.231","v":0.59634744277498808},{"$f":"P26*C26/B26","v":0.17913687812876755},null,null,null,null,{"$f":"Q26*'Cp calculations  (3)'!$H$23","v":1.2100886595934568},{"$f":"R26*'Cp calculations  (3)'!$H$20","v":1.8163336378368014},{"$f":"S26*'Cp calculations  (3)'!H42","v":0},{"$f":"T26*'Cp calculations  (3)'!$H$11","v":8.0549501020535885},{"$f":"U26*'Cp calculations  (3)'!$H$8","v":2.1171739783843715}]
["N2 and other inert",28.015999999999998,0,0,0,null,{"$f":"'Data-Results vol mod '!B11","v":1.41E-2},1.4206877999999999E-2,0,0,0,0,null,null,{"$f":"H27*'Cp calculations  (3)'!I11","v":1.0518048228450555E-3},2.2528077802331077E-2,null,null,null,{"$f":"P27","v":2.2528077802331077E-2},null,null,null,null,null,{"$f":"Q27*'Cp calculations  (3)'!$H$23","v":0},{"$f":"R27*'Cp calculations  (3)'!$H$20","v":0},{"$f":"S27*'Cp calculations  (3)'!H43","v":0},{"$f":"T27*'Cp calculations  (3)'!$H$11","v":0.30428996517291473},{"$f":"U27*'Cp calculations  (3)'!$H$8","v":0}]
["H2",2.016,16,0,{"$f":"B31","v":18.015999999999998},null,{"$f":"'Data-Results vol mod '!B12","v":1E-4},1.00758E-4,325,3.274635E-2,61095,0.69724058426211621,null,null,{"$f":"H28*'Cp calculations  (3)'!I17","v":5.3282919090428349E-7},1.1412400102498015E-5,null,{"$f":"P28*E28/B28","v":1.0198700409057748E-4},null,{"$f":"U28*(1-0.231)/0.231","v":3.0152324877416933E-4},{"$f":"P28*C28/B28","v":9.0574603988079485E-5},null,null,null,null,{"$f":"Q28*'Cp calculations  (3)'!$H$23","v":0},{"$f":"R28*'Cp calculations  (3)'!$H$20","v":2.1428602748364669E-3},{"$f":"S28*'Cp calculations  (3)'!H44","v":0},{"$f":"T28*'Cp calculations  (3)'!$H$11","v":4.0727175959425297E-3},{"$f":"U28*'Cp calculations  (3)'!$H$8","v":1.0704786008841143E-3}]
["C3H8",44.094000000000001,160,{"$f":"3*B33","v":132.03},{"$f":"4*B31","v":72.063999999999993},null,{"$f":"'Data-Results vol mod '!B13","v":4.1999999999999997E-3},4.2318359999999992E-3,2523,10.676922227999999,21669,155.79603762724855,null,null,{"$f":"H29*'Cp calculations  (3)'!I32","v":3.3568239026969852E-4},7.1898120645737477E-3,{"$f":"P29*D29/B29","v":2.1528345962844649E-2},{"$f":"P29*E29/B29","v":1.1750501578932338E-2},null,{"$f":"U29*(1-0.231)/0.231","v":8.6850512043157108E-2},{"$f":"P29*C29/B29","v":2.6089035477203239E-2},null,null,null,null,{"$f":"Q29*'Cp calculations  (3)'!$H$23","v":0.18504591916245106},{"$f":"R29*'Cp calculations  (3)'!$H$20","v":0.24689109428623388},{"$f":"S29*'Cp calculations  (3)'!H47","v":0},{"$f":"T29*'Cp calculations  (3)'!$H$11","v":1.1731022733829291},{"$f":"U29*'Cp calculations  (3)'!$H$8","v":0.30833978804619577}]
["C4H10 + CnH2n",58.12,208,{"$f":"4*B33","v":176.04},{"$f":"5*B31","v":90.079999999999984},null,{"$f":"'Data-Results vol mod '!B14","v":2.8E-3},2.8212239999999998E-3,3270,9.2254024799999996,21321,1339.3969683597807,null,null,{"$f":"H30*'Cp calculations  (3)'!J32","v":2.933004720574037E-3},6.2820551022924845E-2,{"$f":"P30*D30/B30","v":0.19027752584438556},{"$f":"P30*E30/B30","v":9.7365368825620593E-2},null,{"$f":"U30*(1-0.231)/0.231","v":0.74843455525803271},{"$f":"P30*C30/B30","v":0.22482234364708137},null,null,null,null,{"$f":"Q30*'Cp calculations  (3)'!$H$23","v":1.6355218244169687},{"$f":"R30*'Cp calculations  (3)'!$H$20","v":2.0457545827694279},{"$f":"S30*'Cp calculations  (3)'!H48","v":0},{"$f":"T30*'Cp calculations  (3)'!$H$11","v":10.109212457092427},{"$f":"U30*'Cp calculations  (3)'!$H$8","v":2.6571190739789428}]
["H2O",18.015999999999998,null,null,{"$f":"B31","v":18.015999999999998},null,{"$f":"'Data-Results vol mod '!B15","v":0},0,0,0,0,0,null,null,{"$f":"H31*'Cp calculations  (3)'!I20","v":0},0,null,{"$f":"O31","v":0},null,null,null,null,null,null,null,{"$f":"Q31*'Cp calculations  (3)'!$H$23","v":0},{"$f":"R31*'Cp calculations  (3)'!$H$20","v":0},{"$f":"S31*'Cp calculations  (3)'!H49","v":0},{"$f":"T31*'Cp calculations  (3)'!$H$11","v":0},{"$f":"U31*'Cp calculations  (3)'!$H$8","v":0}]
["CO",28.01,16,{"$f":"B33","v":44.01},null,null,{"$f":"'Data-Results vol mod '!B16","v":0},0,321,0,4347,0,null,null,{"$f":"H32*'Cp calculations  (3)'!I14","v":0},0,{"$f":"P32*D32/B32","v":0},null,null,{"$f":"U32*(1-0.231)/0.231","v":0},{"$f":"P32*C32/B32","v":0},null,null,null,null,{"$f":"Q32*'Cp calculations  (3)'!$H$23","v":0},{"$f":"R32*'Cp calculations  (3)'!$H$20","v":0},{"$f":"S32*'Cp calculations  (3)'!H50","v":0},{"$f":"T32*'Cp calculations  (3)'!$H$11","v":0},{"$f":"U32*'Cp calculations  (3)'!$H$8","v":0}]
["CO2",44.01,null,{"$f":"B33","v":44.01},null,null,{"$f":"'Data-Results vol mod '!B17","v":2.0000000000000002E-5},2.0151599999999999E-5,0,0,0,0,null,null,{"$f":"H33*'Cp calculations  (3)'!I23","v":2.344448439978847E-6},5.0214560450991257E-5,{"$f":"P33*D33/B33","v":5.0214560450991257E-5},null,null,null,null,null,null,null,null,{"$f":"Q33*'Cp calculations  (3)'!$H$23","v":4.3161697187647487E-4},{"$f":"R33*'Cp calculations  (3)'!$H$20","v":0},{"$f":"S33*'Cp calculations  (3)'!H51","v":0},{"$f":"T33*'Cp calculations  (3)'!$H$11","v":0},{"$f":"U33*'Cp calculations  (3)'!$H$8","v":0}]
["SO2",64.06,null,null,null,64,{"$f":"'Data-Results vol mod '!B18","v":0},0,0,0,0,0,null,null,{"$f":"H34*'Cp calculations  (3)'!I14","v":0},0,null,null,{"$f":"P34","v":0},null,null,null,null,null,null,{"$f":"Q34*'Cp calculations  (3)'!$H$23","v":0},{"$f":"R34*'Cp calculations  (3)'!$H$20","v":0},{"$f":"S34*'Cp calculations  (3)'!H52","v":0},{"$f":"T34*'Cp calculations  (3)'!$H$11","v":0},{"$f":"U34*'Cp calculations  (3)'!$H$8","v":0}]
["O2",32,-32,null,null,null,{"$f":"'Data-Results vol mod '!B19","v":1E-4},1.00758E-4,0,0,0,0,null,null,{"$f":"H35*'Cp calculations  (3)'!I8","v":8.5252670544685359E-6},1.8259840163996823E-4,null,null,null,{"$f":"U35*(1-0.231)/0.231","v":-6.0787086952872544E-4},{"$f":"P35*C35/B35","v":-1.8259840163996823E-4},null,null,null,null,{"$f":"Q35*'Cp calculations  (3)'!$H$23","v":0},{"$f":"R35*'Cp calculations  (3)'!$H$20","v":0},{"$f":"S35*'Cp calculations  (3)'!H53","v":0},{"$f":"T35*'Cp calculations  (3)'!$H$11","v":-8.2105986734201403E-3},{"$f":"U35*'Cp calculations  (3)'!$H$8","v":-2.1580848593823745E-3}]
["Total of fuel components ",null,null,null,null,null,{"$f":"SUM(G25:G35)","v":0.99241999999999997},{"$f":"SUM(H25:H35)","v":0.99994254359999979}," ",{"$f":"SUM(J25:J35)","v":1033.217268552},null,{"$f":"SUM(L25:L35)","v":23081.065532346693},null,null,{"$f":"SUM(O25:O35)","v":4.668861818011924E-2},1,{"$f":"SUM(Q25:Q35)","v":2.7095835212488995},{"$f":"SUM(R25:R35)","v":2.1253493533810555},{"$f":"SUM(S25:S35)","v":0},{"$f":"SUM(T25:T35)","v":12.864032287414576},{"$f":"SUM(U25:U35)","v":3.8574609524322874},null,{"$f":"SUM(Q36:T36)","v":17.69896516204453},null,null,{"$f":"Q36*'Cp calculations  (3)'!$H$23","v":23.290101994007586},{"$f":"R36*'Cp calculations  (3)'!$H$20","v":44.655951413817505},{"$f":"S36*'Cp calculations  (3)'!H54","v":0},{"$f":"T36*'Cp calculations  (3)'!$H$11","v":173.75632182500686},{"$f":"U36*'Cp calculations  (3)'!$H$8","v":45.590366631559093},{"$f":"SUM(Z36:AC36)","v":241.70237523283197}]
["Difference ",null,null,null,null,null,{"$f":"1-G36","v":7.5800000000000312E-3},{"$f":"1-H36","v":5.7456400000210905E-5},null,null,null,null,null,null,null,{"$f":"SUM(P25:P35)","v":1},{"$f":"Q36/$W$36","v":0.15309276539283817},{"$f":"R36/$W$36","v":0.1200832553724029},{"$f":"S36/$W$36","v":0},{"$f":"T36/$W$36","v":0.72682397923475894},null,null,{"$f":"SUM(Q37:T37)","v":1},null,null,{"$f":"Z36/$AE$36","v":9.6358597930914919E-2},{"$f":"AA36/$AE$36","v":0.18475594776758156},{"$f":"AB36/$AE$36","v":0},{"$f":"AC36/$AE$36","v":0.71888545430150341},null,{"$f":"SUM(Z37:AC37)","v":0.99999999999999989}]
[]
["Excess air",null,null,null,null,null,null,null,null,null,null,null,"Excess air","%",{"$f":"C57","v":0},null,null,null,null,{"$f":"U39*(1-0.231)/0.231","v":0},{"$f":"U36*O39","v":0},null,null,"Excess air %",{"$f":"O39","v":0},0,0,0,{"$f":"T39*'Cp calculations  (3)'!H11","v":0},{"$f":"Y39*AD36","v":0}]
[null,null,null,null,null,null,null,null,null,null,null,null,"Weight of FG with Xs air",null,null,null,{"$f":"Q36","v":2.7095835212488995},{"$f":"R36","v":2.1253493533810555},{"$f":"S36","v":0},{"$f":"T36+T39","v":12.864032287414576},{"$f":"U39","v":0},null,{"$f":"SUM(Q40:U40)","v":17.69896516204453},"Volume of FG with Xs air",null,{"$f":"Z36 +Z39","v":23.290101994007586},{"$f":"AA36 +AA39","v":44.655951413817505},{"$f":"AB36 +AB39","v":0},{"$f":"AC36 +AC39","v":173.75632182500686},{"$f":"AD39","v":0},{"$f":"SUM(Z40:AD40)","v":241.70237523283197}]
[null,null,null,null,null,null,null,null,null,null,null,null,"Weight % - wet","%",null,null,{"$f":"Q40/$W$40","v":0.15309276539283817},{"$f":"R40/$W$40","v":0.1200832553724029},{"$f":"S40/$W$40","v":0},{"$f":"T40/$W$40","v":0.72682397923475894},{"$f":"U40/$W$40","v":0},null,null,"Volume % - wet",null,{"$f":"Z40/$AE$40","v":9.6358597930914919E-2},{"$f":"AA40/$AE$40","v":0.18475594776758156},{"$f":"AB40/$AE$40","v":0},{"$f":"AC40/$AE$40","v":0.71888545430150341},{"$f":"AD40/$AE$40","v":0}]
[null,null,null,null,null,null,null,null,null,null,null,null,"Weight of FG- dry",null,null,null,{"$f":"Q40","v":2.7095835212488995},0,{"$f":"S40","v":0},{"$f":"T40","v":12.864032287414576},{"$f":"U40","v":0},null,{"$f":"SUM(Q42:U42)","v":15.573615808663476},"Volume of FG- dry",null,{"$f":"Z40","v":23.290101994007586},0,{"$f":"AB40","v":0},{"$f":"AC40","v":173.75632182500686},{"$f":"AD40","v":0},{"$f":"SUM(Z42:AD42)","v":197.04642381901445}]
[null,null,null,null,null,null,null,null,null,null,null,null,"Weight % - dry","%",null,null,{"$f":"Q42/$W$42","v":0.17398551206981619},{"$f":"R42/$W$42","v":0},{"$f":"S42/$W$42","v":0},{"$f":"T42/$W$42","v":0.82601448793018373},{"$f":"U42/$W$42","v":0},null,null,"Volume % - dry",null,{"$f":"Z42/$AE$42","v":0.11819601463764375},{"$f":"AA42/$AE$42","v":0},{"$f":"AB42/$AE$42","v":0},{"$f":"AC42/$AE$42","v":0.88180398536235627},{"$f":"AD42/$AE$42","v":0}]
[]
[]
[null,null,null,null,null,null,null,null,null,null,null,null,"fuel sp. Volume ",null,{"$f":"1/O36","v":21.418496391178611},"scf/#",null,null,null,"Air used #s/# fuel",null,{"$f":"U36*(1+O39)/0.231","v":16.698965162044534}]
["Heating value of fuel  - GAS only","Btu/#",{"$f":"L36","v":23081.065532346693}]
[null,"Btu/scf",{"$f":"J36","v":1033.217268552},null," ",null,null,null,null,null,null,null,null,null,null,null,null,null,null,null,null,null,null,null,null,null,null,null,{"$f":"AC40*O36","v":8.1124425660696655}]
["Heating value for mixed gas","Btu/#",{"$f":"C19","v":23081.065532346693}]
[]
[null,null,null,null,null,null,null,null,null,null,null,null,null,null,null,null,null,null,null,null,null,null,null,null,null," "]
["Fuel temperature ","Deg. F",{"$f":"'Data-Results vol mod '!C25","v":0},null,null,null,null,null,null,null,null,null,"#s/ scf of fuel ",null,null,null,{"$f":"Q40*$O$36","v":0.12650671045073286},9.9229624459371418E-2,0,0.600603891723825,0,0,0.82634022663392936]
["Combustion air temperature",{"$f":"B52","v":"Deg. F"},{"$f":"'Data-Results vol mod '!C26","v":0},null,null,null,null,null,null,null,null,null,"Avg Cp/# of gas"]
[null,null,null,null,null,null,null,null,null,null,null,null,null,null,null,null,null,null,null,null," "]
["Flue gas temperature",{"$f":"B52","v":"Deg. F"},{"$f":"'Data-Results vol mod '!C27","v":0}]
[]
["Excess air ","%",{"$f":"'Data-Results vol mod '!C28","v":0}]
[]
["Mass flow of fuel","lbs./hr",1]
["Mass flow of combustion air","lbs./hr",{"$f":"C78*(1+C57)","v":16.698965162044534},null,null,"By vol ht value"]
["Avg. sp. Heat of fuel ","Btu/(#-deg. F)",{"$f":"(P25*'Cp calculations  (3)'!G26+'Calculations vol mod'!P26*'Cp calculations  (3)'!G32+'Calculations vol mod'!P27*'Cp calculations  (3)'!G11+'Calculations vol mod'!P28*'Cp calculations  (3)'!G17+'Calculations vol mod'!P29*'Cp calculations  (3)'!G35+'Calculations vol mod'!P30*'Cp calculations  (3)'!G38+'Calculations vol mod'!P31*'Cp calculations  (3)'!G20+'Calculations vol mod'!P32*'Cp calculations  (3)'!G14+'Calculations vol mod'!P33*'Cp calculations  (3)'!G23+'Calculations vol mod'!P34*'Cp calculations  (3)'!G41+'Calculations vol mod'!P35*'Cp calculations  (3)'!G8)","v":0.66085062346213552}]
["Sensible heat in fuel","Btu/hr",{"$f":"C61*(C52-32)*C59","v":-21.147219950788337},null,null,{"$f":"C62","v":-21.147219950788337},{"$f":"F62/F64","v":-9.1621506473138384E-4}]
["Heat in combustion air","Btu/hr",{"$f":"'Cp calculations  (3)'!Q55*('Calculations vol mod'!C53-32)*C60","v":-128.79979978335206},null,null,{"$f":"C63","v":-128.79979978335206},{"$f":"F63/F64","v":-5.5803229535849232E-3}]
["Heating value (chem heat) of fuel ","Btu/hr",{"$f":"C19","v":23081.065532346693},null,null,{"$f":"C19","v":23081.065532346693}]
["Total heat coming in ","Btu/hr",{"$f":"SUM(C62:C64)","v":22931.118512612553},null,null,{"$f":"SUM(F62:F64)","v":22931.118512612553}]
[]
["Heat in FG",null,null,null,"Avg. ",null,null,"Based on sat temp"]
["Heat in water vapor ","Btu/hr",{"$f":"G9*(K73+(('Cp calculations  (3)'!G21+'Cp calculations  (3)'!G20)/2)*('Calculations vol mod'!C55-212))","v":2179.0479672972228},{"$f":"G9*(970+'Cp calculations  (3)'!G20*('Calculations vol mod'!C55-212))","v":1861.6447034200116},null,{"$f":"C68","v":2179.0479672972228},null,{"$f":"G9*(K73+(('Cp calculations  (3)'!G21+'Cp calculations  (3)'!G20)/2)*('Calculations vol mod'!C55-K74))","v":2245.8719985527573},"Calculations for Water vapor - steam enthalpy etc. ",null,null,"const","power"]
["Heat in CO2","Btu/hr",{"$f":"F9*(('Cp calculations  (3)'!G23+'Cp calculations  (3)'!G24)/2)*('Calculations vol mod'!C55-32)","v":-17.638105097522882},{"$f":"C69","v":-17.638105097522882},null,-17.638105097522882,null,{"$f":"F69","v":-17.638105097522882},"Equation ",null,"Enthalpy",1096.7,1.2999999999999999E-2]
["Heat in N2","Btu/hr",{"$f":"H9*(('Cp calculations  (3)'!G12 + 'Cp calculations  (3)'!G11)/2)*('Calculations vol mod'!C55-32)","v":-100.98086118642294},{"$f":"C70","v":-100.98086118642294},null,-100.98086118642294,null,{"$f":"F70","v":-100.98086118642294}]
["Heat in O2","Btu/hr",{"$f":"I9*(('Cp calculations  (3)'!G9+'Cp calculations  (3)'!G8)/2)*('Calculations vol mod'!C55-32)","v":0},{"$f":"C71","v":0},null,0,null,{"$f":"F71","v":0},"Partial pressure of H2O",null,{"$f":"G13","v":0.18475594776758156},"tam"]
["Heat in SO2","Btu/hr",{"$f":"K9*'Cp calculations  (3)'!G41*('Calculations vol mod'!C55-32)","v":0},{"$f":"C72","v":0},null,0,null,{"$f":"F72","v":0},"Base",null,{"$f":"K71*29.926","v":5.5290064928926457},"inch HG"]
["TOTAL","Btu/hr",{"$f":"SUM(C68:C72)","v":2060.4290010132772},{"$f":"SUM(D68:D72)","v":1743.0257371360658},null,2060.4290010132772,null,{"$f":"SUM(H68:H72)","v":2127.2530322688117},"Enthalpy at saturated  condition",null,{"$f":"L69*K72^M69","v":1121.3527585645638},"Btu/lb of steam"]
[null,null,null,null,null,null,null,null,"Saturation temperature",null,{"$f":"K75*LN(K72) +L76","v":142.62968317408277},"deg. F."]
["Av. Heat ","%",{"$f":"(C65-C73)/C64","v":0.90423422966978229},{"$f":"(C65-D73)/C64","v":0.9179859025911381},{"$f":"AVERAGE(C75:D75)","v":0.91111006613046019},{"$f":"(F65-F73)/F64","v":0.90423422966978229},null,{"$f":"(F65-H73)/F64","v":0.90133904135354603},null,"Coeff",36.009]
[null,null,null,null,null,null,null,null,null,null,null,{"$f":"81.054","v":81.054000000000002}]
["O2 required @ stoich condition","#s/# of fuel ",{"$f":"U36","v":3.8574609524322874}]
["Stoich air required ","#s/# of fuel ",{"$f":"C77/0.231","v":16.698965162044534},null,null,null,null,null,"Equation: steam enthalpy =",null,"const * base^power"]
["Stoich air required ","scf/# of fuel",{"$f":"C78*'Cp calculations  (3)'!M58","v":219.05434048608407},null,null,null,null,null,"Saturation temperature = ",null,"36.009*Ln(base) = 81.054"]
[null,"scf/scf of fuel",{"$f":"C79*O36","v":10.227344463652615}]
[null,null,null,null,null,null,null,null,null,"N59*LN(N56) +N60"]
["Actual air required ","scf/# of fuel",{"$f":"C79*(1+$C$57)","v":219.05434048608407}]
[null,"scf/scf of fuel",{"$f":"C80*(1+$C$57)","v":10.227344463652615}]
[]
[]
["Volume of FG ","scf/# of fuel",{"$f":"J12","v":241.70237523283197}]
[]
["Mass of FG","#s/# of fuel mix",{"$f":"J9","v":17.69896516204453}]
[null,"Scf/scf of gaseous fuel",{"$f":"C86*O36","v":11.2847499104736}]
["Note: The fuel gas composition is in volume %.  The higher hydrocarbons in fuel are treated as same as C4H10 and all other inert gases are treated as N2.",null,null,null,null,null,null,null,null,null,null,null,null,null,null,null,null,null,null,null,null,null,null,null,null,null,{"$f":"12*14*0.6","v":100.8}]
[]
[]
["Combustion air temperature  ",null,null,null,null,null,null,null,null,null,null,null,60,"Deg. F. "]
["% Oxygen in COMBUSTION AIR ",null,null,null,null,null,null,null,null,null,null,null,20.9,"% "]
["% O2 in flue gases (ONLY for combustion with ambient air containing approximately 21% O2) ",null,null,null,null,null,null,null,null,null,null,null," ","%"]
["Calculated value of excess air used. (ONLY for combustion with ambient air containing approximately 21% O2) ",null,null,null,null,null,null,null,null,null,null,null,{"$f":"O39","v":0},"%"]
["% Excess air used for combustion.  (Give this number if O2 in combustion air is higher than approximately 21%.)",null,null,null,null,null,null,null,null,null,null,null,0,"% "]
["Exhaust (flue) gas temperature ",null,null,null,null,null,null,null,null,null,null,null,1400,"Deg. F. "]
["% Excess air used for calculations",null,null,null,null,null,null,null,null,null,null,null,{"$f":"IF(M94>21.1,M97,M96)","v":0},"Deg. F. "]
[]
[]
["©  Developed by: Arvind Thekdi, E3M Inc. "]

{"sheet":"Cp calculations  (3)","index":29,"n_rows":83,"n_cols":18,"rows_kept":83,"cut":false,"hidden":true,"merged":[[22,11,23,11],[25,11,26,11],[28,11,29,11],[49,13,49,17],[34,11,35,11],[37,11,38,11],[40,11,41,11],[31,11,32,11],[19,11,20,11],[7,11,8,11],[10,11,11,11],[13,11,14,11],[16,11,17,11]]}
[]
[null,"Initial Gas temperature (F)",60]
[null,"Final Gas temperature (F)",{"$f":"'Calculations vol mod'!C55","v":0}]
[]
[]
[null,null,null,null,"Cp",null,"Cp","Sp. Vol","Sp. Wt","Sp. Gravity","Cp","Mean CP"]
[null,"Gas","Temp (F)","Temp ®","Btu/(#mole.F)","Mol wt","Btu/(#F)","SCF/#","#/SCF","wrt Air @stp","Btu/SCF","Btu/SCF"]
[null,"Oxygen",{"$f":"C2","v":60},{"$f":"460+C8","v":520},{"$f":"11.515-172/D8^0.5 +1530/D8","v":6.9146087262672413},32,{"$f":"E8/F8","v":0.21608152269585129},{"$f":"378.2/F8","v":11.81875},{"$f":"1/H8","v":8.4611316763617134E-2},{"$f":"I8/0.0763","v":1.1089294464432127},{"$f":"G8/H8","v":1.82829421635834E-2},{"$f":"(K8+K9)/2","v":1.8159907895190751E-2}]
[null,"Oxygen",{"$f":"C3","v":0},{"$f":"460+C9","v":460},{"$f":"11.515-172/D9^0.5 +1530/D9","v":6.8215456056550403},32,{"$f":"E9/F9","v":0.21317330017672001},{"$f":"378.2/F9","v":11.81875},{"$f":"1/H9","v":8.4611316763617134E-2},{"$f":"I9/0.0763","v":1.1089294464432127},{"$f":"G9/H9","v":1.8036873626798098E-2},null,null,{"$f":"G9/G8","v":0.98654108651749561}]
[]
[null,"Nitrogen",{"$f":"C8","v":60},{"$f":"460+C11","v":520},{"$f":"9.47-3.47*10^3/D11 +1.07*10^6/D11^2","v":6.7540236686390536},28,{"$f":"E11/F11","v":0.24121513102282335},{"$f":"378.2/F11","v":13.507142857142856},{"$f":"1/H11","v":7.4034902168164995E-2},{"$f":"I11/0.0763","v":0.97031326563781117},{"$f":"G11/H11","v":1.7858338626755829E-2},{"$f":"(K11+K12)/2","v":1.8161364599176031E-2}]
[null,"Nitrogen",{"$f":"C9","v":0},{"$f":"460+C12","v":460},{"$f":"9.47-3.47*10^3/D12 +1.07*10^6/D12^2","v":6.9832325141776943},28,{"$f":"E12/F12","v":0.24940116122063194},{"$f":"378.2/F12","v":13.507142857142856},{"$f":"1/H12","v":7.4034902168164995E-2},{"$f":"I12/0.0763","v":0.97031326563781117},{"$f":"G12/H12","v":1.8464390571596233E-2},null,null,{"$f":"G12/G11","v":1.0339366364087419}]
[]
[null,"Carbon Monoxide",{"$f":"C11","v":60},{"$f":"460+C14","v":520},{"$f":"9.46-3.29*10^3/D14+1.07*10^6/D14^2","v":7.0901775147929005},28,{"$f":"E14/F14","v":0.25322062552831787},{"$f":"378.2/F14","v":13.507142857142856},{"$f":"1/H14","v":7.4034902168164995E-2},{"$f":"I14/0.0763","v":0.97031326563781117},{"$f":"G14/H14","v":1.8747164237950559E-2},{"$f":"(K14+K15)/2","v":1.9109881513480545E-2}]
[null,"Carbon Monoxide",{"$f":"C12","v":0},{"$f":"460+C15","v":460},{"$f":"9.46-3.29*10^3/D15+1.07*10^6/D15^2","v":7.3645368620037814},28,{"$f":"E15/F15","v":0.26301917364299221},{"$f":"378.2/F15","v":13.507142857142856},{"$f":"1/H15","v":7.4034902168164995E-2},{"$f":"I15/0.0763","v":0.97031326563781117},{"$f":"G15/H15","v":1.9472598789010531E-2},null,null,{"$f":"G15/G14","v":1.0386956950849904}]
[]
[null,"Hydrogen",{"$f":"C14","v":60},{"$f":"460+C17","v":520},{"$f":"5.76+0.578*D17/10^3+20/D17^0.5","v":6.9376180193070294},2,{"$f":"E17/F17","v":3.4688090096535147},{"$f":"378.2/F17","v":189.1},{"$f":"1/H17","v":5.2882072977260709E-3},{"$f":"I17/0.0763","v":6.9308090402700792E-2},{"$f":"G17/H17","v":1.8343781119267662E-2},{"$f":"(K17+K18)/2","v":1.8371235890464493E-2}]
[null,"Hydrogen",{"$f":"C15","v":0},{"$f":"460+C18","v":460},{"$f":"5.76+0.578*D18/10^3+20/D18^0.5","v":6.9583848082403135},2,{"$f":"E18/F18","v":3.4791924041201567},{"$f":"378.2/F18","v":189.1},{"$f":"1/H18","v":5.2882072977260709E-3},{"$f":"I18/0.0763","v":6.9308090402700792E-2},{"$f":"G18/H18","v":1.8398690661661325E-2},null,null,{"$f":"G18/G17","v":1.002993360094991}]
[]
[null,"Water vapor (H2O)",{"$f":"140","v":140},{"$f":"460+C20","v":600},{"$f":"19.86-597/D20^0.5+7500/D20","v":7.9875770593073767},18,{"$f":"E20/F20","v":0.44375428107263204},{"$f":"378.2/F20","v":21.011111111111109},{"$f":"1/H20","v":4.7593865679534643E-2},{"$f":"I20/0.0763","v":0.62377281362430714},{"$f":"G20/H20","v":2.1119981648089311E-2},{"$f":"(K20+K21)/2","v":2.1571465308594613E-2},null," "]
[null,"Water vapor (H2O)",{"$f":"C18","v":0},{"$f":"460+C21","v":460},{"$f":"19.86-597/D21^0.5+7500/D21","v":8.3290793001135874},18,{"$f":"E21/F21","v":0.46272662778408818},{"$f":"378.2/F21","v":21.011111111111109},{"$f":"1/H21","v":4.7593865679534643E-2},{"$f":"I21/0.0763","v":0.62377281362430714},{"$f":"G21/H21","v":2.2022948969099915E-2},null,null,{"$f":"G21/G20","v":1.0427541716681508}]
[]
[null,"Carbon Dioxide",{"$f":"C20","v":140},{"$f":"460+C23","v":600},{"$f":"16.2-6.53*10^3/D23+1.41*10^6/D23^2","v":9.2333333333333325},44,{"$f":"E23/F23","v":0.20984848484848484},{"$f":"378.2/F23","v":8.5954545454545457},{"$f":"1/H23","v":0.11634056054997356},{"$f":"I23/0.0763","v":1.5247779888594175},{"$f":"G23/H23","v":2.4413890357835359E-2},{"$f":"(K23+K24)/2","v":2.3666310454089394E-2}]
[null,"Carbon Dioxide",{"$f":"C21","v":0},{"$f":"460+C24","v":460},{"$f":"16.2-6.53*10^3/D24+1.41*10^6/D24^2","v":8.6678638941398862},44,{"$f":"E24/F24","v":0.19699690668499742},{"$f":"378.2/F24","v":8.5954545454545457},{"$f":"1/H24","v":0.11634056054997356},{"$f":"I24/0.0763","v":1.5247779888594175},{"$f":"G24/H24","v":2.2918730550343432E-2},null,null,{"$f":"G24/G23","v":0.93875782247002382}]
[]
[null,"Methane - CH4",{"$f":"C23","v":140},{"$f":"460+C26","v":600},{"$f":"4.23+0.01177*D26","v":11.292},16,{"$f":"E26/F26","v":0.70574999999999999},{"$f":"378.2/F26","v":23.637499999999999},{"$f":"1/H26","v":4.2305658381808567E-2},{"$f":"I26/0.0763","v":0.55446472322160634},{"$f":"G26/H26","v":2.9857218402961398E-2},{"$f":"(K26+K27)/2","v":2.767874140666314E-2}]
[null,"Methane - CH4",{"$f":"C24","v":0},{"$f":"460+C27","v":460},{"$f":"4.23+0.01177*D27","v":9.6441999999999997},16,{"$f":"E27/F27","v":0.60276249999999998},{"$f":"378.2/F27","v":23.637499999999999},{"$f":"1/H27","v":4.2305658381808567E-2},{"$f":"I27/0.0763","v":0.55446472322160634},{"$f":"G27/H27","v":2.5500264410364886E-2},null,null,{"$f":"G27/G26","v":0.85407368048175702}]
[]
[null,"Ethylene C2H4",{"$f":"C26","v":140},{"$f":"460+C29","v":600},{"$f":"4.52+0.00737*D29","v":8.9420000000000002},28,{"$f":"E29/F29","v":0.31935714285714284},{"$f":"378.2/F29","v":13.507142857142856},{"$f":"1/H29","v":7.4034902168164995E-2},{"$f":"I29/0.0763","v":0.97031326563781117},{"$f":"G29/H29","v":2.3643574828133264E-2},{"$f":"(K29+K30)/2","v":2.2279481755684824E-2}]
[null,"Ethylene C2H4",{"$f":"C27","v":0},{"$f":"460+C30","v":460},{"$f":"4.52+0.00737*D30","v":7.9101999999999997},28,{"$f":"E30/F30","v":0.28250714285714285},{"$f":"378.2/F30","v":13.507142857142856},{"$f":"1/H30","v":7.4034902168164995E-2},{"$f":"I30/0.0763","v":0.97031326563781117},{"$f":"G30/H30","v":2.0915388683236384E-2},null,null,{"$f":"G30/G29","v":0.88461194363677031}]
[]
[null,"Ethane C2H6",{"$f":"C29","v":140},{"$f":"460+C32","v":600},{"$f":"4.04+0.01636*D32","v":13.855999999999998},30,{"$f":"E32/F32","v":0.46186666666666659},{"$f":"378.2/F32","v":12.606666666666666},{"$f":"1/H32","v":7.9323109465891065E-2},{"$f":"I32/0.0763","v":1.0396213560405119},{"$f":"G32/H32","v":3.6636700158646215E-2},{"$f":"(K32+K33)/2","v":3.3608672659968267E-2}]
[null,"Ethane C2H6",{"$f":"C30","v":0},{"$f":"460+C33","v":460},{"$f":"4.04+0.01636*D33","v":11.5656},30,{"$f":"E33/F33","v":0.38551999999999997},{"$f":"378.2/F33","v":12.606666666666666},{"$f":"1/H33","v":7.9323109465891065E-2},{"$f":"I33/0.0763","v":1.0396213560405119},{"$f":"G33/H33","v":3.0580645161290321E-2},null,null,{"$f":"G33/G32","v":0.83469976905311782}]
[]
[null,"Propane C3H8",{"$f":"C32","v":140},{"$f":"460+C35","v":600}," ",44,0.38800000000000001,{"$f":"378.2/F35","v":8.5954545454545457},{"$f":"1/H35","v":0.11634056054997356},{"$f":"I35/0.0763","v":1.5247779888594175},{"$f":"G35/H35","v":4.5140137493389743E-2},{"$f":"(K35+K36)/2","v":{"$error":"#VALUE!"}}]
[null,"Propane C3H8",{"$f":"C33","v":0},{"$f":"460+C36","v":460}," ",44,{"$f":"E36/F36","v":{"$error":"#VALUE!"}},{"$f":"378.2/F36","v":8.5954545454545457},{"$f":"1/H36","v":0.11634056054997356},{"$f":"I36/0.0763","v":1.5247779888594175},{"$f":"G36/H36","v":{"$error":"#VALUE!"}}]
[]
[null,"Butane C4H10",{"$f":"C35","v":140},{"$f":"460+C38","v":600}," ",58,0.38200000000000001,{"$f":"378.2/F38","v":6.5206896551724132},{"$f":"1/H38","v":0.15335801163405607},{"$f":"I38/0.0763","v":2.0099346216783234},{"$f":"G38/H38","v":5.8582760444209417E-2},{"$f":"(K38+K39)/2","v":{"$error":"#VALUE!"}}]
[null,"Butane C4H10",{"$f":"C36","v":0},{"$f":"460+C39","v":460}," ",58,{"$f":"E39/F39","v":{"$error":"#VALUE!"}},{"$f":"378.2/F39","v":6.5206896551724132},{"$f":"1/H39","v":0.15335801163405607},{"$f":"I39/0.0763","v":2.0099346216783234},{"$f":"G39/H39","v":{"$error":"#VALUE!"}}]
[]
[null,"Sulfur Dioxide",{"$f":"C38","v":140},{"$f":"460+C41","v":600}," ",64,0.27300000000000002,{"$f":"378.2/F41","v":5.9093749999999998},{"$f":"1/H41","v":0.16922263352723427},{"$f":"I41/0.0763","v":2.2178588928864253},{"$f":"G41/H41","v":4.6197778952934962E-2},{"$f":"(K41+K42)/2","v":{"$error":"#VALUE!"}}]
[null,"Sulfur Dioxide",{"$f":"C39","v":0},{"$f":"460+C42","v":460}," ",64,{"$f":"E42/F42","v":{"$error":"#VALUE!"}},{"$f":"378.2/F42","v":5.9093749999999998},{"$f":"1/H42","v":0.16922263352723427},{"$f":"I42/0.0763","v":2.2178588928864253},{"$f":"G42/H42","v":{"$error":"#VALUE!"}}]
[]
[null,"Air",{"$f":"C2","v":60},null,null,null,{"$f":"J52*G8+(1-J52)*G11","v":0.2354199130627195}]
[null,null,{"$f":"C3","v":0},null,null,null,{"$f":"J52*G9+(1-J52)*G12","v":0.24104786995236152}]
[null,"Comb air",{"$f":"'Calculations vol mod'!C53","v":0},null,null,null,{"$f":"G83","v":0.23548139090679829}]
[]
[null,"Source - Gas Engineers Handbook "]
[]
[null,"For Air at 60 F., 80% Humidity ",null,null,null,null,null,null,null,null,null,null,null,"Specific Heat (Btu/[F-#])for Comb. Air"]
[null,"Composition of gas mixture ","% Vol","% mass","Mean CP Btu/scf","Cp-60 F","Cp 1000F",null,"mass","% mass",null,"Ratio","sp. Vol scf/#","By mass","Cp fraction","Temp (R)","Cp Btu/(#F)"]
[null,"Oxygen ",20.7,null,{"$f":"L8","v":1.8159907895190751E-2},{"$f":"K8","v":1.82829421635834E-2},{"$f":"K9","v":1.8036873626798098E-2},null,{"$f":"C52*I8","v":1.7514542570068745},{"$f":"I52/I58","v":0.23057644110275691},null,"Ratio",{"$f":"J52*H8","v":2.7251253132832081},0.23100000000000001,{"$f":"N52*(G8+G9)/2","v":4.9578932041781994E-2},{"$f":"'Calculations vol mod'!C53 +460","v":460},{"$f":"N52*(11.515-172/P52^0.5 +1530/P52)/32","v":4.9243032340822328E-2},"O2 in air"]
[null,"Carbon Dioxide",0,null,{"$f":"L23","v":2.3666310454089394E-2},{"$f":"K23","v":2.4413890357835359E-2},{"$f":"K24","v":2.2918730550343432E-2}]
[null,"Nitrogen & Other",78.3,null,{"$f":"L11","v":1.8161364599176031E-2},{"$f":"K11","v":1.7858338626755829E-2},{"$f":"K12","v":1.8464390571596233E-2},null,{"$f":"C54*I11","v":5.7969328397673188},{"$f":"I54/I58","v":0.76315789473684215},null,{"$f":"(J54+J55)/J52","v":3.3369565217391304},{"$f":"(1-J52)*H11","v":10.392713927676333},{"$f":"1-N52","v":0.76900000000000002},{"$f":"N54*(G11+G12)/2","v":0.18864196436760855},{"$f":"P52","v":460},{"$f":"N54*(9.47-3.47*10^3/P54 +1.07*10^6/P54^2)/28","v":0.19178949297866596},"N2 in air"]
[null,"Water vapor",1,null,{"$f":"L20","v":2.1571465308594613E-2},{"$f":"K20","v":2.1119981648089311E-2},{"$f":"K21","v":2.2022948969099915E-2},null,{"$f":"C55*I20","v":4.7593865679534643E-2},{"$f":"I55/I58","v":6.2656641604010039E-3},null,null,null,"Total ",{"$f":"O52+O54","v":0.23822089640939054},null,{"$f":"SUM(Q52:Q54)","v":0.24103252531948829}]
[]
[null,"Total",{"$f":"SUM(C52:C56)","v":100}]
[null,"Mean value",null,null,{"$f":"($C$52*E52+$C$53*E53+$C$54*E54+$C$55*E55)/100","v":1.8195164068545263E-2},{"$f":"($C$52*F52+$C$53*F53+$C$54*F54+$C$55*F55)/100","v":1.7978847989092474E-2},{"$f":"($C$52*G52+$C$53*G53+$C$54*G54+$C$55*G55)/100","v":1.8411480147998052E-2},null,{"$f":"SUM(I52:I55)","v":7.5959809624537273},null,null,null,{"$f":"M52+M54","v":13.11783924095954}]
[]
[null,null,null,null,null,"B",{"$f":"(G58-F58)/(1000-60)","v":4.6024697755912597E-7}]
[null,null,null,null,null,"A",{"$f":"G58-G60*1000","v":1.7951233170438927E-2}]
[]
[null,null,null,null,"cp for air"]
[null,null,null,null,"Temp","Cp (Btu/scf)"]
[null,null,null,null,60,{"$f":"$G$61+$G$60*E65","v":1.7978847989092474E-2},{"$f":"F65*M58","v":0.23584363765856378}]
[null,null,null,null,100,1.7997257868194842E-2,0]
[null,null,null,null,{"$f":"100+E66","v":200},1.8043282565950752E-2,0]
[null,null,null,null,300,1.8089307263706667E-2,0]
[null,null,null,null,400,1.8135331961462577E-2,0]
[null,null,null,null,500,1.8181356659218492E-2,0]
[null,null,null,null,600,1.8227381356974402E-2,0]
[null,null,null,null,700,1.8273406054730316E-2,0]
[null,null,null,null,800,1.8319430752486227E-2,0]
[null,null,null,null,900,1.8365455450242141E-2,0]
[null,null,null,null,1000,1.8411480147998052E-2,0]
[null,null,null,null,1100,1.8457504845753966E-2,0]
[null,null,null,null,1200,1.8503529543509877E-2,0]
[null,null,null,null,1300,1.8549554241265791E-2,0]
[null,null,null,null,1400,1.8595578939021702E-2,0]
[null,null,null,null,1500,1.8641603636777616E-2,0]
[null,null,null,null,1600,1.8687628334533531E-2,0]
[null,null,null,null,null,null,"Btu/#"]
[null,null,null,"Cob air temp",{"$f":"'Calculations vol mod'!C53","v":0},{"$f":"$G$61+$G$60*E83","v":1.7951233170438927E-2},{"$f":"F83*M58","v":0.23548139090679829}]

{"sheet":"radiation_vf","index":30,"n_rows":26,"n_cols":19,"rows_kept":26,"cut":false,"hidden":false,"merged":[[1,1,1,11]]}
[]
[null,"Read View Factor From Chart Using Opening Type and Ratio",null,null,null,null,null,null,null,null,null,null,null,null,null,"English"]
[]
[null,null,null,null,null,null,null,null,null,null,null,null,null,null,null,"Return to Openings Data Sheet",null,null,"Return to Openings Data Sheet"]
[]
[]
[]
[null,null,null,null,null,null,null,null,null,null,null,null,null,null,null," "]
[]
[]
[null,null,null,null,null,null,null,null,null,null,null,null,null,"For Rectangular Opening"]
[null,null,null,null,null,null,null,null,null,null,null,null,null,"Opening length (Inch)"]
[null,null,null,null,null,null,null,null,null,null,null,null,null,"Thickness (Inch)"]
[null,null,null,null,null,null,null,null,null,null,null,null,null,"Opening width (Inch) "]
[null,null,null,null,null,null,null,null,null,null,null,null,null,"Value of X axis ",{"$f":"IFERROR(MIN(O12/O13,O14/O13),\"-\")","v":"-"}]
[]
[null,null,null,null,null,null,null,null,null,null,null,null,null,"View factor "]
[]
[]
[]
[null,null,null,null,null,null,null,null,null,null,null,null,null,"For Cylindrical Opening"]
[null,null,null,null,null,null,null,null,null,null,null,null,null,"Diameter (Inch)"]
[null,null,null,null,null,null,null,null,null,null,null,null,null,"Thickness (Inch)"]
[null,null,null,null,null,null,null,null,null,null,null,null,null,"Value of X axis ",{"$f":"IFERROR(O22/O23,\"-\")","v":"-"}]
[]
[null,null,null,null,null,null,null,null,null,null,null,null,null,"View factor "]

{"sheet":"unit conversion","index":31,"n_rows":148,"n_cols":14,"rows_kept":148,"cut":false,"hidden":true,"merged":[]}
[]
[null,null,{"$f":"C6*C4","v":16.02},{"$f":"D4*D6","v":1.0467500000000001},{"$f":"E4*E6","v":186.08},{"$f":"F4*F6","v":2.5122},{"$f":"(G6-32)/1.8","v":100},{"$f":"(H6-32)/1.8","v":732.22222222222217},{"$f":"I4*I6","v":628.02},{"$f":"J4*J6","v":418.68},{"$f":"K4*K6","v":1116.48},{"$f":"L4*L6","v":1118.806},null,{"$f":"N4*N6","v":0.99978423999999999}]
[null,"Composition","Density (kg/m^3)","MeanSpecific Heat of solid (kJ/(kg oC) ","LatentHeatOf Fusion kJ/kg","MeanSpecific HeatOf Liquid (kJ/(kg oC) ","MeltingPoint (Deg. C.)","Average Pouring Temp (Deg. C)","HtContentOf Solid At MeltingPoint (kJ/kg)","HtContentOf LiquidAt MeltingTemp (kJ/kg)","HtContentOf LiquidAt PouringTemp (kJ/kg)","HtContentOf LiquidAt PouringTemp (kJ/kg)",null,"kCal "]
[null,"Conversion Factor ",{"$f":"16.02","v":16.02},4.1870000000000003,2.3260000000000001,{"$f":"D4","v":4.1870000000000003},"C=(F-32)/1.8","C=(F-32)/1.8",2.3260000000000001,{"$f":"I4","v":2.3260000000000001},{"$f":"J4","v":2.3260000000000001},{"$f":"K4","v":2.3260000000000001},null,0.23884]
[null,"To convert these units to ","Density (#s/ft^3)","MeanSpecificHeat (Btu/(# F) ","LatentHeatOfFusion Btu/#","MeanSpecificHeatOfLiquid (Btu/# F)","MeltingPoint (Deg. F.)","AveragePouringTemp (Deg. F.)","HtContentOfSolidAtMeltingPoint (Btu/#)","HtContentOfLiquidAtMeltingTemp (Btu/#)","HtContentOfLiquidAtPouringTemp (Btu/#)","HtContentOfLiquidAtPouringTemp (Btu/#)",null,"kJ"]
[null,null,1,0.25,80,0.6,212,1350,270,180,480,481,null,4.1859999999999999]
[]
[]
[]
[]
[]
[]
[]
[]
[]
[]
[]
[]
[]
[]
[]
[]
[]
[]
[]
[]
[]
[]
[]
[]
[]
[]
[]
[]
[]
[]
[]
[]
[]
[]
[]
[null,null,null,null,null,null,null,"Use kJ"]
[]
[]
[]
[]
[]
[]
[]
[]
[]
[]
[]
[]
[]
[]
[]
[]
[]
[]
[]
[]
[]
[]
[]
[]
[53,"Wall Losses",null,"Surface Area (Ft2)","Ft2","Surface Area (m2)","m2"]
[54,"Wall Losses",null,"Surface Temp. (Degree F)","F","Surface Temp. (Celcius)","C"]
[55,"Wall Losses",null,"Ambient Temp. (Degree F)","F","Ambient Temp. (Celcius)","C"]
[56,"Wall Losses",null,"Heat Required (Btu/hr)","Btu/hr","Heat Required (kJ/hr)","kJ/hr"]
[57,"Wall Losses",null,"Current Net Heat (Btu/hr)","Btu/hr","Current Net Heat (kJ/hr)","kJ/hr"]
[58,"Wall Losses",null,"Modified Net Heat (Btu/hr)","Btu/hr","Modified Net Heat (kJ/hr)","kJ/hr"]
[59,"Openings",null,"Furnace Wall Thickness (inches)","in","Furnace Wall Thickness (mm)","mm"]
[60,"Openings",null,"Diameter of Openings (inches)","in","Diameter of Openings (mm)","mm"]
[61,"Openings",null,"Total Opening Area (Ft2)","Ft2","Total Opening Area (m2)","m2"]
[62,"Openings",null,"Inside Temp. (Degree F)","F","Indise Temp.(Celcius)","C"]
[63,"Openings",null,"Outside or Ambient Temp. (Degree F)","F","Outside or Ambient Temp. (Celcius)","C"]
[64,"Openings",null,"Heat Required (Btu/hr)","Btu/hr","Heat Required (kJ/hr)","kJ/hr"]
[65,"Openings",null,"Current Net Heat (Btu/hr)","Btu/hr","Current Net Heat (kJ/hr)","kJ/hr"]
[66,"Openings",null,"Modified Net Heat (Btu/hr)","Btu/hr","Modified Net Heat (kJ/hr)","kJ/hr"]
[]
[]
[]
[]
[]
[67,"Other Losses",null,"Approx Area (Ft2)","Ft2","Approx, Area (m2)","m2"]
[68,"Other Losses",null,"Average Temp. (Degree F)","F","Average Temp. (Celcius)","C"]
[69,"Other Losses",null,"Ambient Temp. (Degree F)","F","Ambient Temp. (Celcius)","C"]
[70,"Other Losses",null,"Additional Losses (Btu/hr)","Btu/hr","Additional Losses (kJ/hr)","kJ/hr"]
[71,"Other Losses",null,"Heat Required (Btu/hr)","Btu/hr","Heat Required (kJ/hr)","kJ/hr"]
[72,"Other Losses",null,"Current Net Heat (Btu/hr)","Btu/hr","Current Net Heat (kJ/hr)","kJ/hr"]
[73,"Other Losses",null,"Modified Net Heat (Btu/hr)","Btu/hr","Modified Net Heat (kJ/hr)","kJ/hr"]
[]
[]
[]
[]
[]
[]
[74,"Flue Gas Losses Heating System Efficiency","Fuel Air Fired Heating","Furnace Flue Gas Temp. (Degree F)","F","Furnace Flue Gas Temp. (Celcius)","C"]
[75,"Flue Gas Losses Heating System Efficiency","Fuel Air Fired Heating","Oxygen in Flue Gases (%)","%","Oxygen ing Flue Gases (%)","%"]
[76,"Flue Gas Losses Heating System Efficiency","Fuel Air Fired Heating","Excess Air (%)","%","Excess Air (%)","%"]
[77,"Flue Gas Losses Heating System Efficiency","Fuel Air Fired Heating","Combution Air Temp. (Degree F)","F","Combution Air Temp. (Celcius)","C"]
[78,"Flue Gas Losses Heating System Efficiency","Fuel Air Fired Heating","Available Heat (%)","%","Available Heat (%)","%"]
[79,"Flue Gas Losses Heating System Efficiency","Fuel Air Fired Heating","Available Heat User Defined (%)","%","Available Heat User Defined (%)","%"]
[80,"Flue Gas Losses Heating System Efficiency","Fuel Air Fired Heating","Gross Heat (Btu/hr)","Btu/hr","Gross Heat (kJ/hr)","kJ/hr"]
[81,"Flue Gas Losses Heating System Efficiency","Fuel Air Fired Heating","Furnace Heat Storage Gross Heat Input (Btu)","Btu","Furnace Heat Storage Gross Heat Input (kJ)","kJ"]
[82,"Flue Gas Losses Heating System Efficiency","Fuel Air Fired Heating","Current Net Heat (Btu/hr)","Btu/hr","Current Net Heat (kJ/hr)","kJ/hr"]
[83,"Flue Gas Losses Heating System Efficiency","Fuel Air Fired Heating","Modified Net Heat (Btu/hr)","Btu/hr","Modified Net Heat (kJ/hr)","kJ/hr"]
[]
[]
[]
[]
[]
[84,"Flue Gas Losses Heating System Efficiency","Electrical Heating","Furnace Temp. (Degree F)","F","Furnace Temp. (Celcius)","C"]
[85,"Flue Gas Losses Heating System Efficiency","Electrical Heating","Electrical Heating System Efficiency (%)","%","Electrical Heating System Efficiency (%)","%"]
[86,"Flue Gas Losses Heating System Efficiency","Electrical Heating","Gross Heat (Btu/hr)","Btu/hr","Gross Heat (kJ/hr)","kJ/hr"]
[87,"Flue Gas Losses Heating System Efficiency","Electrical Heating","Gross Electrical Power Required (kWh)","kWh","Gross Electrical Power Required (kWh)","kWh","Should we change the word to energy?"]
[88,"Flue Gas Losses Heating System Efficiency","Electrical Heating","Furnace Heat Storage Gross Heat Input (Btu)","Btu","Furnace Heat Storage Gross Heat Input (kJ)","kJ"]
[89,"Flue Gas Losses Heating System Efficiency","Electrical Heating","Current Net Heat (Btu/hr)","Btu/hr","Current Net Heat (kJ/hr)","kJ/hr"]
[90,"Flue Gas Losses Heating System Efficiency","Electrical Heating","Modified Net Heat (Btu/hr)","Btu/hr","Modified Net Heat (kJ/hr)","kJ/hr"]
[]
[]
[]
[]
[91,"Flue Gas Losses Heating System Efficiency","Steam Heating","Furnace/Oven Temp. (Degree F)","F","Furnace/Oven Temp. (Celcius)","C"]
[92,"Flue Gas Losses Heating System Efficiency","Steam Heating","Steam Heating System Efficiency (%)","%","Steam Heating System Efficiency (%)","%"]
[93,"Flue Gas Losses Heating System Efficiency","Steam Heating","Gross Heat (Btu/hr)","Btu/hr","Gross Heat (kJ/hr)","kJ/hr"]
[94,"Flue Gas Losses Heating System Efficiency","Steam Heating","Furnace Heat Storage Gross Heat Input (Btu)","Btu","Furnace Heat Storage Gross Heat Input (kJ)","kJ"]
[95,"Flue Gas Losses Heating System Efficiency","Steam Heating","Current Net Heat (Btu/hr)","Btu/hr","Current Net Heat (kJ/hr)","kJ/hr"]
[96,"Flue Gas Losses Heating System Efficiency","Steam Heating","Modified Net Heat (Btu/hr)","Btu/hr","Modified Net Heat (kJ/hr)","kJ/hr"]
[]
[97,"Flue Gas Losses Heating System Efficiency","Source of Data information","1000 F","F","540 C","C","Note"]
[]
[]
[]
[98,"Heat Storage",null,"Heat Storage (Btu)","Btu","Heat Storage(kJ)","kJ"]
[99,"Heat Storage",null,"Theoretical Heat Loss (Btu/hr)","Btu/hr","Theoretical Heat Loss (kJ/hr)","kJ/hr"]
[100,"Heat Storage",null,"Current Net Heat (Btu/hr)","Btu/hr","Current Net Heat (kJ/hr)","kJ/hr"]
[101,"Heat Storage",null,"Modified Net Heat (Btu/hr)","Btu/hr","Modified Net Heat (kJ/hr)","kJ/hr"]
[]
[]
[]
[]
[102,"Furnace Summary Dialogue Box",null,"Net Heat (Btu/hr)","Btu/hr","Net Heat (kJ/hr)","kJ/hr"]
[103,"Furnace Summary Dialogue Box",null,"Gross Heat (Btu/hr)","Btu/hr","Gross Heat (kJ/hr)","kJ/hr"]
[104,"Furnace Summary Dialogue Box",null,"Energy Used (Btu/Lb.)","Btu/Lb.","Energy Used (kJ/kg)","kJ/kg"]
[105,"Furnace Summary Dialogue Box",null,"Energy Used (KWH/Lb.)","KWH/lb","Energy Used (kJ/kg)","kJ/kg"]
[106,"Furnace Summary Dialogue Box",null,"Thermal Efficiency (%)","%","Thermal Efficiency (%)","%"]

{"sheet":"Help Chg Solid","index":32,"n_rows":29,"n_cols":3,"rows_kept":29,"cut":false,"hidden":false,"merged":[[2,1,2,2],[1,0,17,0],[22,1,26,1],[28,1,28,2],[20,1,21,2]]}
[null,"Load/Charge Material - Solid "]
[null,"Type of Material","Select material from the drop down list.  The material properties cells below this will be filled in if the material is selected from the list. If it is different from the material listed, the select Other "]
[null,"If other is selected then enter  following data "]
[null,"Average specific heat ","Give average value of the specific heat for the temperature range of the material inlet temperature and outlet temperature"]
[null,"Latent heat of fusion","Latent heat of melting or fusion or phase change for the solid material "]
[null,"specific heat of liquid from the molten material ","Give  specific heat value for the liquid at the temperature range of the  melting temperature and final temperature (discharge temperature) material."]
[null,"Melting point ","Temperature of melting for the solid material "]
[null,"Charge (wet)-Feed Rate (lbs./hr)","Weight of material charged per hour. Use total weight including moisture in the charge material. Note that for batch furnaces the total weight should be corrected for cycle time to obtain weight per hour value."]
[null,"Water Content as Charged (%)","Water content of the charge material as percentage of total charge weight - wet basis. This value can be obtained from moisture tests or specifications for the material charged."]
[null,"Water Content as Discharged (%)","Water content of the discharged material as percentage of total discharged weight - wet basis. This value can be obtained from moisture tests or specifications for the material discharged."]
[null,"Initial Temp. (Deg. F.)","Inlet temperature for the charge material. Use production data or actual measurement."]
[null,"Water Discharge Temp. (Deg. F.)","Temperature of water vapor (usually mixed with exhaust air or flue gases) as it is discharged form the furnace/oven."]
[null,"Charge material discharge Temp. (Deg. F.)","Discharge temperature for the material as it is discharged from the furnace or oven. Use production data or actual measurement."]
[null,"Charge Melted (% of Charge)","Charge material melted (as % of solid material charged). Use value or data from process/production engineering or measurement of the final product."]
[null,"Charge Reacted (% of Dry)","Charge material (as % of dry material) reacted. Use value or data from process/production engineering or measurement of the final product."]
[null,"Heat of Reaction (Btu/lb.)","Insert value of heat of reaction when chemical or metallurgical reactions are involved during heating. "]
[null,"Type of reaction: Endothermic - Exothermic","Type of reaction.  Select from the drop down menu and select endothermic or exothermic.  Use positive number (+ve)  in either one of these cases."]
[null,"Additional Heat Required (Btu/lb.)","Insert value of additional heat required and not accounted for in the above calculations."]
[null,"Heat Required (Btu/lb.)","Heat Required - calculated by using the information given in previous cells."]
[]
[null,"Possible energy saving measues to consider"]
[]
[null,"Charge - load material","Explore possibilities of lowering the final product temperature  "]
[null,null,"Preheating the charge or load material entering the furnace."]
[null,null,"Pre-drying to reduce moisture content of the load entering the furnace"]
[null,null,"Maintain charge feed rate as close to the rated capacity as possible."]
[null,null,"Consider possibility of reducing endothermic reactions by controlling process conditions."]
[]
[null,"Note: These energy saving measures are for guidance only.  Not all measures are applicable under all operating conditions.  There may additional measures when considering specific situations and the user is encouraged to review and apply the appropriate measures."]

{"sheet":"Help Chg Liquid","index":33,"n_rows":27,"n_cols":3,"rows_kept":27,"cut":false,"hidden":false,"merged":[[4,1,4,2],[21,1,24,1],[26,1,26,2],[18,1,20,2]]}
[]
[]
[null,"Load/Charge Material - Liquid"]
[null,"Type of Liquid","Select a liquid from the drop down list.  The material properties cells below the drop down list will be filled in if the liquid is selected from the list. If it is different from the liquids listed, then select Other "]
[null,"If other is selected then enter the following data "]
[null,"Average specific heat ","Give average value of the specific heat for the temperature range of the material inlet temperature and outlet temperature"]
[null,"Vaporizing temperature","Vaporizing temperature of the liquid "]
[null,"Latent heat of vaporization","Latent heat of vaporizing or evaporation for the liquid"]
[null,"Specific heat of vapor generated from the liquid","Give  specific heat value for the vapor resulting from vaporizing of the liquid at the temperature range of the vaporizing  temperature and final temperature (discharge temperature) of the liquid/vapor."]
[null,"Charge (Liquid)-Feed Rate (lbs./hr)","Weight of the liquid charged expressed as (kg/hr or lbs/hr). Note that commonly the liquid feed rates are given in gallons or liter per hour and they should be converted to mass flow rates."]
[null,"Initial Temp. (Deg. F.)","Inlet temperature for the charge material (liquid). Use production data or actual measurement."]
[null,"Discharge Temp. (Deg. F.)","Discharge temperature for the charge material (liquid). Use production data or actual measurement."]
[null,"Charge Liquid Vaporized (% of Charge)","Charge liquid vaporized (% liquid charged) during the heating process. Get the value (data) from process/production engineering or measurement of the final product."]
[null,"Charge Reacted (%)","Charge Liquid Reacted (as % of Liquid Feed)"]
[null,"Heat of Reaction (Btu/lb.)","Insert value of heat of reaction when chemical reaction is involved during heating. "]
[null,"Additional Heat Required (Btu/hr)","Insert value of additional heat required that is not accounted for in the above calculations."]
[null,"Heat Required (Btu/hr.)","Heat Required - calculated by using the information given in previous cells."]
[]
[null,"Possible energy saving measues to consider"]
[]
[]
[null,"Charge - load material","Explore possibilites of lowering the final product temperature  "]
[null,null,"Preheating the charge or load material entering the furnace."]
[null,null,"Maintain charge feed rate as close to the rated capacity as possible."]
[null,null,"Consider possibility of reducing endothermic reactions by controlling process conditions."]
[]
[null,"Note: These energy saving measures are for guidance only.  Not all measures are applicable under all operating conditions.  There may additional measures when considering specific situations and the user is encouraged to review and apply the appropriate measures."]

{"sheet":"Help Chg Gas","index":34,"n_rows":26,"n_cols":3,"rows_kept":26,"cut":false,"hidden":false,"merged":[[5,1,5,2],[20,1,23,1],[25,1,25,2],[18,1,19,2]]}
[]
[]
[null,"Load/Charge Material - Gas"]
[null,"Name","Description"]
[null,"Type of gas (mixture)","Select gas from the drop down list.  The gas properties cell below the drop down list will be filled in if the gas is selected from the list. If it is different from the gas listed, then select Other. "]
[null,"If other is selected then enter the following data "]
[null,"Average specific heat of gas ","Give average value of the specific heat for the temperature range of the gas inlet temperature and outlet temperature."]
[null,"Feed Rate for Gas Mixture (lbs./hr)","Weight of the gas mixture charged expressed as (kg/h or Lbs./hr). Note that commonly the gas mixture feed rates are given in m^3/hr and they should be converted to mass flow rates."]
[null,"Vapor in Gas Mixture (%)","Vapor mixed with the feed gas expressed as % of the total mixture charge weight. Use test data or charge material specifications."]
[null,"Initial Temp. (Deg. F.)","Inlet temperature (Celsius) for the charge (gas-vapor mixture). Use production data or actual measurement."]
[null,"Discharge Temp. (Deg. F.)","Discharge temperature (Celsius) for the charge (gas-vapor mixture). Use production data or actual measurement."]
[null,"Specific Heat of Vapor (Btu/(lb.-F))","Use available data from handbooks or other sources."]
[null,"Feed Gas Reacted (% of Total)","Charge Gas Reacted (as % of DRY Gas Feed)"]
[null,"Heat of Reaction (Btu/lb.)","Insert value of heat of reaction when chemical reaction is involved during heating. "]
[null,"Type of reaction: Endothermic - Exothermic","Type of reaction.  Select from the drop down menu and select endothermic or exothermic.  Use positive number (+ve)  in either one of these cases."]
[null,"Additional Heat Required (Btu/hr)","Insert value of additional heat required that is not accounted for in the above calculations."]
[null,"Heat Required (Btu/hr)","Heat Required - calculated by using the information given in previous cells."]
[]
[null,"Possible energy saving measues to consider"]
[]
[null,"Charge - load material","Explore possibilites of lowering the final product temperature  "]
[null,null,"Preheating the charge or load material entering the furnace."]
[null,null,"Maintain charge feed rate as close to the rated capacity as possible."]
[null,null,"Consider possibility of reducing endothermic reactions by controlling process conditions."]
[]
[null,"Note: These energy saving measures are for guidance only.  Not all measures are applicable under all operating conditions.  There may additional measures when considering specific situations and the user is encouraged to review and apply the appropriate measures."]

{"sheet":"Help Fixtures","index":35,"n_rows":18,"n_cols":3,"rows_kept":18,"cut":false,"hidden":false,"merged":[[13,1,15,1],[17,1,17,2],[11,1,12,2]]}
[]
[null,"Fixtures, &Trays, Baskets etc. Losses"]
[null,"Name","Description"]
[null,"Select Type - material ","Select material from the drop down list. The word fixture is used to represent fixtures, trays, baskets, conveyor belt etc. used for material handling during the heating process.   The material properties cells below this will be filled in if the material is selected from the list. If it is different from the material listed, the select Other "]
[null,"If other is selected then enter the following data "]
[null,"Average specific heat ","Give average value of the specific heat for the temperature range of the material inlet temperature and outlet temperature"]
[null,"Fixture Weight (lbs/hr)","Weight of fixtures in terms of keg or Lbs. per hour. Note that this is based on per hour value. Hence for a batch process the actual weight should be corrected for the cycle time."]
[null,"Initial Temp. (Deg. F.)","Inlet temperature (Celsius) for the fixtures. Use production data or actual measurement using temperature measurement device such as thermocouple or infra-red instrument."]
[null,"Final Temp. (Deg. F.)","Outlet temperature (Celsius) for the fixtures. Use production data or actual measurement using temperature measurement device such as thermocouple or infra-red instrument."]
[null,"Heat Required (Btu/hr)","Heat Required - calculated by using the information given in previous cells."]
[]
[null,"Possible energy saving measues to consider"]
[]
[null,"Fixtures","Review design of fixtures or baskets or other material handling to reduce weight "]
[null,null,"Investigate alternate high strength material to reduce weight of the fixtures etc."]
[null,null,"Where possible reduce cooling of conveyors, belts, fixtures baskets etc. during their return from unloading to loading station. "]
[]
[null,"Note: These energy saving measures are for guidance only.  Not all measures are applicable under all operating conditions.  There may additional measures when considering specific situations and the user is encouraged to review and apply the appropriate measures."]

{"sheet":"Help Atmos Loss","index":36,"n_rows":20,"n_cols":3,"rows_kept":20,"cut":false,"hidden":false,"merged":[[16,1,17,1],[19,1,19,2],[14,1,15,2]]}
[]
[null,"Atmosphere Losses"]
[null,"Name","Description"]
[null,"Name - type of gas","Select gas from the drop down list.  The gas properties cell below the drop down list will be filled in if the gas is selected from the list. If it is different from the gas listed, then select Other "]
[null,"If other is selected then enter the following data "]
[null,"Average specific heat of gas ","Give average value of the specific heat for the temperature range of the gas inlet temperature and outlet temperature"]
[null,"Initial Temp. (Deg. F.)","Inlet temperature (Celsius) of the process atmosphere as it enters the heating equipment or reaction chamber. Use temperature recorder/indicator reading or actual measurement."]
[null,"Final Temp. (Deg. F.)","Outlet temperature (Celsius) of the process atmosphere as it leaves the heating equipment or reaction chamber. Use temperature recorder/indicator reading or actual measurement."]
[null,"Flow Rate (scf/hr)*","Atmosphere flow rate in terms of standard volume flow rate. Note that it is at standard conditions and actual flow values given by a flow meter should be corrected for the pressure-temperature condition at the measurement point. Use readings from a flow meter."]
[]
[null,"Heat Required ((Btu/hr)","Heat Required - calculated by using the information given in previous cells."]
[]
[null,"*scf = standard cubic feet"]
[]
[null,"Possible energy saving measues to consider"]
[]
[null,"Atmosphere Losses","Optimize (minimize) use of process atmosphere flow rate "]
[null,null,"Preheat atmosphere to a higher temperature entering the furnace"]
[]
[null,"Note: These energy saving measures are for guidance only.  Not all measures are applicable under all operating conditions.  There may additional measures when considering specific situations and the user is encouraged to review and apply the appropriate measures."]

{"sheet":"Help Water Cooling","index":37,"n_rows":20,"n_cols":3,"rows_kept":20,"cut":false,"hidden":false,"merged":[[15,1,17,1],[19,1,19,2],[13,1,14,2]]}
[]
[null,"Water/Air- Cooling Losses"]
[null,"Name","Description"]
[null,"Cooling medium","Select water or air from the drop down list.  The data requirement will change accordingly. "]
[null,"Air or Gas Flow (scf/min)*","Air flow rate  (in terms of Nm^3 per minute) entering the air cooled parts. Use flow meter data if available, actual measurement (if possible) or use heating system supplier's specifications as first approximation. Note that this value is for air flow in the selected water cooled section."]
[null,"Water or Liquid Flow (US gallons/min)","Flow rate of water (in terms of liter per minute) entering the water cooled parts. Use flow meter data if available, actual measurement (if possible) or use heating system supplier's specifications as first approximation. Note that this value is for water flow in the selected water cooled section."]
[null,"In Temp. (Deg. F.)","Inlet temperature of water/air as it enters water/air cooled parts. Use temperature recorder/indicator reading or actual measurement using a temperature gage, thermocouple or estimate based on measurements of water temperature at any location in the plant. This is an average value for the selected section if multiple water/air cooled sections are considered."]
[null,"Out Temp. (Deg. F.)","Outlet temperature (Celsius) of water/air as it leaves water/air cooled parts. Use temperature recorder/indicator reading or actual measurement or estimate based on measurements of water temperature at any location downstream before water is mixed with other flows. This is an average value for the selected section if multiple water/air cooled sections are considered."]
[]
[null,"Heat Required ((Btu/hr)","Heat Required - calculated by using the information given in previous cells."]
[]
[null,"*scf = standard cubic feet"]
[]
[null,"Possible energy saving measues to consider"]
[]
[null,"Water/Air cooling","Insulate water or air cooled parts where possible"]
[null,null,"Look for cracks, breaks and erosion of insulation.  Repair and maintain furnace insulation.   "]
[null,null,"Reduce or eliminate use of water cooled components by using high temperature materials for the components where possible."]
[]
[null,"Note: These energy saving measures are for guidance only.  Not all measures are applicable under all operating conditions.  There may additional measures when considering specific situations and the user is encouraged to review and apply the appropriate measures."]

{"sheet":"Help Wall Losses","index":38,"n_rows":20,"n_cols":3,"rows_kept":20,"cut":false,"hidden":false,"merged":[[13,1,17,1],[19,1,19,2],[11,1,12,2]]}
[]
[null,"Wall Losses"]
[null,"Name","Description"]
[null,"Average Surface Temp. (Deg. F.)","Average temperature for the exposed wall surfaces. The average value should be calculated based on actual measurement at several locations for the furnace outside areas. The actual temperatures can vary over a wide range and care should be taken to use weighted average. use infra-red radiation temperature measurement (with proper emissivity correction) whenever possible."]
[null,"Ambient Temp. (Deg. F.)","Temperature of the area where the equipment is located. In some cases it may be necessary to take temperature reading at the bottom or top of the equipment to make sure that the temperature is not much higher than the room-ambient temperature. Use weighted average if the temperature readings vary too much."]
[null,"Wind velocity (miles/hr.)","This is average wind velocity over the entire surface.  For most indoor installation this can be assumed to be zero.  For outdoor installations it is necessary to measure wind velocity or use available data from other sources such as weather report."]
[null,"Surface emissivity ","Surface emissivity of the outside surface of heat loss.  Default value is 0.8.  The user can change this value for their specific case. "]
[null,"Outside surface Area (ft^2)","Total surface area for the wall being considered and exposed to the ambient. Use actual measurement or calculate/estimate based on the equipment drawings."]
[]
[null,"Heat Required (Btu/hr)","Heat Required - calculated by using the information given in previous cells."]
[]
[null,"Possible energy saving measues to consider"]
[]
[null,"Wall losses","Look for cracks, breaks and erosion of insulation.  Repair and maintain furnace insulation.   "]
[null,null,"Use proper insulation and thickness to reduce furnace casing or surface temperature while rebuilding the furnace.  "]
[null,null,"Consider use of low weight, fiber insulation when appropriate."]
[null,null,"Account for process atmosphere composition (i.e. presence of hydrogen) in the furnace. Select the insulation to provide barrier to gas penetration in the insulation voids. "]
[null,null,"Reduce or eliminate external wall cooling if used."]
[]
[null,"Note: These energy saving measures are for guidance only.  Not all measures are applicable under all operating conditions.  There may additional measures when considering specific situations and the user is encouraged to review and apply the appropriate measures."]

{"sheet":"Help Opening Losses","index":39,"n_rows":27,"n_cols":3,"rows_kept":27,"cut":false,"hidden":false,"merged":[[22,1,24,1],[26,1,26,2],[20,1,21,2]]}
[]
[null,"Opening Radiation Losses"]
[null,"Name","Description"]
[null,"Shape of opening","Select rectangular or round shape using drop down list "]
[null,"Number of openings ","Give number of openings of the same shape and size."]
[null,"Total Opening Area (ft^2)","Total area for the opening in the furnace walls. This may include holes in the walls, flue gas openings, charge and discharge door etc."]
[null,"Average zone or radiation source (Inside) Temp. (Deg. F.)","Use the furnace zone temperature at the location of the openings. This can be obtained from furnace temperature recorder-indicator. Use an 'average\" value of temperature if the openings are in different zones or at different locations."]
[null,"Ambient (or outside) Temp. (Deg. F.)","Temperature of the area outside the furnace where the openings are located. In most cases this is the ambient temperature in the area where the furnace and openings are located."]
[null,"Furnace Wall Thickness or opening depth (inch)","Value of wall thickness (insulation - refractory etc.) at the location of openings in the wall or doors etc. Use actual measurements if possible or information from the current furnace drawings."]
[null,"Length of Openings (inch)","Value of length of the openings for square or rectangular openings in the wall or doors etc. Use actual measurements if possible or information from the current furnace drawings. Use value for a typical opening or average value. This value is used only to calculate view factor and not for calculation of heat loss area."]
[null,"Diameter of Openings (inch)","Value of diameter of the opening for round openings in the wall or doors etc. Use actual measurements if possible or information from the current furnace drawings. Use value for a typical opening or average value. This value is used only to calculate view factor and not for calculation of heat loss area."]
[null,"Height of Openings (inch)","Value of height of the openings for square or rectangular openings in the wall or doors etc. Use actual measurements if possible or information from the current furnace drawings. Use value for a typical opening or average value. This value is used only to calculate view factor and not for calculation of heat loss area."]
[null,"View Factor","View Factor calculated based on the information given in previous cells."]
[null,"View Factor - User Defined","Use value of view factor from the graphs given attachment. Click on \"look up\" button to go the attachment graphs."]
[null,"Emissivity of the source","Emissivity of the radiation source (usually interior of the furnace).  The default or suggested value is 0.9 "]
[null,"% of Time Open","This represents the time during which the furnace interior is exposed or open to the ambient and heat is lost by radiation. it is expressed as percentage of the total operating time or cycle time. Typical examples including opening of a door for charging and discharging load or opening of a damper for part of the operating time."]
[null,"Fixed Opening Losses ((Btu/hr.)","Fixed Opening Losses (Btu/hr.)"]
[null,"Variable Opening Losses ((Btu/hr.)","Variable Opening Losses (Btu/hr.)"]
[null,"Radiation loss (Btu/hr.)","Radiation loss - Heat lost - calculated by using the information given in previous cells."]
[]
[null,"Possible energy saving measues to consider"]
[]
[null,"Opening losses","Use and maintain proper seals to eliminate or reduce size of openings. Repair and maintain the seals."]
[null,null,"Watch for proper closing and seals for doors, openings at moving or rotating parts such as rolls, conveyors, rotary kilns etc.   Provide and maintain seals."]
[null,null,"Consider use of \"radiation shields\" or sight glasses with covers to reduce radiation heat losses."]
[]
[null,"Note: These energy saving measures are for guidance only.  Not all measures are applicable under all operating conditions.  There may additional measures when considering specific situations and the user is encouraged to review and apply the appropriate measures."]

{"sheet":"Help Other Losses","index":40,"n_rows":29,"n_cols":3,"rows_kept":29,"cut":false,"hidden":false,"merged":[[10,1,10,2],[12,1,12,2],[24,1,26,1],[28,1,28,2],[22,1,23,2]]}
[]
[null,"Other Losses"]
[null,"Name","Description"]
[null,"Approx. Area (ft^2)","Total area of the exposed parts such as shafts, structural components of the furnace, part of the charge being heated (if applicable), burner or radiant tubes, material handling system (conveyors, belts) etc. Estimate based on actual measurements or use furnace drawings."]
[null,"Average Temp. (Deg. F.)","Average temperature for the exposed areas. The average should be calculated based on actual measurement at several locations for the exposed parts or areas. The actual temperature can vary over a wide range and care should be taken to use weighted average. Use infra-red radiation temperature measurement instrument (with proper emissivity correction) whenever possible."]
[null,"Ambient Temp. (Deg. F.)","Temperature of the area outside the furnace where the exposed areas are located. In most cases this is the ambient temperature in the area where the furnace and exposed areas are located."]
[null,"Surface emissivity of the heart source","Emissivity of the surface from heat is dissipated or lost.  This can be in the range of 07 to 0.9 for commonly encountered surfaces but the user should use appropriate value for the specific case. "]
[null,"Other - Additional Losses (Btu/hr.)","Give value of any additional heat losses not accounted in any of the other heat loss calculations. A few examples include heat contained in unburned carbon presence in ash, sensible heat content of ash and other residue for solid fuel fired fuels, heat content of slag, byproducts or other materials that has not been accounted for other areas of heat loss or utilization."]
[null,"Heat Required (Btu/hr.)","Heat Required calculated by using the information given in previous cells."]
[]
[null,"Hot Gas Leakage (Exfiltration) "]
[null,"Name","Description"]
[null,"Hot Flue Gases Leakage Heat Loss from Oven or Furnace (Select \"Yes\" or \"No\")"]
[null,"Furnace draft (+  positive. pressure)  - (inch w.c.)*","Furnace pressure measured at the level of the opening.  It is measured by using an inclined tube manometer or a digital gage.  Units of measurement is in terms of inch water column.  Hot gases leak out when the pressure is positive.  Cold air leaks into the furnace when pressure is negative. "]
[null,"Opening area (ft^2)","This is value of open area from where hot gases are leaking out.  "]
[null,"Temperature of gases leaking from the furnace (Deg. F.)","Temperature of gases leaking out of the opening.  In most cases it is safe and accurate enough to measure and use furnace (or zone) temperature for this value. "]
[null,"Specific density of flue gases (relative to air =1.0) ","Specific density of gases at standard temperature - pressure (STP) measured relative to air using air specific density as 1.0 which translates as 0.0763 lb./scf. "]
[null,"Ambient temperature (Deg. F.)","Ambient temperature at the location where opening is present.  Normally this is room temperature in the area where furnace is located. "]
[null,"Hot flue gas leakage heat loss (Btu/hr.) ","Heat content of hot gases leaking out of the furnace calculated in terms of Btu/hr. "]
[]
[null,"* w.c. Water column"]
[]
[null,"Possible energy saving measues to consider"]
[]
[null,"Other Losses","Eliminate, reduce or insulate hot parts (such as rolls, shafts, sticking, support components) that are sticking out of the furnace.  "]
[null,null,"Eliminate or reduce size of the openings.  Use appropriate cover or shield for the openings. "]
[null,null,"Control/maintain furnace pressure as close to zero as possible. Avoid excessive positive pressure or presence of openings to reduce or eliminate cold air leakage into the furnace or hot gas leaks from the furnace. "]
[]
[null,"Note: These energy saving measures are for guidance only.  Not all measures are applicable under all operating conditions.  There may additional measures when considering specific situations and the user is encouraged to review and apply the appropriate measures."]

{"sheet":"Help Flue Gas ","index":41,"n_rows":57,"n_cols":3,"rows_kept":57,"cut":false,"hidden":false,"merged":[[56,1,56,2],[14,1,14,2],[18,2,26,2],[27,2,39,2],[42,2,44,2],[48,1,54,1],[46,1,47,2]]}
[]
[null,"Flue Gas - Available Heat"]
[null,"Name","Description"]
[null,"Furnace Flue Gas Temp. (Deg. F.)","Measure flue gas temperature by using \"proper\" temperature probe. Type of temperature probe depends on flue gas temperature and composition at the point of measurement. In most cases a commercially available thermocouple probe is used. Click on \"Look Up\" button to get information on proper location of a temperature probe. If actual measurement is not possible then use the furnace zone temperature plus 250 C. to 500 C F as approximate value for flue gas temperature."]
[null,"Oxygen in Flue Gases (%)","Measure oxygen content of flue gases by using a gas sampling probe. The O2 reading is in terms of \"dry\" basis. "]
[null,"Excess Air (%)","This can be calculated value or user defined value of excess air in in flue gases. The value is expressed in terms of percentage of stoichiometric air required for the fuel used. The excess air value represents excess air used in burners plus all air entering the furnace and going as flue gases form the furnace. The additional air entering the furnace may be sure to use of make-up air or air leakage due to openings in the furnace and presence of negative pressure in the furnace."]
[null,"Combustion Air Temp. (Deg. F.)","Combustion air temperature (Celsius) entering the burners. Use temperature recorder/indicator reading or actual measurement using a temperature gage, thermocouple or estimate based on the furnace supplier's specification."]
[null,"Available Heat (%)","This is calculated value of \"Available Heat\" given as percentage of total heat input (expressed as higher or gross heating value) in the furnace. The values are calculated for commonly used natural gas in USA and most Western countries. It is a reasonably accurate value of available heat for coal and fuel oils. The value could be significantly different depending on type of fuel used, its Carbon- Hydrogen content. Foe unusual fuels the user should obtain correct value from other sources and enter it in the following cell."]
[null,"Available Heat User Defined (%)","If the value given in the above cell is not appropriate, the user should enter proper value obtained form other sources. Available heat for use of oxygen enriched air or oxy-fuel firing and substoichiometric combustion of natural gas can be obtained from graphs given in attachments. Click on \"Look UP\" button to see these graphs."]
[null,"Available Heat (%) to use for calculations.","The user can select to use the calculated or user defined values for calculations of the total heat input (also known as gross heat) requirement. "]
[]
[]
[null,"Available Heat Calculations"]
[]
[null,"For user defined available heat calculation)"]
[null,"Fuel selection ","Use the fuel name and select type of fuel. Two options are available: gaseous fuel and solid/liquid fuel.  "]
[null,"Fuel composition ","Use volumetric analysis for gaseous fuels or analysis by mass for solid and liquid fuels. "]
[null,"Composition by mass or ultimate analysis","Required information for two categories of fuels is listed below. "]
[null,"Component - use ultimate analysis ","These values can be obtained from the on-site lab analysis or by the fuel supplier.  For approximation it is possible to use \"handbook\" values for standard fuels such as different types of coals, fuel oils or biomass fuels. "]
[null,"C"]
[null,"H2"]
[null,"S"]
[null,"Inerts - ash"]
[null,"O2"]
[null,"Moisture "]
[null,"N2"]
[null,"Total % **"]
[null,"Gas composition - Volumetric Analysis","These values can be obtained from the on-site lab analysis or by the fuel supplier.  For approximation it is possible to use \"handbook\" values for standard fuels such as natural gas, heavy hydrocarbons, manufactured gases or process by product fuels such as blast furnace gas, coke oven gas or refinery gas. different types of coals, fuel oils or biomass fuels. "]
[null,"CH4  "]
[null,"C2H6"]
[null,"N2 and other inert"]
[null,"H2"]
[null,"C3H8"]
[null,"C4H10 + CnH2n"]
[null,"H2O"]
[null,"CO"]
[null,"CO2"]
[null,"SO2"]
[null,"O2"]
[null,"Total of fuel components "]
[]
[null,"Fuel temperature  (Deg. F.)","This can be measured.  In most cases fuel is supplied at near ambient temperature however in some cases it can be at a higher temperature when it is preheated. "]
[null,"Combustion air temperature  (Deg. F.)","This data is transferred from flue gas data and/or calculations carried out previously.  No need to enter this data. "]
[null,"Flue gas temperature  (Deg. F.)"]
[null,"Excess air used for combustion (%)"]
[]
[null,"Possible energy saving measues to consider"]
[]
[null,"Flue Gas Losses","Maintain appropriate level of oxygen in flue gases by controlling air-fuel ratio for the burners. "]
[null,null,"Maintain and control burner operations to eliminate formation of soot or combustible gases such as carbon monoxide and hydrogen in flue gases."]
[null,null,"Eliminate or reduce air leakage in the furnace. See \"Opening Losses\" section."]
[null,null,"Consider use of heat recovery from flue gases.  Consider use of various methods of heat recovery to reduce flue gas temperature leaving the heating system. "]
[null,null,"Use preheated combustion air through use of recuperators or regenerators. "]
[null,null,"Where appropriate, consider use of oxygen enrichment of combustion air to reduce mass of flue gases. "]
[null,null,"Review process temperature settings and lower it where possible during part-load operations.  This can reduce flue gas temperature leaving the heating system. "]
[]
[null,"Note: These energy saving measures are for guidance only.  Not all measures are applicable under all operating conditions.  There may additional measures when considering specific situations and the user is encouraged to review and apply the appropriate measures."]

{"sheet":"Help Power","index":42,"n_rows":26,"n_cols":3,"rows_kept":26,"cut":false,"hidden":false,"merged":[[25,1,25,2],[18,1,19,2]]}
[]
[null,"Power - Motor Drives "]
[null,"Name","Description"]
[null,"Equipment  name or designation","Give name or ID for the motor"]
[null,"Motor driven system name designation -  (select one form the list below)","This could be selected from the list or given as desired."]
[null,"Name or designation of the drive motor ","This could be selected from the list or given as desired."]
[null,"Electric motor or fan Model","Give name or designation "]
[null,"Pressure (for fans only) - psig","Pressure rise for the fan or blower if the motor is used as a fan or a blower drive."]
[null,"Flow (for fans only) - (scfm)","Air or gas flow delivered by the fan or blower - give value if applicable. "]
[null,"Motor power (name plate)","The power rating of the motor expressed as kW"]
[null,"Motor phase","Number of phases for the mort - in most cases it would be 3. "]
[null,"Supply voltage (Volts) ","Electric power supply voltage (volts) "]
[null,"Average current (Amps)","Measured or estimated value (average) for the electric motor. Measured during the audit or use historical data. "]
[null,"Power factor (average value)  (Default=0.85)","Power factor if known.  Use suggested average value if no data is available. "]
[null,"% Operating time (as % of total time) (Default=100%)","This is motor operating time as a percentage of total operating time for the equipment."]
[null,"Other power use (kW)","Give a list of other power using systems and their power use (measured or estimated)."]
[null,"Total power use (kW)","Calculated value using the data given above. "]
[]
[null,"Possible energy saving measues to consider"]
[]
[null,"Power - Motor Drives ","Use variable speed drive where possible"]
[null,null,"Improve power factor"]
[null,null,"Reduce motor load through assessment of use of utilities (water, compressed air, hydraulics etc.) to eliminate waste and reduce usage where possible. "]
[null,null,"Consider alternate drive system where possible"]
[]
[null,"Note: These energy saving measures are for guidance only.  Not all measures are applicable under all operating conditions.  There may additional measures when considering specific situations and the user is encouraged to review and apply the appropriate measures."]

{"sheet":"Cp calculations ","index":43,"n_rows":68,"n_cols":17,"rows_kept":68,"cut":false,"hidden":true,"merged":[[31,11,32,11],[19,11,20,11],[22,11,23,11],[25,11,26,11],[28,11,29,11],[4,13,4,14],[7,11,8,11],[10,11,11,11],[13,11,14,11],[16,11,17,11]]}
[]
[null,"Initial Gas temperature (F)",60]
[null,"Final Gas temperature (F)",1000]
[]
[null,null,null,null,null,null,null,null,null,null,null,null,null,"Cp calc for SI units"]
[null,null,null,null,"Cp",null,"Cp","Sp. Vol","Sp. Wt","Sp. Gravity","Cp","Mean CP","Sp. Wt","Cp","A","Cp"]
[null,"Gas","Temp (F)","Temp ®","Btu/(#mole.F)","Mol wt","Btu/(#F)","SCF/#","#/SCF","wrt Air @stp","Btu/SCF-F","Btu/SCF","kg/nm^3","kJ/(kg. C)","B","kJ/nm^3 C"]
[null,"Oxygen",32,{"$f":"460+C8","v":492},{"$f":"11.515-172/D8^0.5 +1530/D8","v":6.8703972394210595},32,{"$f":"E8/F8","v":0.21469991373190811},{"$f":"378.2/F8","v":11.81875},{"$f":"1/H8","v":8.4611316763617134E-2},{"$f":"I8/0.0763","v":1.1089294464432127},{"$f":"G8/H8","v":1.8166042409891749E-2},{"$f":"(K8+K9)/2","v":1.9740741288504331E-2},{"$f":"I8*16.018","v":1.3553040719196192},{"$f":"4.187*G8","v":0.8989485387954993},{"$f":"N9-O9*((C9 -32)/1.8)","v":0.8989485387954993},{"$f":"K8*$Q$8","v":1.2182473380242129},{"$f":"1.055/(0.02832*0.5555)","v":67.061790924855188}]
[null,"Oxygen",{"$f":"C3","v":1000},{"$f":"460+C9","v":1460},{"$f":"11.515-172/D9^0.5 +1530/D9","v":8.0614994712036143},32,{"$f":"E9/F9","v":0.25192185847511295},{"$f":"378.2/F9","v":11.81875},{"$f":"1/H9","v":8.4611316763617134E-2},{"$f":"I9/0.0763","v":1.1089294464432127},{"$f":"G9/H9","v":2.1315440167116909E-2},null,{"$f":"I9*16.018","v":1.3553040719196192},{"$f":"4.187*G9","v":1.0547968214352981},{"$f":"(N9-N8)/((C9-C8)/1.8)","v":2.8980052556987381E-4},{"$f":"K9*$Q$8","v":1.4294515919584545}]
[null,null,null,null,null,null,null,null,null,null,null,null,null,null,null,0]
[null,"Nitrogen",{"$f":"C8","v":32},{"$f":"460+C11","v":492},{"$f":"9.47-3.47*10^3/D11 +1.07*10^6/D11^2","v":6.837473064974553},28,{"$f":"E11/F11","v":0.24419546660623404},{"$f":"378.2/F11","v":13.507142857142856},{"$f":"1/H11","v":7.4034902168164995E-2},{"$f":"I11/0.0763","v":0.97031326563781117},{"$f":"G11/H11","v":1.8078987480101939E-2},{"$f":"(K11+K12)/2","v":1.9080818465253235E-2},{"$f":"I11*16.018","v":1.1858910629296668},{"$f":"4.187*G11","v":1.0224464186803019},{"$f":"N12-O12*((C12 -32)/1.8)","v":1.0224464186803019},1.2124092785236709]
[null,"Nitrogen",{"$f":"C9","v":1000},{"$f":"460+C12","v":1460},{"$f":"9.47-3.47*10^3/D12 +1.07*10^6/D12^2","v":7.5952580221429917},28,{"$f":"E12/F12","v":0.27125921507653544},{"$f":"378.2/F12","v":13.507142857142856},{"$f":"1/H12","v":7.4034902168164995E-2},{"$f":"I12/0.0763","v":0.97031326563781117},{"$f":"G12/H12","v":2.0082649450404531E-2},null,{"$f":"I12*16.018","v":1.1858910629296668},{"$f":"4.187*G12","v":1.1357623335254541},{"$f":"(N12-N11)/((C12-C11)/1.8)","v":2.1071141190214242E-4},1.3467784386601866]
[null,null,null,null,null,null,null,null,null,null,null,null,null," ",null,0]
[null,"Carbon Monoxide",{"$f":"C11","v":32},{"$f":"460+C14","v":492},{"$f":"9.46-3.29*10^3/D14+1.07*10^6/D14^2","v":7.1933267235111389},28,{"$f":"E14/F14","v":0.25690452583968354},{"$f":"378.2/F14","v":13.507142857142856},{"$f":"1/H14","v":7.4034902168164995E-2},{"$f":"I14/0.0763","v":0.97031326563781117},{"$f":"G14/H14","v":1.9019901437099786E-2},{"$f":"(K14+K15)/2","v":1.9701047616191181E-2},{"$f":"I14*16.018","v":1.1858910629296668},1.0756592496907551,{"$f":"N15-O15*((C15 -32)/1.8)","v":1.0756592496907551},1.2755086535861386]
[null,"Carbon Monoxide",{"$f":"C12","v":1000},{"$f":"460+C15","v":1460},{"$f":"9.46-3.29*10^3/D15+1.07*10^6/D15^2","v":7.7085456933758687},28,{"$f":"E15/F15","v":0.27530520333485248},{"$f":"378.2/F15","v":13.507142857142856},{"$f":"1/H15","v":7.4034902168164995E-2},{"$f":"I15/0.0763","v":0.97031326563781117},{"$f":"G15/H15","v":2.0382193795282576E-2},null,{"$f":"I15*16.018","v":1.1858910629296668},1.1527028863630273,{"$f":"(N15-N14)/((C15-C14)/1.8)","v":1.4326296075422521E-4},1.3668664188891209]
[null,null,null,null,null,null,null,null,null,null,null,null,null," ",null,0]
[null,"Hydrogen",{"$f":"C14","v":32},{"$f":"460+C17","v":492},{"$f":"5.76+0.578*D17/10^3+20/D17^0.5","v":6.9460456346674322},2,{"$f":"E17/F17","v":3.4730228173337161},{"$f":"378.2/F17","v":189.1},{"$f":"1/H17","v":5.2882072977260709E-3},{"$f":"I17/0.0763","v":6.9308090402700792E-2},{"$f":"G17/H17","v":1.8366064607793317E-2},{"$f":"(K17+K18)/2","v":1.8605697458034962E-2},{"$f":"I17*16.018","v":8.4706504494976201E-2},14.54154653617627,{"$f":"N18-O18*((C18 -32)/1.8)","v":14.54154653617627},1.2316611848402179]
[null,"Hydrogen",{"$f":"C15","v":1000},{"$f":"460+C18","v":1460},{"$f":"5.76+0.578*D18/10^3+20/D18^0.5","v":7.1273039225902135},2,{"$f":"E18/F18","v":3.5636519612951068},{"$f":"378.2/F18","v":189.1},{"$f":"1/H18","v":5.2882072977260709E-3},{"$f":"I18/0.0763","v":6.9308090402700792E-2},{"$f":"G18/H18","v":1.884533030827661E-2},null,{"$f":"I18*16.018","v":8.4706504494976201E-2},14.921010761942613,{"$f":"(N18-N17)/((C18-C17)/1.8)","v":7.0561529584650565E-4},1.2638016010434827]
[null,null,null,null,null,null,null,null,null,null,null,null,null," ",null,0]
[null,"Water vapor (H2O)",{"$f":"C17","v":32},{"$f":"460+C20","v":492},{"$f":"19.86-597/D20^0.5+7500/D20","v":8.1890638442015362},18,{"$f":"E20/F20","v":0.45494799134452979},{"$f":"378.2/F20","v":21.011111111111109},{"$f":"1/H20","v":4.7593865679534643E-2},{"$f":"I20/0.0763","v":0.62377281362430714},{"$f":"G20/H20","v":2.1652733591225638E-2},{"$f":"(K20+K21)/2","v":2.3217670619055421E-2},{"$f":"I20*16.018","v":0.7623585404547859},1.9048672397595463,{"$f":"N21-O21*((C21 -32)/1.8)","v":1.9048672397595463},1.4520710930463625]
[null,"Water vapor (H2O)",{"$f":"C18","v":1000},{"$f":"460+C21","v":1460},{"$f":"19.86-597/D21^0.5+7500/D21","v":9.3727822120519821},18,{"$f":"E21/F21","v":0.52071012289177676},{"$f":"378.2/F21","v":21.011111111111109},{"$f":"1/H21","v":4.7593865679534643E-2},{"$f":"I21/0.0763","v":0.62377281362430714},{"$f":"G21/H21","v":2.47826076468852E-2},null,{"$f":"I21*16.018","v":0.7623585404547859},2.1802132845478694,{"$f":"(N21-N20)/((C21-C20)/1.8)","v":5.1200710807746048E-4},1.6619660525881328]
[null,null,null,null,null,null,null,null,null,null,null,null,null," ",null,0]
[null,"Carbon Dioxide",{"$f":"C20","v":32},{"$f":"460+C23","v":492},{"$f":"16.2-6.53*10^3/D23+1.41*10^6/D23^2","v":8.7525480864564749},44,{"$f":"E23/F23","v":0.19892154741946533},{"$f":"378.2/F23","v":8.5954545454545457},{"$f":"1/H23","v":0.11634056054997356},{"$f":"I23/0.0763","v":1.5247779888594175},{"$f":"G23/H23","v":2.3142644332248743E-2},{"$f":"(K23+K24)/2","v":2.7950053272244868E-2},{"$f":"I23*16.018","v":1.8635430988894766},0.83288451904530136,{"$f":"N24-O24*((C24 -32)/1.8)","v":0.83288451904530136},1.5519871756575501]
[null,"Carbon Dioxide",{"$f":"C21","v":1000},{"$f":"460+C24","v":1460},{"$f":"16.2-6.53*10^3/D24+1.41*10^6/D24^2","v":12.388872208669543},44,{"$f":"E24/F24","v":0.28156527746976234},{"$f":"378.2/F24","v":8.5954545454545457},{"$f":"1/H24","v":0.11634056054997356},{"$f":"I24/0.0763","v":1.5247779888594175},{"$f":"G24/H24","v":3.275746221224099E-2},null,{"$f":"I24*16.018","v":1.8635430988894766},1.178913816765895,{"$f":"(N24-N23)/((C24-C23)/1.8)","v":6.4344290898457504E-4},2.1967740821061494]
[null,null,null,null,null,null,null,null,null,null,null,null,null," ",null,0]
[null,"Methane - CH4",{"$f":"C23","v":32},{"$f":"460+C26","v":492},{"$f":"4.23+0.01177*D26","v":10.02084},16,{"$f":"E26/F26","v":0.62630249999999998},{"$f":"378.2/F26","v":23.637499999999999},{"$f":"1/H26","v":4.2305658381808567E-2},{"$f":"I26/0.0763","v":0.55446472322160634},{"$f":"G26/H26","v":2.6496139608672659E-2},{"$f":"(K26+K27)/2","v":4.1558751983077735E-2},{"$f":"I26*16.018","v":0.67765203595980961},2.6223285675000003,{"$f":"N27-O27*((C27 -32)/1.8)","v":2.6223285675000003},1.7768785747525802]
[null,"Methane - CH5",{"$f":"C24","v":1000},{"$f":"460+C27","v":1460},{"$f":"4.23+0.01177*D27","v":21.414200000000001},16,{"$f":"E27/F27","v":1.3383875000000001},{"$f":"378.2/F27","v":23.637499999999999},{"$f":"1/H27","v":4.2305658381808567E-2},{"$f":"I27/0.0763","v":0.55446472322160634},{"$f":"G27/H27","v":5.6621364357482815E-2},null,{"$f":"I27*16.018","v":0.67765203595980961},5.603828462500001,{"$f":"(N27-N26)/((C27-C26)/1.8)","v":5.5441113750000015E-3},3.7971300984215599]
[null,null,null,null,null,null,null,null,null,null,null,null,null," ",null,0]
[null,"Ethylene C2H4",{"$f":"C26","v":32},{"$f":"460+C29","v":492},{"$f":"4.52+0.00737*D29","v":8.1460399999999993},28,{"$f":"E29/F29","v":0.29092999999999997},{"$f":"378.2/F29","v":13.507142857142856},{"$f":"1/H29","v":7.4034902168164995E-2},{"$f":"I29/0.0763","v":0.97031326563781117},{"$f":"G29/H29","v":2.1538974087784241E-2},{"$f":"(K29+K30)/2","v":3.09707033315706E-2},{"$f":"I29*16.018","v":1.1858910629296668},1.2181239099999999,{"$f":"N30-O30*((C30 -32)/1.8)","v":1.2181239099999999},1.4444421770108602]
[null,"Ethylene C2H5",{"$f":"C27","v":1000},{"$f":"460+C30","v":1460},{"$f":"4.52+0.00737*D30","v":15.280199999999999},28,{"$f":"E30/F30","v":0.54572142857142858},{"$f":"378.2/F30","v":13.507142857142856},{"$f":"1/H30","v":7.4034902168164995E-2},{"$f":"I30/0.0763","v":0.97031326563781117},{"$f":"G30/H30","v":4.0402432575356959E-2},null,{"$f":"I30*16.018","v":1.1858910629296668},2.2849356214285717,{"$f":"(N30-N29)/((C30-C29)/1.8)","v":1.9837407857142865E-3},2.709459486224147]
[null,null,null,null,null,null,null,null,null,null,null,null,null," ",null,0]
[null,"Ethane C2H6",{"$f":"C29","v":32},{"$f":"460+C32","v":492},{"$f":"4.04+0.01636*D32","v":12.089120000000001},30,{"$f":"E32/F32","v":0.4029706666666667},{"$f":"378.2/F32","v":12.606666666666666},{"$f":"1/H32","v":7.9323109465891065E-2},{"$f":"I32/0.0763","v":1.0396213560405119},{"$f":"G32/H32","v":3.1964886303543105E-2},{"$f":"(K32+K33)/2","v":5.2901533580116344E-2},{"$f":"I32*16.018","v":1.270597567424643},1.6872381813333335,{"$f":"N33-O33*((C33 -32)/1.8)","v":1.6872381813333335},2.143622522224975]
[null,"Ethane C2H7",{"$f":"C30","v":1000},{"$f":"460+C33","v":1460},{"$f":"4.04+0.01636*D33","v":27.925599999999999},30,{"$f":"E33/F33","v":0.93085333333333331},{"$f":"378.2/F33","v":12.606666666666666},{"$f":"1/H33","v":7.9323109465891065E-2},{"$f":"I33/0.0763","v":1.0396213560405119},{"$f":"G33/H33","v":7.3838180856689584E-2},null,{"$f":"I33*16.018","v":1.270597567424643},3.8974829066666667,{"$f":"(N33-N32)/((C33-C32)/1.8)","v":4.1099592000000008E-3},4.9517206468829613]
[]
[null,"Source - Gas Engineers Handbook "]
[]
[null,"For Air at 60 F., 80% Humidity ",null,null,null,null,null,null,null,null,null,"Cp (KJ/kg-C) = A + B*Temp (F)"]
[null,"Composition of gas mixture ","% Vol","% mass","Mean CP Btu/scf","Cp-60 F","Cp 1000F",null,null,null,null,null,"A"]
[null,"Oxygen ",20.7,null,{"$f":"L8","v":1.9740741288504331E-2},{"$f":"K8","v":1.8166042409891749E-2},{"$f":"K9","v":2.1315440167116909E-2},null,null,null,null,null,"B",{"$f":"(N9-N8)/(C9-C8)","v":1.6100029198326321E-4}]
[null,"Carbon Dioxide",0,null,{"$f":"L23","v":2.7950053272244868E-2},{"$f":"K23","v":2.3142644332248743E-2},{"$f":"K24","v":3.275746221224099E-2},null,null,null,"For 60 deg. F"]
[null,"Nitrogen & Other",78.3,null,{"$f":"L11","v":1.9080818465253235E-2},{"$f":"K11","v":1.8078987480101939E-2},{"$f":"K12","v":2.0082649450404531E-2},null,null,null,{"$f":"(60-32)/1.8","v":15.555555555555555},null,{"$f":"O8+O9*K41","v":0.90345654697103062}]
[null,"Water vapor",1,null,{"$f":"L20","v":2.3217670619055421E-2},{"$f":"K20","v":2.1652733591225638E-2},{"$f":"K21","v":2.47826076468852E-2},null,null,null,"For 1000 deg. F"]
[null,null,null,null,null,null,null,null,null,null,{"$f":"(1000-32)/1.8","v":537.77777777777771},null,{"$f":"O8+O9*K43","v":1.0547968214352981}]
[null,"Total",{"$f":"SUM(C39:C43)","v":100}]
[null,"Mean value",null,null,{"$f":"($C$39*E39+$C$40*E40+$C$41*E41+$C$42*E42)/100","v":1.9258791011204233E-2},{"$f":"($C$39*F39+$C$40*F40+$C$41*F41+$C$42*F42)/100","v":1.8132745311679667E-2},{"$f":"($C$39*G39+$C$40*G40+$C$41*G41+$C$42*G42)/100","v":2.0384836710728802E-2}]
[]
[null,null,null,null,null,"B",{"$f":"(G45-F45)/(1000-60)","v":2.3958419138820589E-6}]
[null,null,null,null,null,"A",{"$f":"G45-G47*1000","v":1.7988994796846743E-2}]
[null,null,null,null,null,"conv. Factor ",{"$f":"67.06179","v":67.061790000000002}]
[null,null,null,null,"cp for air"]
[null,null,null,null,"Temp","Cp (Btu/scf -F)","Cp (kJ/nm^3-C)","Deg C"]
[null,null,null,null,60,{"$f":"$G$48+$G$47*E52","v":1.8132745311679667E-2},{"$f":"F52*$Q$8","v":1.2160143749855099},{"$f":"(E52-32)/1.8","v":15.555555555555555}]
[null,null,null,null,100,1.8228578988234947E-2,{"$f":"F53*$Q$8","v":1.2224411529662205},{"$f":"(E53-32)/1.8","v":37.777777777777779}]
[null,null,null,null,{"$f":"100+E53","v":200},1.8468163179623156E-2,1.238508097917997,93.333333333333329]
[null,null,null,null,300,1.8707747371011361E-2,1.2545750428697733,148.88888888888889]
[null,null,null,null,400,1.8947331562399566E-2,1.2706419878215496,204.44444444444443]
[null,null,null,null,500,1.9186915753787771E-2,1.2867089327733257,260]
[null,null,null,null,600,1.9426499945175979E-2,1.3027758777251022,315.55555555555554]
[null,null,null,null,700,1.9666084136564184E-2,1.3188428226768785,371.11111111111109]
[null,null,null,null,800,1.9905668327952389E-2,1.3349097676286548,426.66666666666663]
[null,null,null,null,900,2.0145252519340594E-2,1.3509767125804311,482.22222222222223]
[null,null,null,null,1000,2.0384836710728802E-2,1.3670436575322076,537.77777777777771]
[null,null,null,null,1100,2.0624420902117007E-2,1.3831106024839839,593.33333333333337]
[null,null,null,null,1200,2.0864005093505212E-2,1.3991775474357602,648.88888888888891]
[null,null,null,null,1300,2.110358928489342E-2,1.4152444923875367,704.44444444444446]
[null,null,null,null,1400,2.1343173476281625E-2,1.431311437339313,760]
[null,null,null,null,1500,2.158275766766983E-2,1.4473783822910893,815.55555555555554]
[null,null,null,null,1600,2.1822341859058035E-2,1.4634453272428656,871.11111111111109]

{"sheet":"gas atm specific heat (3)","index":44,"n_rows":17,"n_cols":9,"rows_kept":17,"cut":false,"hidden":true,"merged":[]}
[]
[]
[]
[null,"Process Atmosphere","Specific Heat ","Specific Heat "]
[null,null,"Btu/(s.cu.ft.- deg. F)","kJ/(Nm^3- deg. C)"]
[null,"Conversion factor",1,70.804400000000001,null,"Btu/scf","kJ/m^3","Btu/(scf-F)","kJ/(Nm^3 - C)"]
[null,"Nitrogen",{"$f":"0.0185","v":1.8499999999999999E-2},{"$f":"C7*$D$6","v":1.3098813999999999},null,1,39.338000000000001,1,{"$f":"G7*1.8","v":70.808400000000006}]
[null,"Hydrogen",1.8200000000000001E-2,1.2886400800000002]
[null,"Exothermic gas",1.8499999999999999E-2,1.3098813999999999]
[null,"Endothermic gas",{"$f":"0.0185","v":1.8499999999999999E-2},1.3098813999999999]
[null,"Air",1.84E-2,1.3028009599999999]
[null,"Water vapor",2.12E-2,1.50105328]
[null,"Other","?"]
[]
[null,"Note: The values are for approx. 60 deg. F. or 15 deg. C."]
[null,"The value increases by about 0.00111% for every 1 deg. C."]
[null,"if the selection is other then we will have to ask for specific heat information "]

{"sheet":"MaterialHeatData","index":45,"n_rows":66,"n_cols":14,"rows_kept":66,"cut":false,"hidden":true,"merged":[]}
["ID","Substance","MaterialType","Composition","Density (kg/m^3)","MeanSpecific Heat of solid (kJ/(kg oC# F) ","LatentHeatOf Fusion kJ/kg","MeanSpecific Heat Of Liquid (kJ/(kg oC) ","MeltingPoint (Deg. C.)","Average Pouring Temp (Deg. C)","HtContentOf Solid At MeltingPoint (kJ/kg)","HtContentOf LiquidAt MeltingTemp (kJ/kg)","HtContentOf LiquidAt PouringTemp (kJ/kg)","Change"]
[null,null,null,"Conversion Factor ",{"$f":"16.02","v":16.02},4.1870000000000003,2.3260000000000001,{"$f":"F2","v":4.1870000000000003},"C=(F-32)/1.8","C=(F-32)/1.8",2.3260000000000001,{"$f":"K2","v":2.3260000000000001},{"$f":"L2","v":2.3260000000000001}]
[1,"Aluminum","Solid","Al",2670.53,1.038,393.09399999999999,1.089,657.22,748.89,665.23599999999999,1058.33,1156.0219999999999,false]
[2,"Babbitt, lead  base","Solid","75 Pb,15 Sb,10 Sn",0,0.16300000000000001,60.941000000000003,0.159,238.89,329.44,36.750999999999998,97.691999999999993,111.648,false]
[3,"Babbitt, tin  base","Solid","83.3 Sn,8.4 Sb,8.3 Cu",7401.24,0.29699999999999999,79.316999999999993,0.26400000000000001,240,491.11,66.524000000000001,157.47,211.666,false]
[4,"Bismuth","Solid","Bi",9804.24,0.13800000000000001,43.030999999999999,0.14699999999999999,270,326.67,35.122999999999998,78.153999999999996,86.527000000000001,false]
[5,"Brass, Muntz metal","Solid","60 Cu,40 Zn",8394.48,0.44,160.494,0.52300000000000002,887.78,1010,383.79,544.28399999999999,607.08600000000001,false]
[6,"Brass, red","Solid","90 Cu,10 Zn",8746.92,0.435,201.19900000000001,0.48199999999999998,1066.67,1232.22,458.22199999999998,659.42100000000005,739.20299999999997,false]
[7,"Brass,yellow","Solid","67 Cu,33 Zn",8458.56,0.44,165.14599999999999,0.51500000000000001,920,1065.56,397.74599999999998,562.89200000000005,637.78899999999999,false]
[8,"Bronze,  bearing","Solid","80 Cu,10 Pb,10 Sn",8907.1200000000008,0.39800000000000002,185.84700000000001,0.45600000000000002,1000,1121.1099999999999,391.46600000000001,577.31299999999999,632.67200000000003,false]
[9,"Bronze, aluminum","Solid","90 Cu,10 Al",8170.2,0.52800000000000002,229.34399999999999,0.52300000000000002,1050,1204.44,546.61,775.95399999999995,855.96799999999996,false]
[10,"Bronze, bell metal","Solid","78 Cu,22 Sn",8650.7999999999993,0.41899999999999998,177.47399999999999,0.498,890,1037.78,366.11200000000002,543.58600000000001,617.32000000000005,false]
[11,"Bronze, gun metal","Solid","90 Cu,1oSn",8811,0.44800000000000001,195.84899999999999,0.44400000000000001,1010,1148.8900000000001,445.42899999999997,641.27800000000002,702.452,false]
[12,"Bronze, tobin","Solid","60 Cu,39.2 Zn,0.8 Sn",8410.5,0.44800000000000001,170.96100000000001,0.51900000000000002,885,1010,389.60500000000002,560.56600000000003,625.46100000000001,false]
[13,"Carbon Steel","Solid","1000 series",7689.6,0.628,139.56,0,1537.78,-17.78,0,0,0,false]
[14,"Copper","Solid","Cu",8955.18,0.435,211.666,0.46500000000000002,1083.33,1204.44,465.2,676.86599999999999,732.69,false]
[15,"Die casting metal","Solid","92 Al,8 Cu",2819.52,0.98799999999999999,379.13799999999998,1.0089999999999999,621.11,760,598.48,977.61800000000005,1118.806,false]
[16,"Die casting metal","Solid","80 Pb,10 Sn,10 Sb",2819.52,0.159,40.704999999999998,0.155,315.56,437.78,47.683,88.388000000000005,339.596,false]
[17,"Die casting metal","Solid","90 Sn,4.5 Cu,5,5 Sb",2819.52,0.29299999999999998,70.245000000000005,0.26,232.22,343.33,64.197999999999993,134.44300000000001,162.82,false]
[18,"Die casting metal","Solid","87.3 Zn,8.1Sn,4.1Cu,0.5A",2819.52,0.43099999999999999,111.648,0.57799999999999996,415.56,526.66999999999996,172.124,283.77199999999999,348.9,false]
[19,"German silver","Solid","60 Cu,25 Zn,1 5 Ni",2819.52,0.45600000000000002,200.501,0.51500000000000001,1010,1148.8900000000001,451.24400000000003,651.745,723.38599999999997,false]
[20,"Gold","Solid","Au",19304.099999999999,0.13800000000000001,66.290999999999997,0.14199999999999999,1062.78,1176.67,144.67699999999999,210.96799999999999,227.25,false]
[21,"Inconel - 600","Solid","Inconel",7689.6,0.58599999999999997,0,0,1371.11,-17.78,0,0,0,false]
[22,"Iron, cast, gray","Solid","94 Fe,3.5 C,2.5 Si",7689.6,0.79600000000000004,96.296000000000006,0,1230,1537.78,965.29,1060.6559999999999,1356.058,false]
[23,"Iron, cast, white","Solid","97 Fe,3 C",7689.6,0.754,140.25800000000001,0,1150,1593.33,855.96799999999996,995.52800000000002,1423.5119999999999,false]
[24,"Iron, pig","Solid","93 Fe,4.22 C,1.48 Si,0.73 Mn,0.12P ,0.03 S",7689.6,0.64100000000000001,194.45400000000001,0,1100,1260,695.47400000000005,893.18399999999997,1046.7,false]
[25,"Iron, pure","Solid","Fe",7865.82,0.70299999999999996,272.142,0.628,1538.89,1704.44,1049.0260000000001,1321.1679999999999,1456.076,false]
[26,"Lead","Solid","Pb",11342.16,0.13400000000000001,23.26,0.14199999999999999,327.22000000000003,382.22,41.868000000000002,65.128,72.105999999999995,false]
[27,"Linotype","Solid","86 pb,11 sb,3sn",11214,0.151,50.009,0.151,252.22,326.67,35.588000000000001,85.596999999999994,96.762,false]
[28,"Magnesium","Solid","Mg",1739.77,1.139,194.68600000000001,1.1140000000000001,651.11,748.89,723.851,918.53700000000003,1027.394,false]
[29,"Manganese","Solid","Mn",7433.28,0.71599999999999997,153.51599999999999,0.80400000000000005,1230,1315.56,869.92399999999998,1023.44,1090.894,false]
[30,"Monel metal","Solid","67 Ni,28 Cu; Fe, Mn, Si",8811,0.54,273.072,0.58199999999999996,1323.89,1510,707.10400000000004,980.17600000000004,1088.568,false]
[31,"Nickel 60 to 2644 F","Solid","Ni",8907.1200000000008,0.56100000000000005,305.86900000000003,0.55700000000000005,1451.11,1565.56,804.79600000000005,1110.665,1174.6300000000001,false]
[32,"Silver","Solid","Ag",10493.1,0.26400000000000001,108.857,0.29299999999999998,961.11,1065.56,248.88200000000001,357.73899999999998,388.44200000000001,false]
[33,"solder, bismuth","Solid","40 pb,20 Sn,40 Bi",9291.6,0.16700000000000001,38.146000000000001,0.16300000000000001,111.11,165.56,21.632000000000001,59.777999999999999,68.617000000000004,false]
[34,"Solder, plumbers","Solid","50 pb,50 Sn",9291.6,0.214,53.497999999999998,0.20499999999999999,212.22,260,41.868000000000002,95.366,104.67,false]
[35,"Stainless Steel - 300 series","Solid","310 and 304",7689.6,0.58599999999999997,0,0,1398.89,-17.78,0,0,0,false]
[36,"Stainless Steel - 410","Solid","410 SS",7689.6,1.0469999999999999,111.648,0,1537.78,1537.78,1744.5,293.07600000000002,330.29199999999997,false]
[37,"Tin","Solid","Sn",7289.1,0.28899999999999998,58.15,0.26700000000000002,232.22,343.33,62.802,120.952,148.864,false]
[38,"Zinc","Solid","Zn",7128.9,0.44800000000000001,111.648,0.61099999999999999,418.89,482.22,180.96299999999999,292.61099999999999,330.29199999999997,false]
[39,"Refractory","Solid",null,0,1.0469999999999999,0,0,2760,-17.78,0,0,0,false]
[40,"Ladle Refractory","Solid",null,0,1.0469999999999999,0,0,2760,-17.78,0,0,0,false]
[41,"Crude","Liquid",null,0,2.722,0,0,482.22,-17.78,0,0,0,false]
[42,"Water - std. atmospheric pressure","Liquid",null,0,4.1870000000000003,2256.9180000000001,1.968,100,-17.78,0,0,0,false]
[43,"Water - 1050 kPa","Liquid",null,0,4.3959999999999999,2018.9680000000001,2.2610000000000001,185,-17.78,0,0,0,false]
[44,"Acetic Acid","Liquid",null,0,2.1349999999999998,404.72399999999999,1.675,118,-17.78,0,0,0,false]
[45,"Acetone","Liquid",null,0,1.4530000000000001,555.91399999999999,1.675,54.44,-17.78,0,0,0,false]
[46,"Alcohol- ethyl","Liquid",null,0,2.7130000000000001,858.29399999999998,1.8839999999999999,77.78,-17.78,0,0,0,false]
[47,"Alcohol - methyl","Liquid",null,0,2.516,1118.806,1.3819999999999999,66.11,-17.78,0,0,0,false]
[48,"Benzene","Liquid",null,0,1.7709999999999999,395.42,1.3819999999999999,80,-17.78,0,0,0,false]
[49,"Bromine","Liquid",null,0,0.44800000000000001,190.732,0.23,61.11,-17.78,0,0,0,false]
[50,"Carbon tetrachloride","Liquid",null,0,0.9,194.221,1.0469999999999999,76.67,-17.78,0,0,0,false]
[51,"Fuel oil no. 2 (average)","Liquid",null,0,2.387,244.23,2.3029999999999999,190.56,-17.78,0,0,0,false]
[52,"Fuel oil no. 6 (average)","Liquid",null,0,2.4279999999999999,251.208,2.3029999999999999,315.56,-17.78,0,0,0,false]
[53,"Kerosene","Liquid",null,0,2.387,604.76,2.5960000000000001,126.67,-17.78,0,0,0,false]
[54,"Methanol","Liquid",null,0,2.512,1093.22,2.512,64.44,-17.78,0,0,0,false]
[55,"Water vapor - near atm. pressure","Gas",null,0,1.968,0,0,-17.78,-17.78,0,0,0,false]
[56,"Steam - 350 kPa, 205 Celcius","Gas",null,0,2.052,0,0,-17.78,-17.78,0,0,0,false]
[57,"Steam - 1050 kPa, 260 Celcius","Gas",null,0,2.1349999999999998,0,0,-17.78,-17.78,0,0,0,false]
[58,"Steam - 4150 kPa, 375 Celcius","Gas",null,0,2.4700000000000002,0,0,-17.78,-17.78,0,0,0,false]
[59,"Air - low pressure","Gas",null,0,1.026,0,0,-17.78,-17.78,0,0,0,false]
[60,"Nitrogen - low pressure","Gas",null,0,1.0469999999999999,0,0,-17.78,-17.78,0,0,0,false]
[61,"Oxygen - low pressure","Gas",null,0,0.96299999999999997,0,0,-17.78,-17.78,0,0,0,false]
[62,"Carbon dioxide - low pressure","Gas",null,0,1.0049999999999999,0,0,-17.78,-17.78,0,0,0,false]
[63,"Carbon monoxide - low pressure","Gas",null,0,1.0469999999999999,0,0,-17.78,-17.78,0,0,0,false]
[64,"Hydrogen - low pressure","Gas",null,0,14.445,0,0,-17.78,-17.78,0,0,0,false]

{"sheet":"What is PHAST","index":46,"n_rows":139,"n_cols":16,"rows_kept":139,"cut":false,"hidden":false,"merged":[[0,0,41,0],[42,0,93,0],[95,0,136,0],[138,0,157,0]]}
[]
[]
[]
[]
[null,null,null,null,null,null,null,null,null,null,{"$f":"'Control page'!J2","v":0}]
[null,null,null,null,null,null,null,null,null,null,null,null,null,null,null,"Return To Control Page"]
[]
[]
[]
[]
[]
[]
[]
[]
[]
[]
[]
[]
[]
[]
[]
[]
[]
[]
[]
[]
[]
[]
[]
[]
[]
[]
[]
[]
[]
[]
[]
[]
[]
[]
[]
[]
[{"$f":"$P$6","v":"Return To Control Page"}]
[]
[]
[]
[]
[]
[]
[]
[]
[]
[]
[]
[]
[]
[]
[]
[]
[]
[]
[]
[]
[]
[]
[]
[]
[]
[]
[]
[]
[]
[]
[]
[]
[]
[]
[]
[]
[]
[]
[]
[]
[]
[]
[]
[]
[]
[]
[]
[]
[]
[]
[]
[]
[{"$f":"$P$6","v":"Return To Control Page"}]
[]
[]
[]
[]
[]
[]
[]
[]
[]
[]
[]
[]
[]
[]
[]
[]
[]
[]
[]
[]
[]
[]
[]
[]
[]
[]
[]
[]
[]
[]
[]
[]
[]
[]
[]
[]
[]
[]
[]
[]
[]
[]
[{"$f":"$P$6","v":"Return To Control Page"}]