{"text_format":"1","workbook":"xlsx","n_sheets":21,"sheets":["Disclaimer","Instruction","Basic Info ","Energy & Production ","Energy Use System","Energy Saving Opportunities","CHP","Compressed Air","Process Cooling & Refrigeration","Process Heating","Pumps","Steam Generation Equipment","Results","Tutorial","Energy Breakdown Calculations","List","Named List","Energy Management Opportunity","NAICS Data-Base","Conversions","Translation "],"not_rendered":{"charts":22,"images":25,"macros":1,"external_links":1,"defined_names":83,"comments":7,"pivot_tables":0},"unopened":[],"bounds":{"document_bytes":16777216,"sheet_cells":100000,"rows_first":2000,"rows_last":500,"rows_between":2000,"halvings":0,"cell_chars":16384,"cell_head_chars":4096},"cells_cut":0,"cells_raw":0,"read":"whole","date_system":"1900"}

{"sheet":"Disclaimer","index":0,"n_rows":7,"n_cols":3,"rows_kept":7,"cut":false,"hidden":false,"merged":[[6,1,15,10]]}
[]
[null,"Select Language:","English"]
[null,"Select Currency","USD($)"]
[]
[]
[null,{"$f":"'Translation '!A715","v":"Disclaimer"}]
[null,{"$f":"'Translation '!A716","v":"This tool was prepared as an account of work sponsored by an agency of the United States Government. Neither the United States Government nor any agency thereof, nor any of their employees, makes any warranty, express or implied, or assumes any legal liability or responsibility for the accuracy, completeness, or usefulness of any information, apparatus, product, or process disclosed, or represents that its use would not infringe privately owned rights. Reference herein to any specific commercial product, process, or service by trade name, trademark, manufacturer, or otherwise, does not necessarily constitute or imply its endorsement, recommendation, or favoring by the United States Government or any agency thereof. The views and opinions of authors expressed herein do not necessarily state or reflect those of the United States Government or any agency thereof."}]

{"sheet":"Instruction","index":1,"n_rows":32,"n_cols":4,"rows_kept":32,"cut":false,"hidden":false,"merged":[[29,1,29,2],[29,3,29,8],[0,0,0,8],[1,1,1,8],[24,3,24,8],[25,3,25,8],[8,1,8,8],[24,1,24,2],[9,1,9,2],[25,1,25,2],[10,1,14,2],[11,3,11,8],[19,0,21,0],[19,1,21,2],[20,3,20,8],[5,2,5,8],[9,3,9,8],[10,3,10,8],[15,3,15,8],[19,3,19,8],[22,1,23,2],[22,3,23,8],[21,3,21,8],[12,3,12,8],[13,3,13,8],[14,3,14,8],[6,0,6,8],[2,1,2,2],[3,1,3,2],[4,1,4,2],[2,3,2,8],[3,3,3,8],[4,3,4,8],[22,0,23,0],[28,1,28,2],[28,3,28,8],[10,0,14,0],[16,3,16,8],[17,3,17,8],[15,0,18,0],[15,1,18,2],[18,3,18,8],[26,1,26,2],[27,1,27,2],[26,3,26,8],[27,3,27,8]]}
[{"$f":"'Translation '!A2","v":"Plant Energy Profiler Tool - Instructions"}]
[{"$f":"'Translation '!A3","v":"Color Scheme"}]
[{"$f":"'Translation '!A4","v":"Green"},{"$f":"'Translation '!A7","v":"User input"},null,{"$f":"'Translation '!A9","v":"User input required"}]
[{"$f":"'Translation '!A5","v":"Pink"},{"$f":"'Translation '!A7","v":"User input"},null,{"$f":"'Translation '!A10","v":"Drop down list"}]
["Grey",{"$f":"'Translation '!A8","v":"NO User Input"},null,{"$f":"'Translation '!A11","v":"Formula inserted"}]
[]
["For a  detailed walkthrough of the tool, please refer to the tutorial"]
[]
[{"$f":"'Translation '!A12","v":"Content "}]
[{"$f":"'Translation '!A13","v":"Tab Title"},{"$f":"'Translation '!A14","v":"User Information "},null,{"$f":"'Translation '!A15","v":"Contains Instruction on how to fill the data collection sheet"}]
[{"$f":"'Translation '!A16","v":"Basic Info\n(Mandatory Data)"},{"$f":"'Translation '!A7","v":"User input"},null,{"$f":"'Translation '!A27","v":"Please input information on:"}]
[null,null,null,{"$f":"'Translation '!A28","v":"Industry Type"}]
[null,null,null,{"$f":"'Translation '!A29","v":"Location and Contact info for the plant"}]
[null,null,null,{"$f":"'Translation '!A30","v":"Hours of operation"}]
[null,null,null,{"$f":"'Translation '!A31","v":"General energy management questions"}]
[{"$f":"'Translation '!A17","v":"Energy & Production\n(Mandatory Data)"},{"$f":"'Translation '!A7","v":"User input"},null,{"$f":"'Translation '!A32","v":"Please input information on:"}]
[null,null,null,{"$f":"'Translation '!A33","v":"Energy Consumption of plant for 2 consecutive years"}]
[null,null,null,{"$f":"'Translation '!A34","v":"Electricity and fuel prices"}]
[null,null,null,{"$f":"'Translation '!A35","v":"Energy source for major equipment"}]
[{"$f":"'Translation '!A18","v":"Energy Use System\n(Mandatory Data)"},{"$f":"'Translation '!A7","v":"User input"},null,{"$f":"'Translation '!A36","v":"Please input information on:"}]
[null,null,null,{"$f":"'Translation '!A37","v":"Energy Systems present in a plant, their energy consumption, annual cost running the systems"}]
[null,null,null,{"$f":"'Translation '!A38","v":"Rating of major Equipment and their Annual  Operating hours."}]
[{"$f":"'Translation '!A19","v":"Energy Saving Opportunities (Mandatory Data)"},{"$f":"'Translation '!A7","v":"User input"},null,{"$f":"'Translation '!A39","v":"Use this screen to characterize the potential energy savings opportunities for the various major systems in your plant. "}]
[]
[{"$f":"'Translation '!A20","v":"CHP (Scorecard)"},{"$f":"'Translation '!A7","v":"User input"},null,{"$f":"'Translation '!A40","v":"Please answer the questions in this form if the CHP system is present in your plant  "}]
[{"$f":"'Translation '!A21","v":"Compressed Air (Scorecard)"},{"$f":"'Translation '!A7","v":"User input"},null,{"$f":"'Translation '!A41","v":"Please answer the questions in this form if the Compressed Air system is present in your plant  "}]
[{"$f":"'Translation '!A22","v":"Process Cooling and Refrigeration (Scorecard)"},{"$f":"'Translation '!A7","v":"User input"},null,{"$f":"'Translation '!A42","v":"Please answer the questions in this form if the Process Cooling and Refrigeration system is present in your plant  "}]
[{"$f":"'Translation '!A23","v":"Process Heating (Scorecard)"},{"$f":"'Translation '!A7","v":"User input"},null,{"$f":"'Translation '!A43","v":"Please answer the questions in this form if the Process Heating system is present in your plant  "}]
[{"$f":"'Translation '!A24","v":"Pumps (Scorecard)"},{"$f":"'Translation '!A7","v":"User input"},null,{"$f":"'Translation '!A44","v":"Please answer the questions in this form if the Pump system is present in your plant  "}]
[{"$f":"'Translation '!A25","v":"Steam Generation Equipment (Scorecard)"},{"$f":"'Translation '!A7","v":"User input"},null,{"$f":"'Translation '!A45","v":"Please answer the questions in this form if the Steam Generation Equipment are present in your plant  "}]
[]
["If you have any comments or questions, please contact: Thomas Wenning (wenningtj@ornl.gov) or Sachin Nimbalkar (nimbalkarsu@ornl.gov) "]

{"sheet":"Basic Info ","index":2,"n_rows":30,"n_cols":8,"rows_kept":30,"cut":false,"hidden":false,"merged":[[17,7,17,11],[18,7,18,11],[0,0,0,11],[1,0,1,11],[2,1,2,5],[2,7,2,11],[3,1,3,5],[3,7,3,11],[16,1,16,3],[16,7,16,11],[4,7,4,11],[5,1,5,5],[5,7,5,11],[6,1,6,5],[6,7,6,11],[7,1,7,5],[7,7,7,11],[4,1,4,5],[16,4,16,5],[8,0,10,0],[8,1,10,11],[11,0,13,1],[11,2,13,11],[15,0,15,11],[17,1,17,3],[18,1,18,3],[17,4,17,5],[18,4,18,5],[25,0,25,6],[25,7,25,11],[19,1,19,3],[19,7,19,11],[20,1,20,3],[20,7,20,11],[21,1,21,3],[21,7,21,11],[24,0,24,6],[24,7,24,11],[19,4,19,5],[20,4,20,5],[21,4,21,5],[29,0,29,6],[29,7,29,11],[26,0,26,6],[26,7,26,11],[27,0,27,6],[27,7,27,11],[28,0,28,6],[28,7,28,11]]}
[{"$f":"'Translation '!A46","v":"Basic Plant Information"}]
[{"$f":"'Translation '!A47","v":"Plant Contact Information:"}]
[{"$f":"'Translation '!A48","v":"Corporation Name:"},null,null,null,null,null,{"$f":"'Translation '!A56","v":"Location:"}]
[{"$f":"'Translation '!A49","v":"Plant Name:"},null,null,null,null,null,{"$f":"'Translation '!A57","v":"Primary Contact for Assessment:"}]
[{"$f":"'Translation '!A50","v":"Primary Product:"},null,null,null,null,null,{"$f":"'Translation '!A58","v":"Address"}]
[{"$f":"'Translation '!A51","v":"Industry Type:"},null,null,null,null,null,{"$f":"'Translation '!A59","v":"Phone:"}]
[{"$f":"'Translation '!A52","v":"NAICS Code"},null,null,null,null,null,{"$f":"'Translation '!A60","v":"Fax-No:"}]
[{"$f":"'Translation '!A53","v":"Specify if other:"},null,null,null,null,null,{"$f":"'Translation '!A61","v":"E-mail:"}]
[{"$f":"'Translation '!A54","v":"Plant's Safety Protocol:"}]
[]
[]
[{"$f":"'Translation '!A55","v":"Specific Problems or Ideas of Interest related to Plant's Energy use:"}]
[]
[]
[]
[{"$f":"'Translation '!A62","v":"Plant's Operating Schedule:"}]
[{"$f":"'Translation '!A63","v":"Shift No."},{"$f":"'Translation '!A64","v":"Hours of Operation/ Day"},null,null,{"$f":"'Translation '!A65","v":"Days/Week"},null,{"$f":"'Translation '!A66","v":"Weeks/ Year"},"Annual Hours"]
[{"$f":"'Translation '!A67","v":1},null,null,null,null,null,null,{"$f":"IF(B18*E18*G18>0,B18*E18*G18,\"\")","v":""}]
[{"$f":"'Translation '!A68","v":2},null,null,null,null,null,null,{"$f":"IF(B19*E19*G19>0,B19*E19*G19,\"\")","v":""}]
[{"$f":"'Translation '!A69","v":3},null,null,null,null,null,null,""]
[{"$f":"'Translation '!A70","v":"Office Hours"},null,null,null,null,null,null,""]
[{"$f":"'Translation '!A71","v":"Others"},null,null,null,null,null,null,""]
[]
[]
[{"$f":"'Translation '!A72","v":"Energy Management Questions:"},null,null,null,null,null,null,{"$f":"'Translation '!A73","v":"Please select the answers from the drop down list"}]
[{"$f":"'Translation '!A74","v":"Does your company have a formal written Energy Management Plan?"}]
[{"$f":"'Translation '!A75","v":"Have you formed Energy Management Team at your plant?"}]
[{"$f":"'Translation '!A76","v":"Does your company have a formal method of communication in place for employees?"}]
[{"$f":"'Translation '!A77","v":"Does your company use life cycle cost analysis to evaluate the economics of Energy Efficient equipment when making new purchase of large system?"}]
[{"$f":"'Translation '!A78","v":"Does your company establish required payback periods for energy efficient improvement projects?"}]

{"sheet":"Energy & Production ","index":3,"n_rows":89,"n_cols":12,"rows_kept":89,"cut":false,"hidden":false,"merged":[[60,0,60,5],[14,0,14,11],[58,1,58,2],[55,1,55,2],[56,1,56,2],[55,8,58,8],[56,4,56,5],[57,4,57,5],[58,4,58,5],[57,1,57,2],[55,6,58,6],[55,7,58,7],[55,4,55,5],[52,1,52,2],[17,8,18,8],[17,5,18,5],[17,1,18,1],[17,2,18,2],[17,3,18,3],[17,4,18,4],[52,3,52,8],[51,0,51,8],[0,0,0,11],[1,0,1,11],[47,0,48,0],[47,1,47,11],[48,1,48,11],[17,7,18,7],[4,0,4,2],[5,0,5,2],[17,6,18,6],[17,0,18,0],[13,1,13,11],[8,0,8,11],[10,3,10,4],[9,3,9,4],[6,0,6,2],[11,3,11,4],[68,1,68,2],[68,3,68,4],[65,1,65,2],[65,3,65,4],[66,1,66,2],[85,9,88,9],[85,7,88,7],[85,5,85,6],[87,1,87,2],[88,1,88,2],[85,1,85,2],[86,5,86,6],[87,5,87,6],[86,1,86,2],[88,5,88,6],[85,3,85,4],[86,3,86,4],[87,3,87,4],[88,3,88,4],[82,1,82,2],[83,1,84,2],[83,0,84,0],[83,5,84,6],[85,8,88,8],[83,3,84,4],[2,0,3,11],[66,3,66,4],[67,1,67,2],[67,3,67,4],[81,0,81,11],[53,0,54,0],[53,1,54,2],[53,3,54,3],[53,4,54,5],[72,1,72,11],[71,0,71,11],[69,1,69,2],[69,3,69,4],[61,0,63,0],[61,1,62,5],[63,1,63,5]]}
[{"$f":"'Translation '!A79","v":"Plant's Energy Consumption & Production Overview"}]
[{"$f":"'Translation '!A80","v":"Instructions:"}]
[{"$f":"'Translation '!A81","v":"Please respond to the following questions on Plant's energy consumption and product overview."}]
[]
[{"$f":"'Translation '!A83","v":"Input values in cells colored in green"}]
[{"$f":"'Translation '!A84","v":"Select from the drop down menu in the cells colored in pink"}]
[{"$f":"'Translation '!A85","v":"Please DO NOT insert any value in cells colored in grey"}]
[]
[{"$f":"'Translation '!A837","v":"Units of Measurement:"}]
[{"$f":"'Translation '!A838","v":"Unit for Electricity"},null,null,{"$f":"'Translation '!A841","v":"Other Fuel"}]
[{"$f":"'Translation '!A839","v":"Unit for Natural Gas"},null,null,{"$f":"'Translation '!A842","v":"Unit for Other fuel"}]
[{"$f":"'Translation '!A840","v":"Unit for Steam"},null,null,{"$f":"'Translation '!A843","v":"Output Energy Metric"}]
[]
[{"$f":"'Translation '!A86","v":"Note:"},{"$f":"'Translation '!A87","v":"Please provide either monthly or annual energy and production data. While most of the PEPEx results can be generated with just the annual data, some of them graphs/tables make use of monthly data.   "}]
[{"$f":"'Translation '!A88","v":"Facility's Energy and Production Data:"}]
["Data Interval"]
[{"$f":"'Translation '!A89","v":"Year 1 ( Baseline Year):"}]
[{"$f":"'Translation '!A90","v":"Month"},{"$f":"'Translation '!A91","v":"Monthly Site Electricity Consumption(0)"},{"$f":"'Translation '!A92","v":"Total Monthly Electricity Cost($)"},{"$f":"'Translation '!A93","v":"Monthly Natural Gas Consumption(0)"},{"$f":"'Translation '!A94","v":"Total Monthly Natural Gas Cost ($)"},{"$f":"'Translation '!A95","v":"Monthly Steam Consumption (0)"},{"$f":"'Translation '!$A$96","v":"Total Monthly Steam Consumption Cost ($)"},{"$f":"'Translation '!$A$97","v":"Monthly Other Fuel Consumption (0)"},{"$f":"'Translation '!$A$98","v":"Total Monthly Other Fuel Cost ($)"},{"$f":"'Translation '!A99","v":"Monthly Production (Product 1)"},{"$f":"'Translation '!A100","v":"Monthly Production (Product 2)"},{"$f":"'Translation '!A101","v":"Monthly Production (Product 3)"}]
[null,null,null,null,null,null,null,null,null,"Unit","Unit","Unit"]
[{"$f":"'Translation '!A102","v":"January"}]
[{"$f":"'Translation '!A103","v":"February"}]
[{"$f":"'Translation '!A104","v":"March"}]
[{"$f":"'Translation '!A105","v":"April"}]
[{"$f":"'Translation '!A106","v":"May"}]
[{"$f":"'Translation '!A107","v":"June"}]
[{"$f":"'Translation '!A108","v":"July"}]
[{"$f":"'Translation '!A109","v":"August"}]
[{"$f":"'Translation '!A110","v":"September"}]
[{"$f":"'Translation '!A111","v":"October"}]
[{"$f":"'Translation '!A112","v":"November"}]
[{"$f":"'Translation '!A113","v":"December"}]
[{"$f":"'Translation '!A115","v":"Year 1 - Grand Total"},{"$f":"SUM(B20:B31)","v":0},0,0,0,0,0,0,0,0,0,0]
[{"$f":"'Translation '!A114","v":"Year 2:"},{"$f":"B17+1","v":1}]
[{"$f":"'Translation '!A102","v":"January"}]
[{"$f":"'Translation '!A103","v":"February"}]
[{"$f":"'Translation '!A104","v":"March"}]
[{"$f":"'Translation '!A105","v":"April"}]
[{"$f":"'Translation '!A106","v":"May"}]
[{"$f":"'Translation '!A107","v":"June"}]
[{"$f":"'Translation '!A108","v":"July"}]
[{"$f":"'Translation '!A109","v":"August"}]
[{"$f":"'Translation '!A110","v":"September"}]
[{"$f":"'Translation '!A111","v":"October"}]
[{"$f":"'Translation '!A112","v":"November"}]
[{"$f":"'Translation '!A113","v":"December"}]
[{"$f":"'Translation '!A116","v":"Year 2- Grand Total"},{"$f":"SUM(B34:B45)","v":0},0,0,0,0,0,0,0,0,0,0]
[]
[{"$f":"'Translation '!A80","v":"Instructions:"},{"$f":"'Translation '!A117","v":"1) For each energy stream you will need to enter account information for each meter for which you have data. For each account enter a Meter ID or name, enter the Annual Energy consumption, Energy Type, Total Annual Cost for 2 consecutive year. "}]
[null,{"$f":"'Translation '!A118","v":"2) Other Fuels include Coal, Diesel or nay other fuel that is used in Plant"}]
[]
[]
[{"$f":"'Translation '!A119","v":"Total Annual Energy Consumption for the Baseline Year "}]
["1900-01-05",null,null,"Note: If you do not have the annual cost spent, kindly leave the associated cells blank and provide an average unit price in cells B67-B70."]
[{"$f":"'Translation '!A120","v":"Energy Type"},{"$f":"'Translation '!A122","v":"Annual Energy Use (SITE)"},null,{"$f":"'Translation '!A123","v":"Unit"},{"$f":"'Translation '!A124","v":"Annual Cost of Energy($)"},null,{"$f":"'Translation '!A126","v":"Annual Production (Product 1) "},{"$f":"'Translation '!A127","v":"Annual Production (Product 2)"},{"$f":"'Translation '!A128","v":"Annual Production (Product 3 )"}]
[null,null,null,null,null,null,{"$f":"'Translation '!A123","v":"Unit"},{"$f":"'Translation '!A123","v":"Unit"},{"$f":"'Translation '!A123","v":"Unit"}]
[{"$f":"'Translation '!A129","v":"Electricity"},null,null,{"$f":"B10","v":0}]
[{"$f":"'Translation '!A130","v":"Natural Gas"},null,null,{"$f":"B11","v":0}]
[{"$f":"'Translation '!A131","v":"Steam"},null,null,{"$f":"B12","v":0}]
[{"$f":"'Translation '!A132","v":"Other Fuel"},null,null,{"$f":"F11","v":0}]
[]
[{"$f":"'Translation '!A133","v":"Unit Cost of Energy:"}]
[{"$f":"'Translation '!A80","v":"Instructions:"},{"$f":"'Translation '!A135","v":"1) Please provide unit costs for different energy types used in your plant if the associated costs were not provided in the section above."}]
[]
[null,{"$f":"'Translation '!A136","v":"2) Please provide steam cost only if user is buying steam from an utility or a third-party enterprise."}]
[]
[{"$f":"'Translation '!A134","v":"Energy Type"},{"$f":"'Translation '!A138","v":"Unit Price"},null,{"$f":"'Translation '!A123","v":"Unit"}]
[{"$f":"'Translation '!A129","v":"Electricity"},null,null,{"$f":"CONCATENATE(List!G48,\"/\",B10)","v":"$/"}]
[{"$f":"'Translation '!A130","v":"Natural Gas"},null,null,{"$f":"CONCATENATE(List!G49,\"/\",B11)","v":"$/"}]
[{"$f":"'Translation '!A131","v":"Steam"},null,null,{"$f":"CONCATENATE(List!G50,\"/\",B12)","v":"$/"}]
[{"$f":"'Translation '!A132","v":"Other Fuel"},null,null,{"$f":"CONCATENATE(List!G51,\"/\",F11)","v":"$/"}]
[]
[{"$f":"'Translation '!A139","v":"Site to Source Conversion Factors"}]
[{"$f":"'Translation '!A80","v":"Instructions:"},"Source Energy factor is used to calculate the source energy for each energy stream. Source energy incorporates all transmission, delivery and production losses associated with each energy stream. It is calculated by all multiplying the site energy by source energy factor. The default source factor for each stream is provided , based on those used in Energy Star Portfolio Manager. User may use their own source factor for each energy stream e.g. to account for electricity produced from co-generation, renewable sources, etc. Note: PEPEx calculates all its results in terms of \"site energy\" unless explicitily stated."]
[]
[{"$f":"'Translation '!A137","v":"Energy Type"},{"$f":"'Translation '!A141","v":"Site-to-Source Conversion Factor"}]
[{"$f":"'Translation '!A129","v":"Electricity"},3.14]
[{"$f":"'Translation '!A130","v":"Natural Gas"},1.05]
[{"$f":"'Translation '!A131","v":"Steam"},1.2]
[{"$f":"'Translation '!A132","v":"Other Fuel"},1]
[]
[]
[{"$f":"'Translation '!A142","v":"Total Annual Energy Consumption "}]
[{"$f":"'Translation '!A89","v":"Year 1 ( Baseline Year):"},{"$f":"B53","v":0}]
[{"$f":"'Translation '!A120","v":"Energy Type"},{"$f":"CONCATENATE(\"Total Annual Energy Consumption (Site) (\",F12,\")\")","v":"Total Annual Energy Consumption (Site) ()"},null,{"$f":"CONCATENATE(\"Total Annual Energy Consumption (Source) (\",F12,\")\")","v":"Total Annual Energy Consumption (Source) ()"},null,{"$f":"'Translation '!A124","v":"Annual Cost of Energy($)"},null,{"$f":"'Translation '!A126","v":"Annual Production (Product 1) "},{"$f":"'Translation '!A127","v":"Annual Production (Product 2)"},{"$f":"'Translation '!A128","v":"Annual Production (Product 3 )"}]
[null,null,null,null,null,null,null,{"$f":"G55","v":"Unit"},{"$f":"H55","v":"Unit"},{"$f":"I55","v":"Unit"}]
[{"$f":"'Translation '!A129","v":"Electricity"},{"$f":"IFERROR(IF(B16=\"Monthly\",B32*'NAICS Data-Base'!G64,IF(B16=\"Annual\",B56*'NAICS Data-Base'!G64)),0)","v":false},null,{"$f":"IF(B16=\"Monthly\",B32*B76*'NAICS Data-Base'!G64,IF(B16=\"Annual\",B56*B76*'NAICS Data-Base'!G64,\"\"))","v":""},null,{"$f":"IFERROR(IF(OR(C32>0,E56>0)=TRUE,IF(B16=\"Monthly\",C32,IF(B16=\"Annual\",E56,\"NA\")),B67*Total_Electricity/'NAICS Data-Base'!G64),\"\")","v":""},null,{"$f":"IFERROR(IF($B$16=\"Monthly\",J32,IF($B$16=\"Annual\",G56)),0)","v":false},{"$f":"IFERROR(IF($B$16=\"Monthly\",K32,IF($B$16=\"Annual\",H56)),0)","v":false},false]
[{"$f":"'Translation '!A130","v":"Natural Gas"},{"$f":"IFERROR(IF(B16=\"Monthly\",D32*'NAICS Data-Base'!G65,IF(B16=\"Annual\",B57*'NAICS Data-Base'!G65)),0)","v":false},null,{"$f":"IF(B16=\"Monthly\",D32*B77*'NAICS Data-Base'!G65,IF(B16=\"Annual\",B57*B77*'NAICS Data-Base'!G65,\"\"))","v":""},null,{"$f":"IFERROR(IF(OR(E32>0,E57>0)=TRUE,IF(B16=\"Monthly\",E32,IF(B16=\"Annual\",E57,\"NA\")),B68*Total_NG/'NAICS Data-Base'!G65),\"\")","v":""}]
[{"$f":"'Translation '!A131","v":"Steam"},{"$f":"IFERROR(IF(B16=\"Monthly\",F32*'NAICS Data-Base'!G66,IF(B16=\"Annual\",B58*'NAICS Data-Base'!G66)),0)","v":false},null,{"$f":"IF(B16=\"Monthly\",F32*B78*'NAICS Data-Base'!G66,IF(B16=\"Annual\",B58*B78*'NAICS Data-Base'!G66,\"\"))","v":""},null,{"$f":"IFERROR(IF(OR(G32>0,E58>0)=TRUE,IF(B16=\"Monthly\",G32,IF(B16=\"Annual\",E58,\"NA\")),B69*Total_Steam/'NAICS Data-Base'!G66),\"\")","v":""}]
[{"$f":"'Translation '!A132","v":"Other Fuel"},{"$f":"IFERROR(IF(B16=\"Monthly\",H32*'NAICS Data-Base'!G67,IF(B16=\"Annual\",B59*'NAICS Data-Base'!G67)),0)","v":false},null,{"$f":"IF(B16=\"Monthly\",H32*B79*'NAICS Data-Base'!G67,IF(B16=\"Annual\",B59*B79*'NAICS Data-Base'!G67,\"\"))","v":""},null,{"$f":"IFERROR(IF(OR(I32>0,E59>0)=TRUE,IF(B16=\"Monthly\",I32,IF(B16=\"Annual\",E59,\"NA\")),B70*Total_OF/'NAICS Data-Base'!G67),\"\")","v":""}]

{"sheet":"Energy Use System","index":4,"n_rows":83,"n_cols":10,"rows_kept":83,"cut":false,"hidden":false,"merged":[[23,0,23,1],[39,0,39,1],[25,0,25,1],[31,0,31,1],[28,0,28,1],[24,0,24,1],[26,0,26,1],[27,0,27,1],[32,0,32,1],[34,0,34,1],[33,0,33,1],[37,0,37,1],[9,1,11,6],[0,0,0,6],[22,0,22,1],[29,0,29,1],[30,0,30,1],[1,0,1,6],[19,1,19,6],[4,0,4,5],[5,0,5,5],[12,1,14,6],[21,0,21,8],[2,0,3,6],[15,1,17,6],[6,0,6,5],[9,0,19,0],[18,1,18,6],[48,0,48,1],[43,0,43,1],[46,0,46,1],[47,0,47,1],[44,0,44,1],[7,0,7,5],[53,3,53,5],[54,3,54,4],[67,1,67,9],[66,0,66,9],[49,0,49,1],[55,3,55,4],[56,3,56,4],[57,3,57,4],[58,3,58,4],[42,0,42,1],[45,0,45,1],[40,0,40,1],[38,0,38,1],[36,0,36,8],[41,0,41,1]]}
[{"$f":"'Translation '!A144","v":"Energy Use Systems Used in the Plant"}]
[{"$f":"'Translation '!A80","v":"Instructions:"}]
[{"$f":"'Translation '!A145","v":"Please respond to the following questions on energy use systems used in the plant."}]
[]
[{"$f":"'Translation '!A83","v":"Input values in cells colored in green"}]
[{"$f":"'Translation '!A84","v":"Select from the drop down menu in the cells colored in pink"}]
[{"$f":"'Translation '!A85","v":"Please DO NOT insert any value in cells colored in grey"}]
["Auto populated output cells"]
[]
[{"$f":"'Translation '!A80","v":"Instructions:"},{"$f":"CONCATENATE('Translation '!A147,\" \",'Translation '!B146)","v":"1) Please select the systems present in your plant and choose the associated energy sources in Cells C24 - E35. Select Not Applicable (N/A) if the system is not present in your plant."}]
[]
[]
[null,{"$f":"'Translation '!A148","v":"2) If known, provide the percent energy distribution by fuel type for the different systems used in your plant in cells F24 - G35. PEPEx uses \"Default\" numbers if this information is not provided."}]
[]
[]
[null,{"$f":"'Translation '!A149","v":"3) The table Energy Use Systems Used in the Plant (Default) provides U.S. default percentages for you based on the industry that you selected in the Basic Information sheet (Tab 2). "}]
[]
[]
[null,{"$f":"'Translation '!A150","v":"4) Default energy distribution values are based on the Energy Information Administration 2010 Manufacturing Energy Consumption Survey (MECS) for all industries except cement. Default energy distributions for the cement industry were updated to more accurately portray the industry norm by Dr. Ali Hasanbeigi of the Lawrence Berkeley National Laboratory on December 7, 2011."}]
[null,{"$f":"'Translation '!A151","v":"5) If the user wants to use default value kindly select the systems present in your plant and the type of energy source used for the system (in cells Cells C24 - E35.) and leave the cells F24 - G35 blank. "}]
[]
[{"$f":"'Translation '!A152","v":"Energy Consumption Systems Utilized in the Plant - User Defined:"}]
[{"$f":"'Translation '!A153","v":"System "},null,{"$f":"'Translation '!A154","v":"Energy System in use (Please select Yes/No)"},{"$f":"'Translation '!A155","v":"Primary Energy Source"},{"$f":"'Translation '!A156","v":"Secondary Energy Source"},{"$f":"'Translation '!A157","v":"% Primary Energy Source"},{"$f":"'Translation '!A158","v":"% Secondary Energy Source"},{"$f":"'Translation '!A159","v":"Annual Consumption(0)"},{"$f":"'Translation '!A160","v":"Annual Cost($)"}]
[{"$f":"'Translation '!A161","v":"Combined Heat and Power (Cogeneration)"},null,null,null,null,null,null,{"$f":"'NAICS Data-Base'!J72","v":0},{"$f":"'NAICS Data-Base'!M72","v":0}]
[{"$f":"'Translation '!A162","v":"Compressed Air"},null,null,null,null,null,null,{"$f":"'NAICS Data-Base'!J73","v":0},{"$f":"'NAICS Data-Base'!M73","v":0}]
[{"$f":"'Translation '!A163","v":"Electrochemical Processes"},null,null,null,null,null,null,{"$f":"'NAICS Data-Base'!J74","v":0},{"$f":"'NAICS Data-Base'!M74","v":0}]
[{"$f":"'Translation '!A164","v":"Fans and Blowers"},null,null,null,null,null,null,{"$f":"'NAICS Data-Base'!J75","v":0},{"$f":"'NAICS Data-Base'!M75","v":0}]
[{"$f":"'Translation '!A165","v":"Industrial Facilities (Lighting)"},null,null,null,null,null,null,{"$f":"'NAICS Data-Base'!J76","v":0},{"$f":"'NAICS Data-Base'!M76","v":0}]
[{"$f":"'Translation '!A166","v":"Industrial Facilities (HVAC)"},null,null,null,null,null,null,{"$f":"'NAICS Data-Base'!J77","v":0},{"$f":"'NAICS Data-Base'!M77","v":0}]
[{"$f":"'Translation '!A167","v":"Material Handling"},null,null,null,null,null,null,{"$f":"'NAICS Data-Base'!J78","v":0},{"$f":"'NAICS Data-Base'!M78","v":0}]
[{"$f":"'Translation '!A168","v":"Material Processing"},null,null,null,null,null,null,{"$f":"'NAICS Data-Base'!J79","v":0},{"$f":"'NAICS Data-Base'!M79","v":0}]
[{"$f":"'Translation '!A169","v":"Process Cooling and Refrigeration"},null,null,null,null,null,null,{"$f":"'NAICS Data-Base'!J80","v":0},{"$f":"'NAICS Data-Base'!M80","v":0}]
[{"$f":"'Translation '!A170","v":"Process Heating"},null,null,null,null,null,null,{"$f":"'NAICS Data-Base'!J81","v":0},{"$f":"'NAICS Data-Base'!M81","v":0}]
[{"$f":"'Translation '!A171","v":"Pumps"},null,null,null,null,null,null,{"$f":"'NAICS Data-Base'!J82","v":0},{"$f":"'NAICS Data-Base'!M82","v":0}]
[{"$f":"'Translation '!A172","v":"Steam Generation Equipment"},null,null,null,null,null,null,{"$f":"'NAICS Data-Base'!J83","v":0},{"$f":"'NAICS Data-Base'!M83","v":0}]
[]
[{"$f":"'Translation '!A174","v":"Energy Consumption Systems Utilized in the Plant - Default (Default values are used when user defined values are not provided):"}]
[{"$f":"'Translation '!A153","v":"System "},null,{"$f":"'Translation '!A154","v":"Energy System in use (Please select Yes/No)"},{"$f":"'Translation '!A155","v":"Primary Energy Source"},{"$f":"'Translation '!A156","v":"Secondary Energy Source"},{"$f":"'Translation '!A157","v":"% Primary Energy Source"},{"$f":"'Translation '!A158","v":"% Secondary Energy Source"},{"$f":"H23","v":"Annual Consumption(0)"},{"$f":"I23","v":"Annual Cost($)"}]
[{"$f":"'Translation '!A161","v":"Combined Heat and Power (Cogeneration)"},null,{"$f":"C24","v":0},0,0,{"$f":"'NAICS Data-Base'!F88","v":0},{"$f":"'NAICS Data-Base'!G88","v":0},{"$f":"'NAICS Data-Base'!J88","v":0},{"$f":"'NAICS Data-Base'!M88","v":0}]
[{"$f":"'Translation '!A162","v":"Compressed Air"},null,0,0,0,{"$f":"'NAICS Data-Base'!F89","v":0},{"$f":"'NAICS Data-Base'!G89","v":0},{"$f":"'NAICS Data-Base'!J89","v":0},{"$f":"'NAICS Data-Base'!M89","v":0}]
[{"$f":"'Translation '!A163","v":"Electrochemical Processes"},null,0,0,0,{"$f":"'NAICS Data-Base'!F90","v":0},{"$f":"'NAICS Data-Base'!G90","v":0},{"$f":"'NAICS Data-Base'!J90","v":0},{"$f":"'NAICS Data-Base'!M90","v":0}]
[{"$f":"'Translation '!A164","v":"Fans and Blowers"},null,{"$f":"C27","v":0},0,0,{"$f":"'NAICS Data-Base'!F91","v":0},{"$f":"'NAICS Data-Base'!G91","v":0},{"$f":"'NAICS Data-Base'!J91","v":0},{"$f":"'NAICS Data-Base'!M91","v":0}]
[{"$f":"'Translation '!A165","v":"Industrial Facilities (Lighting)"},null,{"$f":"C28","v":0},0,0,{"$f":"'NAICS Data-Base'!F92","v":0},{"$f":"'NAICS Data-Base'!G92","v":0},{"$f":"'NAICS Data-Base'!J92","v":0},{"$f":"'NAICS Data-Base'!M92","v":0}]
[{"$f":"'Translation '!A166","v":"Industrial Facilities (HVAC)"},null,0,0,0,{"$f":"'NAICS Data-Base'!F93","v":0},{"$f":"'NAICS Data-Base'!G93","v":0},{"$f":"'NAICS Data-Base'!J93","v":0},{"$f":"'NAICS Data-Base'!M93","v":0}]
[{"$f":"'Translation '!A167","v":"Material Handling"},null,0,0,0,{"$f":"'NAICS Data-Base'!F94","v":0},{"$f":"'NAICS Data-Base'!G94","v":0},{"$f":"'NAICS Data-Base'!J94","v":0},{"$f":"'NAICS Data-Base'!M94","v":0}]
[{"$f":"'Translation '!A168","v":"Material Processing"},null,0,0,0,{"$f":"'NAICS Data-Base'!F95","v":0},{"$f":"'NAICS Data-Base'!G95","v":0},{"$f":"'NAICS Data-Base'!J95","v":0},{"$f":"'NAICS Data-Base'!M95","v":0}]
[{"$f":"'Translation '!A169","v":"Process Cooling and Refrigeration"},null,0,0,0,{"$f":"'NAICS Data-Base'!F96","v":0},{"$f":"'NAICS Data-Base'!G96","v":0},{"$f":"'NAICS Data-Base'!J96","v":0},{"$f":"'NAICS Data-Base'!M96","v":0}]
[{"$f":"'Translation '!A170","v":"Process Heating"},null,0,0,0,{"$f":"'NAICS Data-Base'!F97","v":0},{"$f":"'NAICS Data-Base'!G97","v":0},{"$f":"'NAICS Data-Base'!J97","v":0},{"$f":"'NAICS Data-Base'!M97","v":0}]
[{"$f":"'Translation '!A171","v":"Pumps"},null,0,0,0,{"$f":"'NAICS Data-Base'!F98","v":0},{"$f":"'NAICS Data-Base'!G98","v":0},{"$f":"'NAICS Data-Base'!J98","v":0},{"$f":"'NAICS Data-Base'!M98","v":0}]
[{"$f":"'Translation '!A172","v":"Steam Generation Equipment"},null,0,0,0,{"$f":"'NAICS Data-Base'!F99","v":0},{"$f":"'NAICS Data-Base'!G99","v":0},{"$f":"'NAICS Data-Base'!J99","v":0},{"$f":"'NAICS Data-Base'!M99","v":0}]
[null,null,null,null,null,null,null,"Energy use for any given source cannot exceed 100%."]
[]
[]
[null,null,null,"Modeled Energy Usage (Cross-check)"]
[null,null,null,"Energy Source",null,"% Energy Use (Defined)"]
[null,null,null,{"$f":"'Translation '!A129","v":"Electricity"},null,{"$f":"SUMIF($E$39:$E$50,\"=\"&D56,$G$39:$G$50)+SUMIF($D$39:$D$50,\"=\"&D56,$F$39:$F$50)","v":0}]
[null,null,null,{"$f":"'Translation '!A130","v":"Natural Gas"},null,{"$f":"SUMIF($E$39:$E$50,\"=\"&D57,$G$39:$G$50)+SUMIF($D$39:$D$50,\"=\"&D57,$F$39:$F$50)","v":0}]
[null,null,null,{"$f":"'Translation '!A131","v":"Steam"},null,{"$f":"SUMIF($E$39:$E$50,\"=\"&D58,$G$39:$G$50)+SUMIF($D$39:$D$50,\"=\"&D58,$F$39:$F$50)","v":0}]
[null,null,null,{"$f":"'Translation '!A132","v":"Other Fuel"},null,{"$f":"SUMIF($E$39:$E$50,\"=\"&D59,$G$39:$G$50)+SUMIF($D$39:$D$50,\"=\"&D59,$F$39:$F$50)","v":0}]
[]
[]
[]
[]
[]
[]
[]
[{"$f":"'Translation '!A175","v":"Rating of Major Equipment in the Plant:"}]
[{"$f":"'Translation '!A80","v":"Instructions:"},{"$f":"'Translation '!A176","v":"Please provide the quantity, rated size, unit for rated size, % load factor and annual hours of operation  for the major equipment used in the plant."}]
[{"$f":"'Translation '!A153","v":"System "},{"$f":"'Translation '!A177","v":"Quantity"},{"$f":"'Translation '!A178","v":"Total Rated Size"},{"$f":"'Translation '!A179","v":"Unit for Rated Size"},"Energy Source",{"$f":"'Translation '!B180","v":"% Load factor"},{"$f":"'Translation '!B181","v":"Annual Hours of Operation (hr/year) "},"% System Efficiency",{"$f":"H23","v":"Annual Consumption(0)"},"Percent of Energy Source"]
["CHP - Primary ",null,null,null,{"$f":"D24","v":0},null,null,null,{"$f":"'Energy Breakdown Calculations'!J5","v":""},{"$f":"'Energy Breakdown Calculations'!K5","v":""}]
["CHP - Secondary ",null,null,null,{"$f":"E24","v":0},null,null,null,{"$f":"'Energy Breakdown Calculations'!J6","v":""},{"$f":"'Energy Breakdown Calculations'!K6","v":""}]
["Air Compressors",2,50,"HP",{"$f":"D25","v":0},0.3,6000,0.75,{"$f":"'Energy Breakdown Calculations'!J7","v":""},{"$f":"'Energy Breakdown Calculations'!K7","v":""}]
[{"$f":"A41","v":"Electrochemical Processes"},null,null,null,{"$f":"D26","v":0},null,null,null,{"$f":"'Energy Breakdown Calculations'!J8","v":""},{"$f":"'Energy Breakdown Calculations'!K8","v":""}]
["Fans and Blowers",null,null,null,0,null,null,null,{"$f":"'Energy Breakdown Calculations'!J9","v":""},{"$f":"'Energy Breakdown Calculations'!K9","v":""}]
["Industrial Facilities (Lighting)",null,null,null,0,null,null,null,{"$f":"'Energy Breakdown Calculations'!J10","v":""},{"$f":"'Energy Breakdown Calculations'!K10","v":""}]
["Industrial Facilities (HVAC)",null,null,null,0,null,null,null,{"$f":"'Energy Breakdown Calculations'!J11","v":""},{"$f":"'Energy Breakdown Calculations'!K11","v":""}]
["Material Handling",null,null,null,0,null,null,null,{"$f":"'Energy Breakdown Calculations'!J12","v":""},{"$f":"'Energy Breakdown Calculations'!K12","v":""}]
["Material Processing",null,null,null,0,null,null,null,{"$f":"'Energy Breakdown Calculations'!J13","v":""},{"$f":"'Energy Breakdown Calculations'!K13","v":""}]
["Process Cooling and Refrigeration",null,null,null,0,null,null,null,{"$f":"'Energy Breakdown Calculations'!J14","v":""},{"$f":"'Energy Breakdown Calculations'!K14","v":""}]
["Process Heating",null,null,null,0,null,null,null,{"$f":"'Energy Breakdown Calculations'!J15","v":""},{"$f":"'Energy Breakdown Calculations'!K15","v":""}]
["Pumps",null,null,null,0,null,null,null,{"$f":"'Energy Breakdown Calculations'!J16","v":""},{"$f":"'Energy Breakdown Calculations'!K16","v":""}]
["Steam Generation Equipment",null,null,null,0,null,null,null,{"$f":"'Energy Breakdown Calculations'!J17","v":""},{"$f":"'Energy Breakdown Calculations'!K17","v":""}]
["Other"]

{"sheet":"Energy Saving Opportunities","index":5,"n_rows":31,"n_cols":7,"rows_kept":31,"cut":false,"hidden":false,"merged":[[35,0,35,2],[31,3,31,9],[32,3,32,9],[33,3,33,9],[34,3,34,9],[35,3,35,9],[34,0,34,2],[30,0,30,2],[30,3,30,9],[31,0,31,2],[32,0,32,2],[33,0,33,2],[29,0,29,2],[29,3,29,9],[16,0,16,5],[16,6,16,9],[17,0,17,5],[17,6,17,9],[18,0,18,5],[18,6,18,9],[19,0,19,5],[19,6,19,9],[20,0,20,5],[20,6,20,9],[22,0,22,5],[22,6,22,9],[21,0,21,5],[21,6,21,9],[0,0,0,9],[8,2,8,9],[15,0,15,5],[15,6,15,9],[1,0,1,9],[4,0,4,7],[4,8,4,9],[5,0,5,7],[13,0,13,9],[8,0,9,1],[9,2,9,9],[5,8,5,9],[6,0,6,9],[11,0,11,9],[12,0,12,9],[2,0,3,9],[26,0,26,5],[26,6,26,9],[27,0,27,5],[27,6,27,9],[23,0,23,5],[23,6,23,9],[24,0,24,5],[24,6,24,9],[25,0,25,5],[25,6,25,9]]}
[{"$f":"'Translation '!A189","v":"Energy Savings Opportunities"}]
[{"$f":"'Translation '!A80","v":"Instructions:"}]
[{"$f":"'Translation '!A190","v":"Please respond to the following questions on Energy saving opportunities"}]
[]
[{"$f":"'Translation '!A83","v":"Input values in cells colored in green"}]
[{"$f":"'Translation '!A84","v":"Select from the drop down menu in the cells colored in pink"}]
[{"$f":"'Translation '!A314","v":"Please select Not Applicable (N/A) to the questions which are not applicable for the system in your plant."}]
[]
[{"$f":"'Translation '!A80","v":"Instructions:"},null,{"$f":"'Translation '!A191","v":"1)Use the following table to characterize the potential energy savings opportunities for the various major systems in your plant. Use the criteria listed below to categorize your energy use systems."}]
[null,null,{"$f":"'Translation '!A192","v":"2) If the user wants to use scorecard to characterize the potential energy saving opportunities fro major system please select scorecard from the drop down list. "}]
[]
[{"$f":"'Translation '!A193","v":"High = No system assessment completed in the last three years/ Don't know"}]
[{"$f":"'Translation '!A194","v":"Medium = System assessment completed but little or no implementation completed in the last three years"}]
[{"$f":"'Translation '!A195","v":"Low = System assessment completed and substantial implementation completed in the last three years"}]
[]
[{"$f":"'Translation '!A196","v":"Energy Use System"},null,null,null,null,null,{"$f":"'Translation '!A197","v":"Energy Saving Opportunity Level"}]
[{"$f":"'Translation '!A161","v":"Combined Heat and Power (Cogeneration)"}]
[{"$f":"'Translation '!A162","v":"Compressed Air"}]
[{"$f":"'Translation '!A163","v":"Electrochemical Processes"}]
[{"$f":"'Translation '!A164","v":"Fans and Blowers"}]
[{"$f":"'Translation '!A165","v":"Industrial Facilities (Lighting)"}]
[{"$f":"'Translation '!A166","v":"Industrial Facilities (HVAC)"}]
[{"$f":"'Translation '!A167","v":"Material Handling"}]
[{"$f":"'Translation '!A168","v":"Material Processing"}]
[{"$f":"'Translation '!A169","v":"Process Cooling and Refrigeration"}]
[{"$f":"'Translation '!A170","v":"Process Heating"}]
[{"$f":"'Translation '!A171","v":"Pumps"}]
[{"$f":"'Translation '!A172","v":"Steam Generation Equipment"}]
[]
[{"$f":"'Translation '!A80","v":"Instructions:"},null,null,{"$f":"'Translation '!A789","v":"Please provide short decription of Energy efficient project implemented in your plant"}]
[{"$f":"'Translation '!A790","v":"Name of the Project"},null,null,{"$f":"'Translation '!A791","v":"Description of the project "}]

{"sheet":"CHP","index":6,"n_rows":69,"n_cols":14,"rows_kept":69,"cut":false,"hidden":true,"merged":[[67,10,67,11],[68,0,68,11],[69,0,77,11],[6,0,6,9],[38,0,40,9],[41,0,41,9],[41,10,41,11],[7,0,7,9],[22,0,23,9],[24,0,25,9],[26,0,26,9],[14,0,14,9],[13,0,13,9],[15,10,15,11],[16,10,16,11],[17,10,17,11],[2,0,2,9],[4,0,4,7],[4,8,4,9],[5,8,5,9],[5,0,5,7],[0,0,0,11],[20,0,21,9],[35,0,36,9],[19,0,19,9],[55,0,55,9],[54,0,54,9],[53,0,53,9],[1,0,1,9],[3,0,3,9],[37,10,37,11],[42,10,42,11],[10,10,10,11],[11,10,11,11],[12,10,12,11],[13,10,13,11],[14,10,14,11],[53,10,53,11],[16,0,16,9],[55,10,55,11],[45,0,45,9],[46,10,46,11],[46,0,46,9],[54,10,54,11],[45,10,45,11],[48,0,51,9],[52,0,52,9],[52,10,52,11],[47,10,47,11],[44,10,44,11],[26,10,26,11],[43,10,43,11],[56,0,59,9],[60,0,63,9],[64,0,66,9],[67,0,67,9],[17,0,17,9],[37,0,37,9],[47,0,47,9],[27,0,28,9],[29,0,31,9],[32,0,34,9],[42,0,42,9],[43,0,43,9],[44,0,44,9],[10,13,17,13],[20,13,21,13],[9,10,9,11],[12,0,12,9],[11,0,11,9],[10,0,10,9],[9,0,9,9],[15,0,15,9],[18,10,18,11],[19,10,19,11]]}
[{"$f":"'Translation '!A312","v":"Combined Heat and Power (Scorecard)"}]
[{"$f":"'Translation '!A80","v":"Instructions:"}]
[{"$f":"'Translation '!A313","v":"Please respond to the following questions on Combined Heat and Power"}]
[{"$f":"'Translation '!A82","v":"Please select the answer from the drop down list"}]
[{"$f":"'Translation '!A83","v":"Input values in cells colored in green"}]
[{"$f":"'Translation '!A84","v":"Select from the drop down menu in the cells colored in pink"}]
[{"$f":"'Translation '!A314","v":"Please select Not Applicable (N/A) to the questions which are not applicable for the system in your plant."}]
[{"$f":"'Translation '!A315","v":"HRSG- Heat Recovery Steam Generator"}]
[]
[{"$f":"'Translation '!A316","v":"Select the Equipment present as part of CHP system:"},null,null,null,null,null,null,null,null,null,{"$f":"'Translation '!A326","v":"Please select the answer from the drop down list"}]
[{"$f":"'Translation '!A317","v":"Gas Turbine"},null,null,null,null,null,null,null,null,null,null,null,null,{"$f":"IF(AND(K13=List!A7,K16=List!A7),12,0)","v":0}]
[{"$f":"'Translation '!A318","v":"Unfired Heat Recovery System Generator (HRSG)"}]
[{"$f":"'Translation '!A319","v":"Supplementary Fired HRSG"}]
[{"$f":"'Translation '!A320","v":"Fully Fired Boilers "}]
[{"$f":"'Translation '!A321","v":"Extraction Steam Turbogenerator"}]
[{"$f":"'Translation '!A322","v":"Condensing Steam Turbogenerator "}]
[{"$f":"'Translation '!A323","v":"Diesel Engine "}]
[{"$f":"'Translation '!A324","v":"Direct Exhaust to furnace , Kiln, Dryer"}]
[]
[{"$f":"'Translation '!A325","v":"Questions:"},null,null,null,null,null,null,null,null,null,{"$f":"'Translation '!A326","v":"Please select the answer from the drop down list"}]
[{"$f":"'Translation '!A327","v":"For Gas Turbine or Diesel generator is the exhaust gas used for :"},null,null,null,null,null,null,null,null,null,{"$f":"'Translation '!A354","v":"Direct heating (dryer, kiln or preheated furnace air)"},null,null,{"$f":"IF(OR(L21=List!A7,L22=List!A7),60,0)","v":0}]
[null,null,null,null,null,null,null,null,null,null,{"$f":"'Translation '!A355","v":"Steam Generation"}]
[{"$f":"'Translation '!A328","v":"If a HRSG ( Heat Recovery Steam Generator)is a part of your system, how many steam generation level are there?"},null,null,null,null,null,null,null,null,null,{"$f":"'Translation '!A356","v":1},null,null,{"$f":"IF(L23=List!A7,36,0)","v":0}]
[null,null,null,null,null,null,null,null,null,null,{"$f":"'Translation '!A357","v":"2 or more"},null,null,{"$f":"IF(L24=List!$A$7,60,0)","v":0}]
[{"$f":"'Translation '!A329","v":"What type of deaerator do you have?"},null,null,null,null,null,null,null,null,null,{"$f":"'Translation '!A358","v":"External"},null,null,{"$f":"IF(L25=List!$A$7,12,0)","v":0}]
[null,null,null,null,null,null,null,null,null,null,{"$f":"'Translation '!A359","v":"Internal "},null,null,{"$f":"IF(L26=List!$A$7,18,0)","v":0}]
[{"$f":"'Translation '!A330","v":"If the HRSG has supplementary firing, does HRSG runs at maximum firing or maximum steam generation capacity all the time?"},null,null,null,null,null,null,null,null,null,null,null,null,{"$f":"IF(L27=List!$A$7,60,0)","v":0}]
[{"$f":"'Translation '!A331","v":"Are the boiler used as the swing steam load production or the HRSG?"},null,null,null,null,null,null,null,null,null,{"$f":"'Translation '!A360","v":"Boiler (HRSG base loaded)"},null,null,{"$f":"IF(L28=List!$A$7,60,0)","v":0}]
[null,null,null,null,null,null,null,null,null,null,{"$f":"'Translation '!A361","v":"HRSG(Boiler base loaded)"},null,null,{"$f":"IF(L29=List!$A$7,0,0)","v":0}]
[{"$f":"'Translation '!A332","v":"What is your HRSG stack temperature?"},null,null,null,null,null,null,null,null,null,{"$f":"'Translation '!A362","v":"<=300° F"},null,null,{"$f":"IF(L30=List!$A$7,60,0)","v":0}]
[null,null,null,null,null,null,null,null,null,null,{"$f":"'Translation '!A363","v":"Between 300-400° F"},null,null,{"$f":"IF(L31=List!$A$7,48,0)","v":0}]
[null,null,null,null,null,null,null,null,null,null,{"$f":"'Translation '!A364","v":">400° F"},null,null,{"$f":"IF(L32=List!$A$7,24,0)","v":0}]
[{"$f":"'Translation '!A333","v":"If the HRSG is supplementary fired, what is the HRSG fires operating temperature?"},null,null,null,null,null,null,null,null,null,{"$f":"'Translation '!A365","v":"1500° F or greater"},null,null,{"$f":"IF(L33=List!$A$7,30,0)","v":0}]
[null,null,null,null,null,null,null,null,null,null,{"$f":"'Translation '!A366","v":"1400° F "},null,null,{"$f":"IF(L34=List!$A$7,12,0)","v":0}]
[null,null,null,null,null,null,null,null,null,null,{"$f":"'Translation '!A367","v":"1200° F or less"},null,null,{"$f":"IF(L35=List!$A$7,0,0)","v":0}]
[{"$f":"'Translation '!A334","v":"Are any of the boilers outside of the cogeneration  unit operated?"},null,null,null,null,null,null,null,null,null,{"$f":"'Translation '!A368","v":"On hot stand by"},null,null,{"$f":"IF(L36=List!$A$8,24,0)","v":0}]
[null,null,null,null,null,null,null,null,null,null,{"$f":"'Translation '!A369","v":"At minimum load"},null,null,{"$f":"IF(L37=List!$A$8,12,0)","v":0}]
[{"$f":"'Translation '!A335","v":"If this is a condensing turbine do you have to run the turbine for extended periods at low to minimum load to keep it on-line?"},null,null,null,null,null,null,null,null,null,null,null,null,{"$f":"IF(K38=List!A8,6,0)","v":0}]
[{"$f":"'Translation '!A336","v":"For a condensing steam turbine as a part of cogeneration unit what is the average condensing pressure?"},null,null,null,null,null,null,null,null,null,{"$f":"'Translation '!A370","v":"<2 in Hg"},null,null,{"$f":"IF(L39=List!$A$7,18,0)","v":0}]
[null,null,null,null,null,null,null,null,null,null,{"$f":"'Translation '!A371","v":"Between 2-4 in Hg"},null,null,{"$f":"IF(L40=List!$A$7,12,0)","v":0}]
[null,null,null,null,null,null,null,null,null,null,{"$f":"'Translation '!A372","v":"> 4 in Hg"},null,null,{"$f":"IF(L41=List!$A$7,6,0)","v":0}]
[{"$f":"'Translation '!A337","v":"What is the average load factor (average/rated power production ratio) for cogeneration unit?"},null,null,null,null,null,null,null,null,null,null,null,null,{"$f":"K42*25/100","v":0}]
[{"$f":"'Translation '!A338","v":"Do you use evaporative cooling on the GT inlet air temp?"},null,null,null,null,null,null,null,null,null,null,null,null,{"$f":"IF(K43=List!$A$7,24,0)","v":0}]
[{"$f":"'Translation '!A339","v":"Is the energy for this cooling supplied by the HRSG?"},null,null,null,null,null,null,null,null,null,null,null,null,{"$f":"IF(K44=List!$A$8,36,0)","v":0}]
[{"$f":"'Translation '!A340","v":"Do you have large seasonal variation in gas turbine inlet air temp?"},null,null,null,null,null,null,null,null,null,null,null,null,{"$f":"IF(K45=List!$A$8,12,0)","v":0}]
[{"$f":"'Translation '!A341","v":"Do you sell excess stem or have potential customer for excess steam?"},null,null,null,null,null,null,null,null,null,null,null,null,{"$f":"IF(K46=List!$A$7,12,0)","v":0}]
[{"$f":"'Translation '!A342","v":"Do you export power to grid or external customer?"},null,null,null,null,null,null,null,null,null,null,null,null,0]
[{"$f":"'Translation '!A343","v":"If  so what fraction of the full imported power cost do you receive?"},null,null,null,null,null,null,null,null,null,null,null,null,{"$f":"K48*12/100","v":0}]
[{"$f":"'Translation '!A344","v":"What is the average net heat rate of the cogeneration unit (Net Btu's of the fuel/kWh of power produced)? "},null,null,null,null,null,null,null,null,null,{"$f":"'Translation '!A373","v":"5000 or less"},null,null,{"$f":"IF(L49=List!$A$7,120,0)","v":0}]
[null,null,null,null,null,null,null,null,null,null,{"$f":"'Translation '!A374","v":"5,000-7,000"},null,null,{"$f":"IF(L50=List!$A$7,96,0)","v":0}]
[null,null,null,null,null,null,null,null,null,null,{"$f":"'Translation '!A375","v":">7,000"},null,null,{"$f":"IF(L51=List!$A$7,48,0)","v":0}]
[null,null,null,null,null,null,null,null,null,null,{"$f":"'Translation '!A376","v":"Don’t Know"},null,null,{"$f":"IF(L52=List!$A$7,24,0)","v":0}]
[{"$f":"'Translation '!A345","v":"What is the average cogeneration unit operating stream factor (on-line time as a fraction)? "},null,null,null,null,null,null,null,null,null,null,null,null,{"$f":"IF(ISBLANK(K53),0,IF(100/(100-K53)>100,100,(100/(100-K53))))","v":0}]
[{"$f":"'Translation '!A346","v":"How many unplanned trips per year?"},null,null,null,null,null,null,null,null,null,null,null,null,{"$f":"IF(OR(6*(7-K54)<0,ISBLANK(K54)),0,(6*(7-K54)))","v":0}]
[{"$f":"'Translation '!A347","v":"How often is the overall co-generation efficiency monitored?"},null,null,null,null,null,null,null,null,null,null,null,null,{"$f":"IF(ISBLANK(K55),0,IF(K55=List!A43,60,IF(OR(K55=List!A44,K55=List!A45),30,IF(OR(K55=List!A46,K55=List!A47),12,0))))","v":0}]
[{"$f":"'Translation '!A348","v":"Do you have on-line dynamic load optimization? "},null,null,null,null,null,null,null,null,null,null,null,null,{"$f":"IF(K56=List!A7,60,0)","v":0}]
[{"$f":"'Translation '!A349","v":"How do you control Exhaust NOx levels?"},null,null,null,null,null,null,null,null,null,{"$f":"'Translation '!A377","v":"Water Injection "},null,null,{"$f":"IF(L57=List!$A$7,36,0)","v":0}]
[null,null,null,null,null,null,null,null,null,null,{"$f":"'Translation '!A378","v":"Steam Injection "},null,null,{"$f":"IF(L58=List!$A$7,36,0)","v":0}]
[null,null,null,null,null,null,null,null,null,null,{"$f":"'Translation '!A379","v":"Low NOx Burner"},null,null,{"$f":"IF(L59=List!$A$7,40,0)","v":0}]
[null,null,null,null,null,null,null,null,null,null,{"$f":"'Translation '!A380","v":"Null"},null,null,{"$f":"IF(L60=List!$A$7,60,0)","v":0}]
[{"$f":"'Translation '!A350","v":"Do you have a program for preventive maintenance of the CHP system?"},null,null,null,null,null,null,null,null,null,{"$f":"'Translation '!A381","v":"Routine lubrication"},null,null,{"$f":"IF(L61=List!$A$7,2,0)","v":0}]
[null,null,null,null,null,null,null,null,null,null,{"$f":"'Translation '!A382","v":"Borescope inspections"},null,null,{"$f":"IF(L62=List!$A$7,2,0)","v":0}]
[null,null,null,null,null,null,null,null,null,null,{"$f":"'Translation '!A383","v":"Instrument calibrations"},null,null,{"$f":"IF(L63=List!$A$7,2,0)","v":0}]
[null,null,null,null,null,null,null,null,null,null,{"$f":"'Translation '!A384","v":"Blade cleaning- peanut-almond shells"},null,null,{"$f":"IF(L64=List!$A$7,4,0)","v":0}]
[{"$f":"'Translation '!A351","v":"Do you have a program for predictive maintenance? "},null,null,null,null,null,null,null,null,null,{"$f":"'Translation '!A385","v":"Lube oil sampling"},null,null,{"$f":"IF(L65=List!$A$7,6,0)","v":0}]
[null,null,null,null,null,null,null,null,null,null,{"$f":"'Translation '!A386","v":"Advanced diagnostics"},null,null,{"$f":"IF(L66=List!$A$7,6,0)","v":0}]
[null,null,null,null,null,null,null,null,null,null,{"$f":"'Translation '!A387","v":"Instrument histograms"},null,null,{"$f":"IF(L67=List!$A$7,6,0)","v":0}]
[{"$f":"'Translation '!A352","v":"Do you periodically re-certify cogen operators? "},null,null,null,null,null,null,null,null,null,null,null,null,{"$f":"IF(K68=List!$A$7,6,0)","v":0}]
[{"$f":"'Translation '!A353","v":"Other comments or information  related to Combined Heat and Power  equipment, energy use, operations etc. "},null,null,null,null,null,null,null,null,null,null,null,null,{"$f":"SUM(N11:N68)","v":0}]

{"sheet":"Compressed Air","index":7,"n_rows":52,"n_cols":11,"rows_kept":52,"cut":false,"hidden":true,"merged":[[12,7,12,8],[13,7,13,8],[19,0,19,6],[9,0,9,6],[10,0,10,6],[11,0,11,6],[12,0,12,6],[13,0,13,6],[14,0,14,6],[15,0,15,6],[16,0,16,6],[14,7,14,8],[15,7,15,8],[16,7,16,8],[17,7,17,8],[18,7,18,8],[8,0,8,6],[8,7,8,8],[9,7,9,8],[10,7,10,8],[11,7,11,8],[0,0,0,8],[1,0,1,6],[2,0,2,6],[3,0,3,6],[6,0,6,6],[4,0,4,5],[5,0,5,5],[19,7,19,8],[30,7,30,8],[52,0,60,8],[17,0,17,6],[18,0,18,6],[34,7,34,8],[35,7,35,8],[27,0,28,6],[41,0,43,6],[31,0,31,6],[33,0,33,6],[34,0,34,6],[35,0,35,6],[20,0,20,6],[21,0,21,6],[44,0,49,6],[22,0,22,6],[20,7,20,8],[21,7,21,8],[32,7,32,8],[22,7,22,8],[29,7,29,8],[31,7,31,8],[23,7,23,8],[24,7,24,8],[25,7,25,8],[26,7,26,8],[51,0,51,8],[37,0,40,6],[23,0,23,6],[24,0,24,6],[25,0,25,6],[26,0,26,6],[29,0,29,6],[30,0,30,6],[32,0,32,6],[36,7,36,8],[36,0,36,6],[33,7,33,8]]}
[{"$f":"'Translation '!A388","v":"Compressed Air (Scorecard)"}]
[{"$f":"'Translation '!A80","v":"Instructions:"}]
[{"$f":"'Translation '!A389","v":"Please respond to the following questions on Comressed Air"}]
[{"$f":"'Translation '!A82","v":"Please select the answer from the drop down list"}]
[{"$f":"'Translation '!A83","v":"Input values in cells colored in green"}]
[{"$f":"'Translation '!A84","v":"Select from the drop down menu in the cells colored in pink"}]
[{"$f":"'Translation '!A314","v":"Please select Not Applicable (N/A) to the questions which are not applicable for the system in your plant."}]
[]
[{"$f":"'Translation '!A325","v":"Questions:"},null,null,null,null,null,null,{"$f":"'Translation '!A326","v":"Please select the answer from the drop down list"}]
[{"$f":"'Translation '!A390","v":"Have you developed a basic block diagram of the system? "},null,null,null,null,null,null,null,null,null,{"$f":"IF(H10=List!$A$7,200,0)","v":0}]
[{"$f":"'Translation '!A391","v":"Have you developed a pressure profile of your system to determine peak demand and dynamics of demand?"},null,null,null,null,null,null,null,null,null,{"$f":"IF(H11=List!$A$7,100,0)","v":0}]
[{"$f":"'Translation '!A392","v":"Have you estimated total compressed air flow during different shift"},null,null,null,null,null,null,null,null,null,{"$f":"IF(H12=List!$A$7,100,0)","v":0}]
[{"$f":"'Translation '!A393","v":"Have you measured pressure at various points in the system to determine pressure drop?"},null,null,null,null,null,null,null,null,null,{"$f":"IF(H13=List!$A$7,100,0)","v":0}]
[{"$f":"'Translation '!A394","v":"Have you measured compressed air temperature at various points in supply system?"},null,null,null,null,null,null,null,null,null,{"$f":"IF(H14=List!$A$7,200,0)","v":0}]
[{"$f":"'Translation '!A395","v":"Have you estimated leak load?"},null,null,null,null,null,null,null,null,null,{"$f":"IF(H15=List!$A$7,100,0)","v":0}]
[{"$f":"'Translation '!A396","v":"Do you exceed compressor and dryer manufacturer's requirements for maintenance? "},null,null,null,null,null,null,null,null,null,{"$f":"IF(H16=List!$A$7,100,0)","v":0}]
[{"$f":"'Translation '!A397","v":"Do you periodically check ventilation openings to the compressor room to make sure they are free of obstructions? "},null,null,null,null,null,null,null,null,null,{"$f":"IF(H17=List!$A$7,200,0)","v":0}]
[{"$f":"'Translation '!A398","v":"Do you inspect condensate drains daily? "},null,null,null,null,null,null,null,null,null,{"$f":"IF(H18=List!$A$7,100,0)","v":0}]
[{"$f":"'Translation '!A399","v":"Do you periodically inspect and replace hoses that have become cracked or worn?"},null,null,null,null,null,null,null,null,null,{"$f":"IF(H19=List!$A$7,100,0)","v":0}]
[{"$f":"'Translation '!A400","v":"Do you periodically inspect and replace end-use filters, check regulators, and lubricators to maintain functionality? "},null,null,null,null,null,null,null,null,null,{"$f":"IF(H20=List!$A$7,200,0)","v":0}]
[{"$f":"'Translation '!A401","v":"Have you adjusted your compressor controls in the last year?"},null,null,null,null,null,null,null,null,null,{"$f":"IF(H21=List!$A$7,100,0)","v":0}]
[{"$f":"'Translation '!A402","v":"Have you developed a control strategy that allow you to efficiently match supply with demand?"},null,null,null,null,null,null,null,null,null,{"$f":"IF(H22=List!$A$7,300,0)","v":0}]
[{"$f":"'Translation '!A403","v":"Do you monitor compressor operation to avoid rapid cycling of equipment?"},null,null,null,null,null,null,null,null,null,{"$f":"IF(H23=List!$A$7,100,0)","v":0}]
[{"$f":"'Translation '!A404","v":"Do you have a few high pressure application that determines the operating pressure of your entire? plant?"},null,null,null,null,null,null,null,null,null,{"$f":"IF(H24=List!A8,-100,0)","v":0}]
[{"$f":"'Translation '!A405","v":"Have you investigated ways to serve high pressure applications at a lower pressure? "},null,null,null,null,null,null,null,null,null,{"$f":"IF(H25=List!$A$7,100,0)","v":0}]
[{"$f":"'Translation '!A406","v":"Do you have end use application requiring high quality air that determines the air quality for entire plant?"},null,null,null,null,null,null,null,null,null,{"$f":"IF(H26=List!$A$7,-100,0)","v":0}]
[{"$f":"'Translation '!A407","v":"Have you investigated ways to serve these  high air quality applications with point-of-use solutions?"},null,null,null,null,null,null,null,null,null,{"$f":"IF(H27=List!$A$7,100,0)","v":0}]
[{"$f":"'Translation '!A408","v":"Are you using any of the following to supply the intermittent, high volume applications?"},null,null,null,null,null,null,{"$f":"'Translation '!A421","v":"Secondary Storage Receiver"},null,null,{"$f":"IF(I28=List!$A$7,100,0)","v":0}]
[null,null,null,null,null,null,null,{"$f":"'Translation '!A422","v":"Separate Compressor, booster or amplifier"},null,null,{"$f":"IF(I29=List!$A$7,100,0)","v":0}]
[{"$f":"'Translation '!A409","v":"Have you analyzed your end uses to make sure they could not be more efficiently using alternative energy sources? "},null,null,null,null,null,null,null,null,null,{"$f":"IF(H30=List!$A$7,100,0)","v":0}]
[{"$f":"'Translation '!A410","v":"Is compressed air sent to abandoned equipment?"},null,null,null,null,null,null,null,null,null,{"$f":"IF(H31=List!$A$8,-300,IF(H31=List!$A$7,-30,0))","v":0}]
[{"$f":"'Translation '!A411","v":"Have you estimated the leak in your system?"},null,null,null,null,null,null,null,null,null,{"$f":"IF(H32=List!$A$7,100,0)","v":0}]
[{"$f":"'Translation '!A412","v":"Do you have the equipment to detect leaks (e.g., ultrasonic leak detector) or do you outsource leak detection? "},null,null,null,null,null,null,null,null,null,{"$f":"IF(H33=List!$A$7,100,0)","v":0}]
[{"$f":"'Translation '!A413","v":"Do you have an ongoing leak management program? "},null,null,null,null,null,null,null,null,null,{"$f":"IF(H34=List!$A$7,200,0)","v":0}]
[{"$f":"'Translation '!A414","v":"Does your plant have a demand for space heating or hot water?"},null,null,null,null,null,null,null,null,null,{"$f":"IF(H35=List!$A$7,100,0)","v":0}]
[{"$f":"'Translation '!A415","v":"Are you using heat recovery on your compressed air system?"},null,null,null,null,null,null,null,null,null,{"$f":"IF(H36=List!$A$7,100,0)","v":0}]
[{"$f":"'Translation '!A416","v":"How many different locations are compressors installed at your facility?"},null,null,null,null,null,null,null,null,null,0]
[{"$f":"'Translation '!A417","v":"Please identify the quantity and type of each air compressor in your facility:"},null,null,null,null,null,null,{"$f":"'Translation '!A423","v":"Double acting reciprocating compressor(s)"},null,null,0]
[null,null,null,null,null,null,null,{"$f":"'Translation '!A424","v":"Lubricant injected rotary screw compressor(s)"},null,null,0]
[null,null,null,null,null,null,null,{"$f":"'Translation '!A425","v":"Centrifugal air compressor(s)"},null,null,0]
[null,null,null,null,null,null,null,{"$f":"'Translation '!A426","v":"Other or unknown type of compressor(s)"},null,null,0]
[{"$f":"'Translation '!A418","v":"Select the option which best describes your production rate:"},null,null,null,null,null,null,{"$f":"'Translation '!A427","v":"Constant throughout the year"},null,null,0]
[null,null,null,null,null,null,null,{"$f":"'Translation '!A428","v":"Varies seasonally,"},null,null,0]
[null,null,null,null,null,null,null,{"$f":"'Translation '!A429","v":"Varies throughout the day."},null,null,0]
[{"$f":"'Translation '!A419","v":"Please review the following list of potential compressed air system operational issues. Please select Yes/ No from the drop down list "},null,null,null,null,null,null,{"$f":"'Translation '!A430","v":"The reliability of the compressed air system in supporting manufacturing operations needs improvement."},null,null,0]
[null,null,null,null,null,null,null,{"$f":"'Translation '!A431","v":"Production interruptions occur which are a result of poor compressed air system performance; we need to minimize production downtime. Product quality is affected by poor compressed air system performance: we need to prevent product spoilage."},null,null,0]
[null,null,null,null,null,null,null,{"$f":"'Translation '!A432","v":"The automated equipment which is operated by compressed air will not achieve its full capacity throughput; we need to know if the compressed air supply is slowing down our production rate. "},null,null,0]
[null,null,null,null,null,null,null,{"$f":"'Translation '!A433","v":"We need to reduce air demand and lower energy cost of operating our compressed air system."},null,null,0]
[null,null,null,null,null,null,null,{"$f":"'Translation '!A434","v":"Low pressure, impacting production occurs on a system wide and/or localized basis (at the point of use). We are unable to maintain acceptable pressure. Pressure fluctuations frequently occur; we need to maintain more stable air pressure. "},null,null,0]
[null,null,null,null,null,null,null,{"$f":"'Translation '!A435","v":"Water and/or oil contamination in the compressed air affects production; we need to maintain acceptable compressed air quality delivered to our end uses. "},null,null,0]
[null,null,null,null,null,null,null,null,null,null,{"$f":"SUM(K10:K50)","v":0}]
[{"$f":"'Translation '!A420","v":"Other comments or information  related to compressed air equipment, energy use, operations etc. "}]

{"sheet":"Process Cooling & Refrigeration","index":8,"n_rows":108,"n_cols":11,"rows_kept":108,"cut":false,"hidden":true,"merged":[[104,0,106,6],[107,0,107,8],[108,0,116,8],[91,7,91,8],[92,0,95,6],[96,0,97,6],[98,0,100,6],[101,0,103,6],[71,7,71,8],[72,0,73,6],[74,0,76,6],[77,0,77,6],[77,7,77,8],[49,7,49,8],[50,0,50,8],[51,0,54,6],[55,0,59,6],[60,0,62,6],[49,0,49,6],[90,7,90,8],[91,0,91,6],[78,0,79,6],[80,0,80,6],[80,7,80,8],[81,0,81,6],[81,7,81,8],[24,0,26,6],[27,0,32,6],[82,0,85,6],[86,0,89,6],[90,0,90,6],[0,0,0,8],[16,7,16,8],[17,7,17,8],[15,7,15,8],[8,7,8,8],[9,0,11,6],[8,0,8,6],[15,0,15,6],[16,0,16,6],[17,0,17,6],[12,0,14,6],[1,0,1,6],[2,0,2,6],[3,0,3,6],[5,0,5,5],[6,0,6,6],[4,0,4,5],[71,0,71,6],[18,7,18,8],[19,7,19,8],[20,7,20,8],[18,0,18,6],[19,0,19,6],[20,0,20,6],[63,0,68,6],[69,0,70,6],[33,0,35,6],[36,0,38,6],[39,0,41,6],[42,0,45,6],[46,0,48,6],[21,0,23,6]]}
[{"$f":"'Translation '!A478","v":"Process Cooling and Refrigeration (Scorecard)"}]
[{"$f":"'Translation '!A80","v":"Instructions:"}]
[{"$f":"'Translation '!A479","v":"Please respond to the following questions on Process Cooling and Refrigeration "}]
[{"$f":"'Translation '!A480","v":"Includes chillers, refrigeration equipment, cooling towers and any other devices used for refrigeration and process cooling"}]
[{"$f":"'Translation '!A83","v":"Input values in cells colored in green"}]
[{"$f":"'Translation '!A84","v":"Select from the drop down menu in the cells colored in pink"}]
[{"$f":"'Translation '!A314","v":"Please select Not Applicable (N/A) to the questions which are not applicable for the system in your plant."}]
[]
[{"$f":"'Translation '!A325","v":"Questions:"},null,null,null,null,null,null,{"$f":"'Translation '!A326","v":"Please select the answer from the drop down list"}]
[{"$f":"'Translation '!A481","v":"How old is your refrigeration system?"},null,null,null,null,null,null,{"$f":"'Translation '!A521","v":"<10 Years "},null,null,0]
[null,null,null,null,null,null,null,{"$f":"'Translation '!A522","v":"10- 20 years"},null,null,0]
[null,null,null,null,null,null,null,{"$f":"'Translation '!A523","v":">20 Years"},null,null,0]
[{"$f":"'Translation '!A482","v":"When was the last time your refrigerator system was audited?"},null,null,null,null,null,null,{"$f":"'Translation '!A524","v":"1 year or less"},null,null,{"$f":"IF(I13=List!$A$7,12,0)","v":0}]
[null,null,null,null,null,null,null,{"$f":"'Translation '!A525","v":">2 years ago"},null,null,{"$f":"IF(I14=List!$A$7,6,0)","v":0}]
[null,null,null,null,null,null,null,{"$f":"'Translation '!A526","v":">5 years ago "},null,null,{"$f":"IF(I15=List!$A$7,0,0)","v":0}]
[{"$f":"'Translation '!A483","v":"How often do you monitor refrigeration costs? "},null,null,null,null,null,null,null,null,null,{"$f":"IF(OR(H16=List!$A$43,H16=List!$A$44),8,IF(H16=List!$A$45,4,IF(OR(H16=List!$A$46,H16=List!$A$47),2,0)))","v":0}]
[{"$f":"'Translation '!A484","v":"Do you monitor compressor efficiencies? "},null,null,null,null,null,null,null,null,null,{"$f":"IF(H17=List!$A$7,4,0)","v":0}]
[{"$f":"'Translation '!A485","v":"Do you have regular maintenance program"},null,null,null,null,null,null,null,null,null,{"$f":"IF(H18=List!$A$7,8,0)","v":0}]
[{"$f":"'Translation '!A486","v":"How often do you inspect the refrigerant charge level"},null,null,null,null,null,null,null,null,null,{"$f":"IF(H19=List!$A$7,2,0)","v":0}]
[{"$f":"'Translation '!A487","v":"How often  do you inspect the compressor?"},null,null,null,null,null,null,null,null,null,{"$f":"IF(H20=List!$A$7,1,0)","v":0}]
[{"$f":"'Translation '!A488","v":"How often  do you inspect the condensers and evaporators for fouling? "},null,null,null,null,null,null,null,null,null,{"$f":"IF(H21=List!$A$7,1,0)","v":0}]
[{"$f":"'Translation '!A489","v":"What is the average refrigeration compressor load factor versus design (typical/ estimated)?"},null,null,null,null,null,null,{"$f":"'Translation '!A527","v":">=100%"},null,null,{"$f":"IF(I22=List!$A$7,8,0)","v":0}]
[null,null,null,null,null,null,null,{"$f":"'Translation '!A528","v":">50%"},null,null,{"$f":"IF(I23=List!$A$7,4,0)","v":0}]
[null,null,null,null,null,null,null,{"$f":"'Translation '!A529","v":"Don’t know"},null,null,{"$f":"IF(I24=List!$A$7,0,0)","v":0}]
[{"$f":"'Translation '!A490","v":"What % of operating time do you spend at less than 50% load? "},null,null,null,null,null,null,{"$f":"'Translation '!A530","v":"30% or less"},null,null,{"$f":"IF(I25=List!$A$7,4,0)","v":0}]
[null,null,null,null,null,null,null,{"$f":"'Translation '!A531","v":"60% or more"},null,null,{"$f":"IF(I26=List!$A$7,2,0)","v":0}]
[null,null,null,null,null,null,null,{"$f":"'Translation '!A532","v":"Don’t know"},null,null,{"$f":"IF(I27=List!$A$7,0,0)","v":0}]
[{"$f":"'Translation '!A491","v":"Select the method used to unload compressor"},null,null,null,null,null,null,{"$f":"'Translation '!A533","v":"Variable speed drives"},null,null,{"$f":"IF(I28=List!$A$7,8,0)","v":0}]
[null,null,null,null,null,null,null,{"$f":"'Translation '!A534","v":"Cylinder unloading (reciprocating)/ Slide valves (screw)/ Variable inlet guide vanes (centrifugal)"},null,null,{"$f":"IF(I29=List!$A$7,6,0)","v":0}]
[null,null,null,null,null,null,null,{"$f":"'Translation '!A535","v":"Automated compressor on/off control "},null,null,{"$f":"IF(I30=List!$A$7,4,0)","v":0}]
[null,null,null,null,null,null,null,{"$f":"'Translation '!A536","v":"Manual Compressor on/ off Control"},null,null,{"$f":"IF(I31=List!$A$7,3,0)","v":0}]
[null,null,null,null,null,null,null,{"$f":"'Translation '!A537","v":"Suction Throttling "},null,null,{"$f":"IF(I32=List!$A$7,2,0)","v":0}]
[null,null,null,null,null,null,null,{"$f":"'Translation '!A538","v":"Hot gas bypass"},null,null,{"$f":"IF(I33=List!$A$7,0,0)","v":0}]
[{"$f":"'Translation '!A492","v":"What is the typical Suction Pressure?"},null,null,null,null,null,null,{"$f":"'Translation '!A539","v":"Near design pressure"},null,null,{"$f":"IF(I34=List!$A$7,5,0)","v":0}]
[null,null,null,null,null,null,null,{"$f":"'Translation '!A540","v":"< design pressure by more than 15%"},null,null,{"$f":"IF(I35=List!$A$7,2,0)","v":0}]
[null,null,null,null,null,null,null,{"$f":"'Translation '!A541","v":"Don’t know"},null,null,{"$f":"IF(I36=List!$A$7,0,0)","v":0}]
[{"$f":"'Translation '!A493","v":"What is the typical Discharge  Pressure?"},null,null,null,null,null,null,{"$f":"'Translation '!A542","v":"Near design pressure"},null,null,{"$f":"IF(I37=List!$A$7,4,0)","v":0}]
[null,null,null,null,null,null,null,{"$f":"'Translation '!A543","v":"> design pressure by more than 10%"},null,null,{"$f":"IF(I38=List!$A$7,2,0)","v":0}]
[null,null,null,null,null,null,null,{"$f":"'Translation '!A544","v":"Don’t know"},null,null,{"$f":"IF(I39=List!$A$7,0,0)","v":0}]
[{"$f":"'Translation '!A494","v":"What is the typical Temperature Difference between evaporator refrigerant and process steam outlet?"},null,null,null,null,null,null,{"$f":"'Translation '!A545","v":"Within 5 °F  of design "},null,null,{"$f":"IF(I40=List!$A$7,4,0)","v":0}]
[null,null,null,null,null,null,null,{"$f":"'Translation '!A546","v":"> 5 °F  of design "},null,null,{"$f":"IF(I41=List!$A$7,2,0)","v":0}]
[null,null,null,null,null,null,null,{"$f":"'Translation '!A547","v":"Don’t know"},null,null,{"$f":"IF(I42=List!$A$7,0,0)","v":0}]
[{"$f":"'Translation '!A495","v":"Do you have condenser performance problem?"},null,null,null,null,null,null,{"$f":"'Translation '!A548","v":"Not at all"},null,null,{"$f":"IF(I43=List!$A$7,2,0)","v":0}]
[null,null,null,null,null,null,null,{"$f":"'Translation '!A549","v":"Only periodically in summer months"},null,null,{"$f":"IF(I44=List!$A$7,1,0)","v":0}]
[null,null,null,null,null,null,null,{"$f":"'Translation '!A550","v":"Throughout summer"},null,null,{"$f":"IF(I45=List!$A$7,1,0)","v":0}]
[null,null,null,null,null,null,null,{"$f":"'Translation '!A551","v":"Continuously"},null,null,{"$f":"IF(I46=List!$A$7,0,0)","v":0}]
[{"$f":"'Translation '!A496","v":"How old is your refrigeration system?"},null,null,null,null,null,null,{"$f":"'Translation '!A521","v":"<10 Years "},null,null,{"$f":"IF(I47=List!$A$7,2,0)","v":0}]
[null,null,null,null,null,null,null,{"$f":"'Translation '!A522","v":"10- 20 years"},null,null,{"$f":"IF(I48=List!$A$7,1,0)","v":0}]
[null,null,null,null,null,null,null,{"$f":"'Translation '!A523","v":">20 Years"},null,null,{"$f":"IF(I49=List!$A$7,0,0)","v":0}]
[{"$f":"'Translation '!A497","v":"Have you ever performed Pinch analysis to check if refrigeration loads have been minimized?"},null,null,null,null,null,null,null,null,null,{"$f":"IF(H50=List!$A$7,8,0)","v":0}]
[{"$f":"'Translation '!A498","v":"Please input the following information :"}]
[{"$f":"'Translation '!A499","v":"What % of your refrigeration compressor HP is delivered via the following drive types? (Total must be less than or equal to 100%)"},null,null,null,null,null,null,{"$f":"'Translation '!A552","v":"Backpressure (extraction ) steam turbines"},null,null,{"$f":"I52*11/100","v":0}]
[null,null,null,null,null,null,null,{"$f":"'Translation '!A553","v":"Variable Speed Electric Motor"},null,null,{"$f":"I53*5/100","v":0}]
[null,null,null,null,null,null,null,{"$f":"'Translation '!A554","v":"Electric motor w/o variable speed drives"},null,null,{"$f":"I54*3/100","v":0}]
[null,null,null,null,null,null,null,{"$f":"'Translation '!A555","v":"Condensing steam turbines"},null,null,{"$f":"I55*0/100","v":0}]
[{"$f":"'Translation '!A500","v":"How are cooling tower fans controlled?"},null,null,null,null,null,null,{"$f":"'Translation '!A556","v":"Always on"},null,null,{"$f":"IF(I56=List!$A$7,0,0)","v":0}]
[null,null,null,null,null,null,null,{"$f":"'Translation '!A557","v":"Manual on/off control"},null,null,{"$f":"IF(I57=List!$A$7,3,0)","v":0}]
[null,null,null,null,null,null,null,{"$f":"'Translation '!A558","v":"Fan pitch control"},null,null,{"$f":"IF(I58=List!$A$7,5,0)","v":0}]
[null,null,null,null,null,null,null,{"$f":"'Translation '!A559","v":"Automated on / off control"},null,null,{"$f":"IF(I59=List!$A$7,7,0)","v":0}]
[null,null,null,null,null,null,null,{"$f":"'Translation '!A560","v":"Combination of above"},null,null,{"$f":"IF(I60=List!$A$7,4,0)","v":0}]
[{"$f":"'Translation '!A501","v":"How is Blow down controlled?"},null,null,null,null,null,null,{"$f":"'Translation '!A561","v":"Automatically"},null,null,{"$f":"IF(I61=List!$A$7,7,0)","v":0}]
[null,null,null,null,null,null,null,{"$f":"'Translation '!A562","v":"Manually "},null,null,{"$f":"IF(I62=List!$A$7,0,0)","v":0}]
[null,null,null,null,null,null,null,{"$f":"'Translation '!A563","v":"Combination of above"},null,null,{"$f":"IF(I63=List!$A$7,4,0)","v":0}]
[{"$f":"'Translation '!A502","v":"Select one or more what is continuously monitored "},null,null,null,null,null,null,{"$f":"'Translation '!A564","v":"Ambient air temperature profile for the year"},null,null,{"$f":"IF(I64=List!$A$7,1,0)","v":0}]
[null,null,null,null,null,null,null,{"$f":"'Translation '!A565","v":"Ambient air wet bulb temperature profile for year"},null,null,{"$f":"IF(I65=List!$A$7,1,0)","v":0}]
[null,null,null,null,null,null,null,{"$f":"'Translation '!A566","v":"Cooling tower blowdown cycle "},null,null,{"$f":"IF(I66=List!$A$7,1,0)","v":0}]
[null,null,null,null,null,null,null,{"$f":"'Translation '!A567","v":"Cooling water flow demand"},null,null,{"$f":"IF(I67=List!$A$7,1,0)","v":0}]
[null,null,null,null,null,null,null,{"$f":"'Translation '!A568","v":"Delta T across towers"},null,null,{"$f":"IF(I68=List!$A$7,1,0)","v":0}]
[null,null,null,null,null,null,null,{"$f":"'Translation '!A569","v":"Cycles of concentration "},null,null,{"$f":"IF(I69=List!$A$7,1,0)","v":0}]
[{"$f":"'Translation '!A503","v":"Are all over cooling water flow rates above or below design?"},null,null,null,null,null,null,{"$f":"'Translation '!A570","v":"Above"},null,null,{"$f":"IF(I70=List!$A$7,0,0)","v":0}]
[null,null,null,null,null,null,null,{"$f":"'Translation '!A571","v":"Below"},null,null,{"$f":"IF(I71=List!$A$7,4,0)","v":0}]
[{"$f":"'Translation '!A504","v":"Do you have uneven water distribution problem in cooling towers?"},null,null,null,null,null,null,null,null,null,{"$f":"IF(H72=List!$A$8,7,0)","v":0}]
[{"$f":"'Translation '!A505","v":"How close are basin temperature approaches to wet bulb temp?"},null,null,null,null,null,null,{"$f":"'Translation '!A572","v":"Around 5°F"},null,null,{"$f":"IF(I73=List!$A$7,3,0)","v":0}]
[null,null,null,null,null,null,null,{"$f":"'Translation '!A573","v":">5° F"},null,null,{"$f":"IF(I74=List!$A$7,0,0)","v":0}]
[{"$f":"'Translation '!A506","v":"Do you have any of the following discharge pressure problem?"},null,null,null,null,null,null,{"$f":"'Translation '!A574","v":"Distribution piping fouling "},null,null,{"$f":"IF(I75=List!$A$8,1,0)","v":0}]
[null,null,null,null,null,null,null,{"$f":"'Translation '!A575","v":"Cooling water exchanger fouling "},null,null,{"$f":"IF(I76=List!$A$8,2,0)","v":0}]
[null,null,null,null,null,null,null,{"$f":"'Translation '!A576","v":"Higher than design cooling loads"},null,null,{"$f":"IF(I77=List!$A$8,1,0)","v":0}]
[{"$f":"'Translation '!A507","v":"Do you monitor cooling water exchanger fouling rates and/or pressure drop?"},null,null,null,null,null,null,null,null,null,{"$f":"IF(H78=List!$A$7,7,0)","v":0}]
[{"$f":"'Translation '!A508","v":"Do you have the following cooling water distribution problems in the process units? "},null,null,null,null,null,null,{"$f":"'Translation '!A577","v":"Capacity Problem"},null,null,{"$f":"IF(I79=List!$A$7,2,0)","v":0}]
[null,null,null,null,null,null,null,{"$f":"'Translation '!A578","v":"Starving some user"},null,null,{"$f":"IF(I80=List!$A$7,2,0)","v":0}]
[{"$f":"'Translation '!A509","v":"Do you have sludge or sediment problems in cooling tower basins? "},null,null,null,null,null,null,null,null,null,{"$f":"IF(H81=List!$A$8,4,0)","v":0}]
[{"$f":"'Translation '!A510","v":"Have you optimized water vs air cooling loads?"},null,null,null,null,null,null,null,null,null,{"$f":"IF(H82=List!$A$7,3,0)","v":0}]
[{"$f":"'Translation '!A511","v":"% of Cooling load supplied by the following (Total must be less than or equal to 100%) "},null,null,null,null,null,null,{"$f":"'Translation '!A579","v":"Mechanical Draft Towers"},null,null,{"$f":"4*I83/100","v":0}]
[null,null,null,null,null,null,null,{"$f":"'Translation '!A580","v":"Natural Draft Towers"},null,null,{"$f":"2*I84/100","v":0}]
[null,null,null,null,null,null,null,{"$f":"'Translation '!A581","v":"Cooling ponds"},null,null,{"$f":"1*I85/100","v":0}]
[null,null,null,null,null,null,null,{"$f":"'Translation '!A582","v":"Spray Ponds"},null,null,{"$f":"0*I86/100","v":0}]
[{"$f":"'Translation '!A512","v":"Estimate the percentage of cooling water distribution pump HP delivered by the following (Total must be less than or equal to 100%) "},null,null,null,null,null,null,{"$f":"'Translation '!A583","v":"Backpressure turbine drives"},null,null,{"$f":"5*I87/100","v":0}]
[null,null,null,null,null,null,null,{"$f":"'Translation '!A584","v":"Variable speed drives"},null,null,{"$f":"3*I88/100","v":0}]
[null,null,null,null,null,null,null,{"$f":"'Translation '!A585","v":"Motor drives"},null,null,{"$f":"2*I89/100","v":0}]
[null,null,null,null,null,null,null,{"$f":"'Translation '!A586","v":"Condensing turbine drives"},null,null,{"$f":"0*I90/100","v":0}]
[{"$f":"'Translation '!A513","v":"How many pumps used for cooling and refrigeration process?"},null,null,null,null,null,null,null,null,null,{"$f":"0*I91/100","v":0}]
[{"$f":"'Translation '!A514","v":"Are you running the minimum number of pumps? "},null,null,null,null,null,null,null,null,null,{"$f":"IF(H92=List!$A$7,3,0)","v":0}]
[{"$f":"'Translation '!A515","v":"If not Select why "},null,null,null,null,null,null,{"$f":"'Translation '!A587","v":"Emergency on-line backup supply criteria"},null,null,{"$f":"IF(I93=List!$A$7,0,0)","v":0}]
[null,null,null,null,null,null,null,{"$f":"'Translation '!A588","v":"System capacity (High discharge pressure)"},null,null,{"$f":"IF(I94=List!$A$7,0,0)","v":0}]
[null,null,null,null,null,null,null,{"$f":"'Translation '!A589","v":"Ease of operation "},null,null,{"$f":"IF(I95=List!$A$7,0,0)","v":0}]
[null,null,null,null,null,null,null,{"$f":"'Translation '!A590","v":"N/A"},null,null,{"$f":"IF(I96=List!$A$7,0,0)","v":0}]
[{"$f":"'Translation '!A516","v":"Type of cooling"},null,null,null,null,null,null,{"$f":"'Translation '!A591","v":"Splash Film "},null,null,{"$f":"IF(I97=List!$A$7,0,0)","v":0}]
[null,null,null,null,null,null,null,{"$f":"'Translation '!A592","v":"Film Fill"},null,null,{"$f":"IF(I98=List!$A$7,1,0)","v":0}]
[{"$f":"'Translation '!A517","v":"Do the cooling tower fans have adjustable pitch blades?"},null,null,null,null,null,null,{"$f":"'Translation '!A593","v":"All"},null,null,{"$f":"IF(I99=List!$A$7,4,0)","v":0}]
[null,null,null,null,null,null,null,{"$f":"'Translation '!A594","v":"Some"},null,null,{"$f":"IF(I100=List!$A$7,2,0)","v":0}]
[null,null,null,null,null,null,null,{"$f":"'Translation '!A595","v":"None"},null,null,{"$f":"IF(I101=List!$A$7,0,0)","v":0}]
[{"$f":"'Translation '!A518","v":"Does the cooling tower have adjustable speed drive?"},null,null,null,null,null,null,{"$f":"'Translation '!A596","v":"All"},null,null,{"$f":"IF(I102=List!$A$7,6,0)","v":0}]
[null,null,null,null,null,null,null,{"$f":"'Translation '!A597","v":"Some"},null,null,{"$f":"IF(I103=List!$A$7,4,0)","v":0}]
[null,null,null,null,null,null,null,{"$f":"'Translation '!A598","v":"None"},null,null,{"$f":"IF(I104=List!$A$7,0,0)","v":0}]
[{"$f":"'Translation '!A519","v":"Condition of cooling Towers"},null,null,null,null,null,null,{"$f":"'Translation '!A599","v":"Excellent "},null,null,{"$f":"IF(I105=List!$A$7,10,0)","v":0}]
[null,null,null,null,null,null,null,{"$f":"'Translation '!A600","v":"Adequate"},null,null,{"$f":"IF(I106=List!$A$7,5,0)","v":0}]
[null,null,null,null,null,null,null,{"$f":"'Translation '!A601","v":"In need of replacement"},null,null,{"$f":"IF(I107=List!$A$7,0,0)","v":0}]
[{"$f":"'Translation '!A520","v":"Other comments or information  related to Process Cooling and Refrigeration , operations etc. "},null,null,null,null,null,null,null,null,null,{"$f":"SUM(K10:K107)","v":0}]

{"sheet":"Process Heating","index":9,"n_rows":47,"n_cols":6,"rows_kept":47,"cut":false,"hidden":true,"merged":[[37,2,37,3],[27,2,27,3],[28,2,28,3],[29,2,30,3],[32,2,32,3],[0,0,0,3],[31,2,31,3],[33,2,33,3],[34,2,34,3],[35,2,35,3],[1,0,1,1],[8,0,8,1],[21,0,25,1],[26,0,26,1],[27,0,27,1],[9,0,9,1],[10,0,19,1],[3,0,3,1],[2,0,2,1],[6,0,6,1],[47,0,55,3],[8,2,8,3],[33,0,33,1],[34,0,34,1],[35,0,35,1],[36,0,36,1],[37,0,37,1],[9,2,9,3],[28,0,28,1],[29,0,30,1],[31,0,31,1],[32,0,32,1],[44,2,44,3],[26,2,26,3],[38,0,40,1],[36,2,36,3],[41,2,41,3],[43,2,43,3],[42,2,42,3],[45,2,45,3],[46,0,46,3],[41,0,41,1],[42,0,42,1],[43,0,43,1],[44,0,44,1],[45,0,45,1]]}
[{"$f":"'Translation '!A436","v":"Process Heating (Scorecard)"}]
[{"$f":"'Translation '!A80","v":"Instructions:"}]
[{"$f":"'Translation '!A437","v":"Please respond to the following questions on process heating."}]
[{"$f":"'Translation '!A438","v":"Process heating equipment include furnaces used for melting or heating of various materials, fuel fired chemical reactions, kilns, ovens, dryers, heaters, electrically heated process equipment  etc."}]
[{"$f":"'Translation '!A83","v":"Input values in cells colored in green"}]
[{"$f":"'Translation '!A84","v":"Select from the drop down menu in the cells colored in pink"}]
[{"$f":"'Translation '!A314","v":"Please select Not Applicable (N/A) to the questions which are not applicable for the system in your plant."}]
[]
[{"$f":"'Translation '!A325","v":"Questions:"},null,{"$f":"'Translation '!A326","v":"Please select the answer from the drop down list"}]
[{"$f":"'Translation '!A439","v":"Have you conducted a detail energy assessment for your heating equipment using tools such as Process Heating Survey and Assessment Tool (PHAST) to identify energy saving opportunities? "},null,null,null,null,{"$f":"IF(C10=List!$A$7,150,0)","v":0}]
[{"$f":"'Translation '!A440","v":"Types of Processes for which process heating equipment is used in the Enterprise "},null,{"$f":"'Translation '!A460","v":"Calcining"},null,null,0]
[null,null,{"$f":"'Translation '!A461","v":"Metal Melting"},null,null,0]
[null,null,{"$f":"'Translation '!A462","v":"Non-metal (i.e. glass) melting"},null,null,0]
[null,null,{"$f":"'Translation '!A463","v":"Drying (food, wood, ceramic, etc.)"},null,null,0]
[null,null,{"$f":"'Translation '!A464","v":"Curing (rubber, plastic, paint, etc.)"},null,null,0]
[null,null,{"$f":"'Translation '!A465","v":"Metal heat treating"},null,null,0]
[null,null,{"$f":"'Translation '!A466","v":"Fluid heating (liquid, crude oil, etc.)"},null,null,0]
[null,null,{"$f":"'Translation '!A467","v":"Non-metal heating (ceramics, glass, etc.)"},null,null,0]
[null,null,{"$f":"'Translation '!A468","v":"Incineration - thermal oxidizing"},null,null,0]
[null,null,{"$f":"'Translation '!A469","v":"Other, please specify:"},null,null,0]
[null,null,null,null,null,0]
[{"$f":"'Translation '!A441","v":"Type of fuel(s) used for Process Heating Equipment "},null,{"$f":"'Translation '!A470","v":"Coal"},null,null,0]
[null,null,{"$f":"'Translation '!A471","v":"Fuel Oil"},null,null,0]
[null,null,{"$f":"'Translation '!A472","v":"Natural Gas"},null,null,0]
[null,null,{"$f":"'Translation '!A473","v":"Electricity"},null,null,0]
[null,null,{"$f":"'Translation '!A474","v":"Other, please specify:"},null,null,0]
[{"$f":"'Translation '!A442","v":"Do you have co-generation or power generation equipment?"},null,null,null,null,0]
[{"$f":"'Translation '!A443","v":"If yes, give size (MW) capacity:"},null,null,null,"MW",0]
[{"$f":"'Translation '!A444","v":"Do you use steam in heating equipment"},null,null,null,null,0]
[{"$f":"'Translation '!A445","v":"Do you use electrically heated equipment such as induction, electric arc or electric resistance heating type furnaces?"},null,null,null,null,0]
[null,null,null,null,null,0]
[{"$f":"'Translation '!A446","v":"Do you measure oxygen (O2) and Carbon Monoxide CO or combustible in flue gases and \"tune\" the burners periodically to maintain low values for O2 and combustibles in the furnace flue gases"},null,null,null,null,{"$f":"IF(C32=List!$A$7,100,0)","v":0}]
[{"$f":"'Translation '!A447","v":"Have you sealed openings in furnaces and repaired cracks, and damaged insulation in furnace walls, doors etc.?"},null,null,null,null,{"$f":"IF(C33=List!$A$7,50,0)","v":0}]
[{"$f":"'Translation '!A448","v":"Do you regularly clean heat transfer surfaces to avoid build up of soot, scale or other material? "},null,null,null,null,{"$f":"IF(C34=List!$A$7,25,0)","v":0}]
[{"$f":"'Translation '!A449","v":"Do you have a program for calibration/adjustment of sensors (i.e. thermocouples), controllers, valve operators etc.?"},null,null,null,null,{"$f":"IF(C35=List!$A$7,25,0)","v":0}]
[{"$f":"'Translation '!A450","v":"Do you operate the furnace at or close to design load by proper furnace scheduling and loading, and avoid delays, waits between production?"},null,null,null,null,{"$f":"IF(C36=List!$A$7,25,0)","v":0}]
[{"$f":"'Translation '!A451","v":"Do you maintain proper (balanced or slightly positive) pressure in furnaces to avoid air leakage in the furnace?"},null,null,null,null,{"$f":"IF(C37=List!$A$7,50,0)","v":0}]
[{"$f":"'Translation '!A452","v":"Do you have heat recovery system?"},null,null,null,null,0]
[{"$f":"'Translation '!A453","v":"If yes :"},null,{"$f":"'Translation '!A475","v":"Heat of flue gases from the furnace or air preheater is used to heat charge material, fixtures etc."},null,null,{"$f":"IF(OR(D39=List!A7,D41=List!A7),25,0)","v":0}]
[null,null,{"$f":"'Translation '!A476","v":"A heat recovery system (i.e. recuperator, regenerator, water or heating etc.) is used to recover heat from the furnace flue gases."},null,null,{"$f":"IF(D40=List!$A$7,100,0)","v":0}]
[null,null,{"$f":"'Translation '!A477","v":"Heat of flue gases from the furnace or air preheater is used for lower temperature processes such as steam generation, water heating or air heating for the plant or other application"},null,null,{"$f":"IF(AND(D40=List!A7,OR(D39=List!A7,D41=List!A7)),67,0)","v":0}]
[{"$f":"'Translation '!A454","v":"Do you use design of fixtures, trays and other material handling system components with minimum weight and proper material?"},null,null,null,null,{"$f":"IF(C42=List!$A$7,50,0)","v":0}]
[{"$f":"'Translation '!A455","v":"Do you use proper insulation for (or minimize use of) water or air cooled parts such as rolls, load supports etc. used in furnace?"},null,null,null,null,{"$f":"IF(C43=List!$A$7,50,0)","v":0}]
[{"$f":"'Translation '!A456","v":"Are you using oxygen enriched air or oxy-fuel fired burners for high temperature processes? "},null,null,null,null,{"$f":"IF(C44=List!$A$7,100,0)","v":0}]
[{"$f":"'Translation '!A457","v":"Are you using the most cost effective source of heat for processes where it is possible use alternate energy sources (i.e. steam vs. electricity vs. fuel firing) where applicable? "},null,null,null,null,{"$f":"IF(C45=List!$A$7,50,0)","v":0}]
[{"$f":"'Translation '!A458","v":"Do your heating equipment and other heated parts use cost effective type and thickness of insulation? "},null,null,null,null,{"$f":"IF(C46=List!$A$7,25,0)","v":0}]
[{"$f":"'Translation '!A459","v":"Other comments or information  related to Process Heating, energy use, operations etc. "},null,null,null,null,{"$f":"SUM(F10:F46)","v":0}]

{"sheet":"Pumps","index":10,"n_rows":28,"n_cols":15,"rows_kept":28,"cut":false,"hidden":true,"merged":[[24,0,24,9],[24,10,24,12],[25,0,25,9],[25,10,25,12],[10,11,10,12],[20,0,20,9],[20,10,20,12],[12,11,12,12],[13,11,13,12],[27,0,27,12],[28,0,36,12],[8,0,8,9],[9,0,13,9],[21,0,21,9],[22,0,22,9],[23,0,23,9],[26,0,26,9],[21,10,21,12],[22,10,22,12],[23,10,23,12],[26,10,26,12],[9,11,9,12],[11,11,11,12],[8,10,8,12],[14,0,19,9],[0,0,0,12],[1,0,1,9],[2,0,2,9],[3,0,3,9],[6,0,6,9],[4,0,4,7],[5,0,5,7],[4,8,4,9],[5,8,5,9]]}
[{"$f":"'Translation '!A602","v":"Pumps (Scorecard)"}]
[{"$f":"'Translation '!A80","v":"Instructions:"}]
[{"$f":"'Translation '!A603","v":"Please respond to the following questions on pumps"}]
[{"$f":"'Translation '!A604","v":"Pumps include machine-driven pump systems"}]
[{"$f":"'Translation '!A83","v":"Input values in cells colored in green"}]
[{"$f":"'Translation '!A84","v":"Select from the drop down menu in the cells colored in pink"}]
[{"$f":"'Translation '!A314","v":"Please select Not Applicable (N/A) to the questions which are not applicable for the system in your plant."}]
[]
[{"$f":"'Translation '!A325","v":"Questions:"},null,null,null,null,null,null,null,null,null,{"$f":"'Translation '!A326","v":"Please select the answer from the drop down list"}]
[{"$f":"'Translation '!A605","v":"For system in which flow is controlled or regulated, estimate the percentage that are controlled by:        (Total must be less than or equal to 100%)"},null,null,null,null,null,null,null,null,null,{"$f":"'Translation '!A615","v":"Valve throttling or bypass flow regulation "},null,null,null,{"$f":"L10*0/100","v":0}]
[null,null,null,null,null,null,null,null,null,null,{"$f":"'Translation '!A616","v":"Turning pumps on and off to match speed"},null,null,null,{"$f":"L11*35/100","v":0}]
[null,null,null,null,null,null,null,null,null,null,{"$f":"'Translation '!A617","v":"Constant Load-Pump matched to meet need at pump best efficiency point "},null,null,null,{"$f":"L12*50/100","v":0}]
[null,null,null,null,null,null,null,null,null,null,{"$f":"'Translation '!A618","v":"Adjustable speed drives"},null,null,null,{"$f":"L13*45/100","v":0}]
[null,null,null,null,null,null,null,null,null,null,{"$f":"'Translation '!A619","v":"Combination of above or don’t know"},null,null,null,{"$f":"L14*20/100","v":0}]
[{"$f":"'Translation '!A606","v":"Estimate the percentage of pumping systems for which the answer to the following questions is YES."},null,null,null,null,null,null,null,null,null,{"$f":"'Translation '!A620","v":"Are the pump performance curve readily available?"},null,null,null,{"$f":"M15*3.75/100","v":0}]
[null,null,null,null,null,null,null,null,null,null,{"$f":"'Translation '!A621","v":"Are the Systems head-capacity curves well understood?"},null,null,null,{"$f":"M16*3.75/100","v":0}]
[null,null,null,null,null,null,null,null,null,null,{"$f":"'Translation '!A622","v":"Are the pumps tested at installation to compare performance with manufacture's curve?"},null,null,null,{"$f":"M17*3.75/100","v":0}]
[null,null,null,null,null,null,null,null,null,null,{"$f":"'Translation '!A623","v":"Is motor power or current measurement and pump efficiency estimated as part of installation test?"},null,null,null,{"$f":"M18*2.5/100","v":0}]
[null,null,null,null,null,null,null,null,null,null,{"$f":"'Translation '!A624","v":"Are pumps periodically tested or measures trended to check for performance degradation?"},null,null,null,{"$f":"M19*5/100","v":0}]
[null,null,null,null,null,null,null,null,null,null,{"$f":"'Translation '!A625","v":"Do you evaluate the potential energy cost savings (compared to optimal commercially available equipment operating at the existing head and flow rates)? "},null,null,null,{"$f":"M20*2.5/100","v":0}]
[{"$f":"'Translation '!A607","v":"What percentage of your systems have permanently installed flow meters? "},null,null,null,null,null,null,null,null,null,null,null,null,null,{"$f":"K21*3.75/100","v":0}]
[{"$f":"'Translation '!A608","v":"Do you purchase energy efficient or premium efficiency motors as standard practice?"},null,null,null,null,null,null,null,null,null,null,null,null,null,{"$f":"IF(K22=List!$A$7,3.25,0)","v":0}]
[{"$f":"'Translation '!A609","v":"Do you have motor repair/ replacement decision policy in place?"},null,null,null,null,null,null,null,null,null,null,null,null,null,{"$f":"IF(K23=List!$A$7,2.6,0)","v":0}]
[{"$f":"'Translation '!A610","v":"Do you include energy efficiency guidelines in pump purchase specification?"},null,null,null,null,null,null,null,null,null,null,null,null,null,{"$f":"IF(K24=List!$A$7,3.25,0)","v":0}]
[{"$f":"'Translation '!A611","v":"Are energy factor a primary consideration when repairing or replacing an existing pump that has failed?"},null,null,null,null,null,null,null,null,null,null,null,null,null,{"$f":"IF(K25=List!$A$7,3.9,0)","v":0}]
[{"$f":"'Translation '!A612","v":"Percentage of operator that could explain how to read and use a pump head-capacity curve?"},null,null,null,null,null,null,null,null,null,null,null,null,null,{"$f":"K26*4.8/100","v":0}]
[{"$f":"'Translation '!A613","v":"% of understanding of the pump performance curves: head, power, efficiency, and NPSHR (Net Positive Suction Head)?"},null,null,null,null,null,null,null,null,null,null,null,null,null,{"$f":"K27*7.2/100","v":0}]
[{"$f":"'Translation '!A614","v":"Other comments or information  related to Pumps, operations etc. "},null,null,null,null,null,null,null,null,null,null,null,null,null,{"$f":"SUM(O10:O27)","v":0}]

{"sheet":"Steam Generation Equipment","index":11,"n_rows":85,"n_cols":14,"rows_kept":85,"cut":false,"hidden":true,"merged":[[15,0,20,9],[11,0,11,9],[12,0,14,9],[11,10,11,11],[9,0,9,9],[10,0,10,9],[10,10,10,11],[8,10,8,11],[8,0,8,9],[9,10,9,11],[0,0,0,11],[1,0,1,9],[2,0,2,9],[3,0,3,9],[6,0,6,9],[4,0,4,7],[5,0,5,7],[4,8,4,9],[5,8,5,9],[84,0,84,11],[85,0,93,11],[73,10,73,11],[53,10,53,11],[54,10,54,11],[55,10,55,11],[56,10,56,11],[62,10,62,11],[59,0,61,9],[53,0,53,9],[54,0,54,9],[55,0,55,9],[56,0,56,9],[57,0,58,9],[78,0,80,9],[62,0,62,9],[75,0,77,9],[74,10,74,11],[81,0,83,9],[49,0,51,9],[52,0,52,11],[69,0,72,9],[73,0,73,9],[74,0,74,9],[66,0,68,9],[63,0,65,9],[39,0,41,9],[36,0,38,9],[42,0,44,9],[45,0,48,9],[21,0,25,9],[26,0,29,9],[33,0,35,9],[30,0,32,9]]}
[{"$f":"'Translation '!A626","v":"Steam Generation Equipment (Scorecard)"}]
[{"$f":"'Translation '!A80","v":"Instructions:"}]
[{"$f":"'Translation '!A628","v":"Please respond to the following questions on steam generation equipment "}]
[{"$f":"'Translation '!A627","v":"The complete steam system, including boilers, steam distribution lines, steam traps, and final delivery of steam to the process (e.g., heat exchangers)"}]
[{"$f":"'Translation '!A83","v":"Input values in cells colored in green"}]
[{"$f":"'Translation '!A84","v":"Select from the drop down menu in the cells colored in pink"}]
[{"$f":"'Translation '!A314","v":"Please select Not Applicable (N/A) to the questions which are not applicable for the system in your plant."}]
[]
[{"$f":"'Translation '!A325","v":"Questions:"},null,null,null,null,null,null,null,null,null,{"$f":"'Translation '!A326","v":"Please select the answer from the drop down list"}]
[{"$f":"'Translation '!A629","v":"Do  you monitor your Fuel Cost to generate Steam in terms of ($)/(1000lbs of steam produced)"},null,null,null,null,null,null,null,null,null,null,null,null,{"$f":"IF(K10=List!$A$7,10,0)","v":0}]
[{"$f":"'Translation '!A630","v":"How often do you calculate and trend your fuel cost to generate steam?"},null,null,null,null,null,null,null,null,null,null,null,null,{"$f":"IF(OR(K11=List!$A$43,K11=List!$A$44,K11=List!$A$45),10,IF(OR(K11=List!$A$46,K11=List!$A$47),5,0))","v":0}]
[{"$f":"'Translation '!A631","v":"Do you measure Steam /Product Benchmark-in terms of  (Lbs. of steam needed/ unit of product produced)? "},null,null,null,null,null,null,null,null,null,null,null,null,{"$f":"IF(K12=List!$A$7,10,0)","v":0}]
[{"$f":"'Translation '!A632","v":"How often do you measure Steam /Product Benchmark-in terms of  (Lbs. of steam needed/ unit of product produced)"},null,null,null,null,null,null,null,null,null,{"$f":"'Translation '!A660","v":"at least quarterly"},null,null,{"$f":"IF(L13=List!$A$7,10,0)","v":0}]
[null,null,null,null,null,null,null,null,null,null,{"$f":"'Translation '!A661","v":"at least annually"},null,null,{"$f":"IF(L14=List!$A$7,5,0)","v":0}]
[null,null,null,null,null,null,null,null,null,null,{"$f":"'Translation '!A662","v":"less than annually"},null,null,{"$f":"IF(L15=List!$A$7,0,0)","v":0}]
[{"$f":"'Translation '!A633","v":"Please select the following Critical Energy parameters that are measured"},null,null,null,null,null,null,null,null,null,{"$f":"'Translation '!A663","v":"Steam Production rate"},null,null,{"$f":"IF(L16=List!$A$7,10,0)","v":0}]
[null,null,null,null,null,null,null,null,null,null,{"$f":"'Translation '!A664","v":"Fuel flow rate "},null,null,{"$f":"IF(L17=List!$A$7,6,0)","v":0}]
[null,null,null,null,null,null,null,null,null,null,{"$f":"'Translation '!A665","v":"Feed water flow rate"},null,null,{"$f":"IF(L18=List!$A$7,6,0)","v":0}]
[null,null,null,null,null,null,null,null,null,null,{"$f":"'Translation '!A666","v":"Makeup water flow rate"},null,null,{"$f":"IF(L19=List!$A$7,4,0)","v":0}]
[null,null,null,null,null,null,null,null,null,null,{"$f":"'Translation '!A667","v":"Blowdown flow rate"},null,null,{"$f":"IF(L20=List!$A$7,2,0)","v":0}]
[null,null,null,null,null,null,null,null,null,null,{"$f":"'Translation '!A668","v":"Chemical Input flow rate"},null,null,{"$f":"IF(L21=List!$A$7,2,0)","v":0}]
[{"$f":"'Translation '!A634","v":"How intensely do you meter your steam flow?"},null,null,null,null,null,null,null,null,null,{"$f":"'Translation '!A669","v":"By major equipment"},null,null,{"$f":"IF(L22=List!$A$7,20,0)","v":0}]
[null,null,null,null,null,null,null,null,null,null,{"$f":"'Translation '!A670","v":"By process unit"},null,null,{"$f":"IF(L23=List!$A$7,10,0)","v":0}]
[null,null,null,null,null,null,null,null,null,null,{"$f":"'Translation '!A671","v":"By area or building"},null,null,{"$f":"IF(L24=List!$A$7,5,0)","v":0}]
[null,null,null,null,null,null,null,null,null,null,{"$f":"'Translation '!A672","v":"By plant as a whole(i.e., total boiler output)"},null,null,{"$f":"IF(L25=List!$A$7,2,0)","v":0}]
[null,null,null,null,null,null,null,null,null,null,{"$f":"'Translation '!A673","v":"Not at all"},null,null,{"$f":"IF(L26=List!$A$7,0,0)","v":0}]
[{"$f":"'Translation '!A635","v":"Please select if any one of the following Steam Trap maintenance program is carried out"},null,null,null,null,null,null,null,null,null,{"$f":"'Translation '!A674","v":"Proper trap selection for application"},null,null,{"$f":"IF(L27=List!$A$7,10,0)","v":0}]
[null,null,null,null,null,null,null,null,null,null,{"$f":"'Translation '!A675","v":"At least Annual testing of all Traps"},null,null,{"$f":"IF(L28=List!$A$7,10,0)","v":0}]
[null,null,null,null,null,null,null,null,null,null,{"$f":"'Translation '!A676","v":"Maintaining a steam Trap database"},null,null,{"$f":"IF(L29=List!$A$7,10,0)","v":0}]
[null,null,null,null,null,null,null,null,null,null,{"$f":"'Translation '!A677","v":"Repair/ replacing defective Traps"},null,null,{"$f":"IF(L30=List!$A$7,10,0)","v":0}]
[{"$f":"'Translation '!A636","v":"Please select how often the water chemical treatment system is functioning properly?"},null,null,null,null,null,null,null,null,null,{"$f":"'Translation '!A678","v":"at least daily"},null,null,{"$f":"IF(L31=List!$A$7,10,0)","v":0}]
[null,null,null,null,null,null,null,null,null,null,{"$f":"'Translation '!A679","v":"at least weekly"},null,null,{"$f":"IF(L32=List!$A$7,5,0)","v":0}]
[null,null,null,null,null,null,null,null,null,null,{"$f":"'Translation '!A680","v":"less than weekly"},null,null,{"$f":"IF(L33=List!$A$7,0,0)","v":0}]
[{"$f":"'Translation '!A637","v":"How often do you measure conductivity ( total dissolved solids) in your boiler and determine what your steam and mud drum blowdown rate (or top and bottom boiler blowdown rate) should be? "},null,null,null,null,null,null,null,null,null,{"$f":"'Translation '!A681","v":"Continuously or at least once/ shift"},null,null,{"$f":"IF(L34=List!$A$7,10,0)","v":0}]
[null,null,null,null,null,null,null,null,null,null,{"$f":"'Translation '!A682","v":"Once/day"},null,null,{"$f":"IF(L35=List!$A$7,5,0)","v":0}]
[null,null,null,null,null,null,null,null,null,null,{"$f":"'Translation '!A683","v":"Once/week or less"},null,null,{"$f":"IF(L36=List!$A$7,0,0)","v":0}]
[{"$f":"'Translation '!A638","v":"How often do you NEED to clean fireside or waterside deposit in boilers?"},null,null,null,null,null,null,null,null,null,{"$f":"'Translation '!A684","v":"every 5-10 years"},null,null,{"$f":"IF(L37=List!$A$7,10,0)","v":0}]
[null,null,null,null,null,null,null,null,null,null,{"$f":"'Translation '!A685","v":"every 1-5 years"},null,null,{"$f":"IF(L38=List!$A$7,5,0)","v":0}]
[null,null,null,null,null,null,null,null,null,null,{"$f":"'Translation '!A686","v":"Once a year or more"},null,null,{"$f":"IF(L39=List!$A$7,0,0)","v":0}]
[{"$f":"'Translation '!A639","v":"Is your boiler plant equipment and piping system insulation (refractory, piping, valves, flanges, vessels, etc.) maintained and in good condition? "},null,null,null,null,null,null,null,null,null,{"$f":"'Translation '!A687","v":"Excellent "},null,null,{"$f":"IF(L40=List!$A$7,10,0)","v":0}]
[null,null,null,null,null,null,null,null,null,null,{"$f":"'Translation '!A688","v":"Good but can be improved"},null,null,{"$f":"IF(L41=List!$A$7,7,0)","v":0}]
[null,null,null,null,null,null,null,null,null,null,{"$f":"'Translation '!A689","v":"Inadequate"},null,null,{"$f":"IF(L42=List!$A$7,0,0)","v":0}]
[{"$f":"'Translation '!A640","v":"Is your steam distribution, end use, and condensate recovery equipment insulation (piping, valves, flanges, heat exchangers, etc.) maintained and in good condition? "},null,null,null,null,null,null,null,null,null,{"$f":"'Translation '!A690","v":"Excellent "},null,null,{"$f":"IF(L43=List!$A$7,20,0)","v":0}]
[null,null,null,null,null,null,null,null,null,null,{"$f":"'Translation '!A691","v":"Good but can be improved"},null,null,{"$f":"IF(L44=List!$A$7,14,0)","v":0}]
[null,null,null,null,null,null,null,null,null,null,{"$f":"'Translation '!A692","v":"Inadequate"},null,null,{"$f":"IF(L45=List!$A$7,0,0)","v":0}]
[{"$f":"'Translation '!A641","v":"How  would you characterize steam leaks in steam system"},null,null,null,null,null,null,null,null,null,{"$f":"'Translation '!A693","v":"None"},null,null,{"$f":"IF(L46=List!$A$7,10,0)","v":0}]
[null,null,null,null,null,null,null,null,null,null,{"$f":"'Translation '!A694","v":"Minor"},null,null,{"$f":"IF(L47=List!$A$7,8,0)","v":0}]
[null,null,null,null,null,null,null,null,null,null,{"$f":"'Translation '!A695","v":"Moderate"},null,null,{"$f":"IF(L48=List!$A$7,3,0)","v":0}]
[null,null,null,null,null,null,null,null,null,null,{"$f":"'Translation '!A696","v":"Numerous"},null,null,{"$f":"IF(L49=List!$A$7,0,0)","v":0}]
[{"$f":"'Translation '!A642","v":"How often do you detect noticeable water hammer in your steam system and condensate recovery system?"},null,null,null,null,null,null,null,null,null,{"$f":"'Translation '!A697","v":"Daily "},null,null,{"$f":"IF(L50=List!$A$7,0,0)","v":0}]
[null,null,null,null,null,null,null,null,null,null,{"$f":"'Translation '!A698","v":"Weekly/ monthly"},null,null,{"$f":"IF(L51=List!$A$7,5,0)","v":0}]
[null,null,null,null,null,null,null,null,null,null,{"$f":"'Translation '!A699","v":"Less than once a month"},null,null,{"$f":"IF(L52=List!$A$7,10,0)","v":0}]
[{"$f":"'Translation '!A643","v":"Are the following inspected once a year?"}]
[{"$f":"'Translation '!A644","v":"Boiler plant equipment - boiler, deaerator, feed water tank, chemical treatment equipment, blowdown equipment, economizer, combustion air preheater, insulation, etc."},null,null,null,null,null,null,null,null,null,null,null,null,{"$f":"IF(K54=List!$A$7,5,0)","v":0}]
[{"$f":"'Translation '!A645","v":"Distribution system equipment - piping (including design), steam traps (types, sizes, locations), air vents, valves, pressure reducing stations, insulation, etc. "},null,null,null,null,null,null,null,null,null,null,null,null,{"$f":"IF(K55=List!$A$7,5,0)","v":0}]
[{"$f":"'Translation '!A646","v":"End use system equipment - turbines, piping (including design), heat exchangers, coils, jacketed kettles, steam traps (types, sizes, locations), air vents, vacuum breakers, pressure reducing valves, insulation, etc. "},null,null,null,null,null,null,null,null,null,null,null,null,{"$f":"IF(K56=List!$A$7,5,0)","v":0}]
[{"$f":"'Translation '!A647","v":"Recovery system equipment - piping (including design), valves, fittings, flash tanks, condensate pumps, condensate meters, insulation, etc.?"},null,null,null,null,null,null,null,null,null,null,null,null,{"$f":"IF(K57=List!$A$7,5,0)","v":0}]
[{"$f":"'Translation '!A648","v":"If you have heat recovery system , please select the kind"},null,null,null,null,null,null,null,null,null,{"$f":"'Translation '!A700","v":"Feed water economizer and/or combustion air preheater"},null,null,{"$f":"IF(L58=List!$A$7,10,0)","v":0}]
[null,null,null,null,null,null,null,null,null,null,{"$f":"'Translation '!A701","v":"Blowdown heat recovery"},null,null,{"$f":"IF(L59=List!$A$7,5,0)","v":0}]
[{"$f":"'Translation '!A649","v":"How often do you check the quality of steam that is output from your boiler to the distribution system, and ensure that you are generating Dry steam?"},null,null,null,null,null,null,null,null,null,{"$f":"'Translation '!B660","v":"at least quarterly"},null,null,{"$f":"IF(L60=List!$A$7,10,0)","v":0}]
[null,null,null,null,null,null,null,null,null,null,{"$f":"'Translation '!B661","v":"at least annually"},null,null,{"$f":"IF(L61=List!$A$7,5,0)","v":0}]
[null,null,null,null,null,null,null,null,null,null,{"$f":"'Translation '!B662","v":"less than annually"},null,null,{"$f":"IF(L62=List!$A$7,0,0)","v":0}]
[{"$f":"'Translation '!A650","v":"Do you have operational automatic blowdown controller on your boiler?"},null,null,null,null,null,null,null,null,null,null,null,null,{"$f":"IF(K63=List!$A$7,10,0)","v":0}]
[{"$f":"'Translation '!A651","v":"What is the frequency of High Level Alarms(possible indicating boiler undersize ) or Low Alarm(possible indicating boiler oversize) for your boiler?"},null,null,null,null,null,null,null,null,null,{"$f":"'Translation '!A702","v":"Less than 1/ month"},null,null,{"$f":"IF(L64=List!$A$7,10,0)","v":0}]
[null,null,null,null,null,null,null,null,null,null,{"$f":"'Translation '!A703","v":"1-5 per month"},null,null,{"$f":"IF(L65=List!$A$7,5,0)","v":0}]
[null,null,null,null,null,null,null,null,null,null,{"$f":"'Translation '!A704","v":"more than 5 per month"},null,null,{"$f":"IF(L66=List!$A$7,0,0)","v":0}]
[{"$f":"'Translation '!A652","v":"How often do you experience steam pressure fluctuation of greater than 10% of your boiler operating pressure?"},null,null,null,null,null,null,null,null,null,{"$f":"'Translation '!A702","v":"Less than 1/ month"},null,null,{"$f":"IF(L67=List!$A$7,5,0)","v":0}]
[null,null,null,null,null,null,null,null,null,null,{"$f":"'Translation '!A703","v":"1-5 per month"},null,null,{"$f":"IF(L68=List!$A$7,3,0)","v":0}]
[null,null,null,null,null,null,null,null,null,null,{"$f":"'Translation '!A704","v":"more than 5 per month"},null,null,{"$f":"IF(L69=List!$A$7,0,0)","v":0}]
[{"$f":"'Translation '!A653","v":"Please select a method used to reduce steam pressure in your steam system?"},null,null,null,null,null,null,null,null,null,{"$f":"'Translation '!A705","v":"Steam generated at required pressure or PRVs appropriately applied"},null,null,{"$f":"IF(L70=List!$A$7,10,0)","v":0}]
[null,null,null,null,null,null,null,null,null,null,{"$f":"'Translation '!A706","v":"Backpressure turbines used in parallel with PRVs"},null,null,{"$f":"IF(L71=List!$A$7,10,0)","v":0}]
[null,null,null,null,null,null,null,null,null,null,{"$f":"'Translation '!A707","v":"Boiler control used to reduce pressure"},null,null,{"$f":"IF(L72=List!$A$7,5,0)","v":0}]
[null,null,null,null,null,null,null,null,null,null,{"$f":"'Translation '!A708","v":"Excess steam vent "},null,null,{"$f":"IF(L73=List!$A$7,0,0)","v":0}]
[{"$f":"'Translation '!A654","v":"How much of your available condensate do you recover and utilize?"},null,null,null,null,null,null,null,null,null,null,null,null,{"$f":"IF(K74=List!$A$57,10,IF(K74=List!$A$58,6,IF(K74=List!$A$59,3,0)))","v":0}]
[{"$f":"'Translation '!A655","v":"If you have flash steam available do you recover and use?"},null,null,null,null,null,null,null,null,null,null,null,null,{"$f":"IF(K75=List!$A$57,10,IF(K75=List!$A$58,6,IF(K75=List!$A$59,3,0)))","v":0}]
[{"$f":"'Translation '!A656","v":"How often do you measure over-all boiler efficiency (Heat absorbed to create Steam/Energy input from fuel)"},null,null,null,null,null,null,null,null,null,{"$f":"'Translation '!A660","v":"at least quarterly"},null,null,{"$f":"IF(L76=List!$A$7,10,0)","v":0}]
[null,null,null,null,null,null,null,null,null,null,{"$f":"'Translation '!A661","v":"at least annually"},null,null,{"$f":"IF(L77=List!$A$7,5,0)","v":0}]
[null,null,null,null,null,null,null,null,null,null,{"$f":"'Translation '!A662","v":"less than annually"},null,null,{"$f":"IF(L78=List!$A$7,0,0)","v":0}]
[{"$f":"'Translation '!A657","v":"Please select the parameters that are measured"},null,null,null,null,null,null,null,null,null,{"$f":"'Translation '!A709","v":"Flue gas temperature"},null,null,{"$f":"IF(L79=List!$A$7,5,0)","v":0}]
[null,null,null,null,null,null,null,null,null,null,{"$f":"'Translation '!A710","v":"Flue gas oxygen content"},null,null,{"$f":"IF(L80=List!$A$7,5,0)","v":0}]
[null,null,null,null,null,null,null,null,null,null,{"$f":"'Translation '!A711","v":"Flue gas CO content"},null,null,{"$f":"IF(L81=List!$A$7,5,0)","v":0}]
[{"$f":"'Translation '!A658","v":"How do you control excess air in your boiler to maximize boiler efficiency"},null,null,null,null,null,null,null,null,null,{"$f":"'Translation '!A712","v":"Automatically"},null,null,{"$f":"IF(L82=List!$A$7,10,0)","v":0}]
[null,null,null,null,null,null,null,null,null,null,{"$f":"'Translation '!A713","v":"Manually"},null,null,{"$f":"IF(L83=List!$A$7,5,0)","v":0}]
[null,null,null,null,null,null,null,null,null,null,{"$f":"'Translation '!A714","v":"Not at all"},null,null,{"$f":"IF(L84=List!$A$7,0,0)","v":0}]
[{"$f":"'Translation '!A659","v":"Other comments or information  related to Steam generation Equipment, operations etc. "},null,null,null,null,null,null,null,null,null,null,null,null,{"$f":"SUM(N10:N84)","v":0}]

{"sheet":"Results","index":12,"n_rows":567,"n_cols":10,"rows_kept":567,"cut":false,"hidden":false,"merged":[[566,2,566,6],[16,1,16,2],[106,1,107,6],[176,1,176,7],[0,1,0,6],[1,1,3,6],[9,1,9,2],[19,1,19,2],[20,1,20,2],[11,1,11,2],[5,1,5,2],[12,1,14,6],[11,3,11,5],[10,1,10,2],[4,1,4,5],[6,1,6,2],[17,1,17,2],[45,5,47,5],[182,1,184,1],[45,1,45,2],[18,1,18,2],[45,4,47,4],[23,1,24,6],[44,1,44,2],[49,1,50,6],[46,1,46,2],[47,1,47,2],[43,1,43,5],[21,1,21,2],[41,1,42,7],[129,1,130,7],[77,1,78,6],[565,2,565,6],[561,2,561,6],[557,2,557,6],[558,2,558,6],[559,2,559,6],[560,2,560,6],[562,2,562,6],[564,2,564,6],[563,2,563,6],[556,2,556,6],[555,1,555,6],[547,1,547,2],[546,3,546,6],[542,1,542,6],[544,1,544,6],[552,1,553,6],[548,1,548,2],[549,1,549,2],[550,1,550,2],[547,3,547,6],[548,3,548,6],[549,3,549,6],[550,3,550,6],[518,1,518,4],[387,1,387,6],[445,1,445,6],[546,1,546,2],[545,1,545,2],[545,3,545,6],[517,1,517,4],[519,1,519,4],[474,1,476,7],[505,1,505,6],[506,1,516,6],[5,3,5,5],[6,3,6,5],[7,3,7,5],[15,1,15,6],[8,3,8,5],[9,3,9,5],[10,3,10,5],[7,1,7,2],[8,1,8,2],[178,1,180,6],[185,1,185,6],[182,2,184,7],[204,1,207,5],[447,1,448,7],[302,1,303,6],[415,1,416,7],[389,1,390,7],[232,1,232,6],[251,1,252,7],[330,1,330,6],[275,1,275,5],[277,1,278,7],[332,1,334,7],[358,1,359,6]]}
[null,{"$f":"'Translation '!A717","v":"Plant Energy Profiler Results"}]
[null,{"$f":"'Translation '!A718","v":"The Plant Energy Profiler (PEP) tool helps industrial plant managers understand how energy is being purchased and consumed at their plant and identifies potential energy and cost savings. Once the user has entered the basic plant info, energy and production data, energy intensive equipment used in the plant the tools helps to breakdown the energy consumption for the equipment in the plant, the cost of energy associated to operate the equipment, and the potential energy saving  that can be achieved. The tool further gives the user a list of next steps or potential projects that might help the plant to reduce energy consumption. PEP is an excellent “first step” that industrial companies can use to identify opportunities for savings, improve their energy consumption , and help reduce the environmental emissions associated with energy production and use. \n\nTable 1 shows plant's contact information and industry type. "}]
[]
[]
[null,{"$f":"'Translation '!A719","v":"Table 1: Plant Contact Information"}]
[null,{"$f":"'Translation '!A48","v":"Corporation Name:"},null,{"$f":"IF('Basic Info '!B3>0,'Basic Info '!B3,\"\")","v":""},null,null,null,"`"]
[null,{"$f":"'Translation '!A49","v":"Plant Name:"},null,{"$f":"IF('Basic Info '!B4>0,'Basic Info '!B4,\"\")","v":""}]
[null,{"$f":"'Translation '!A50","v":"Primary Product:"},null,{"$f":"IF('Basic Info '!B5>0,'Basic Info '!B5,\"\")","v":""}]
[null,{"$f":"'Translation '!A51","v":"Industry Type:"},null,{"$f":"IF('Basic Info '!B6>0,'Basic Info '!B6,\"\")","v":""}]
[null,{"$f":"'Translation '!A52","v":"NAICS Code"},null,{"$f":"IF('Basic Info '!B7>0,'Basic Info '!B7,\"\")","v":""}]
[null,{"$f":"'Translation '!A57","v":"Primary Contact for Assessment:"},null,{"$f":"IF('Basic Info '!H4>0,'Basic Info '!H4,\"\")","v":""}]
[null,{"$f":"'Translation '!A61","v":"E-mail:"},null,{"$f":"IF('Basic Info '!H8>0,'Basic Info '!H8,\"\")","v":""}]
[null,{"$f":"'Translation '!A720","v":"Table 2  shows the annual purchased (site) electricity , natural gas, steam, and other fuels consumption data; the cost of each energy stream and their source power consumption for the baseline year. "}]
[]
[]
[null,{"$f":"'Translation '!A721","v":"Table 2: Annual Energy Use Summary"}]
[null,{"$f":"'Translation '!A120","v":"Energy Type"},null,{"$f":"'Translation '!$A$722","v":"Site Energy Use"},{"$f":"'Translation '!$A$724","v":"Site Energy Use (0)"},{"$f":"'Translation '!$A$726","v":"Source Energy Use (0)"},{"$f":"'Translation '!B723","v":"Energy Cost($)"}]
[null,{"$f":"'Translation '!A129","v":"Electricity"},null,{"$f":"'NAICS Data-Base'!AB76","v":" "},{"$f":"Total_Electricity","v":false},{"$f":"'Energy & Production '!D86","v":""},{"$f":"'Energy & Production '!F86","v":""}]
[null,{"$f":"'Translation '!A130","v":"Natural Gas"},null,{"$f":"'NAICS Data-Base'!AB77","v":" "},{"$f":"Total_NG","v":false},{"$f":"IF('Energy & Production '!D87>0,'Energy & Production '!D87,\"\")","v":""},{"$f":"'Energy & Production '!F87","v":""}]
[null,{"$f":"'Translation '!A131","v":"Steam"},null,{"$f":"'NAICS Data-Base'!AB78","v":" "},{"$f":"Total_Steam","v":false},{"$f":"IF('Energy & Production '!D88>0,'Energy & Production '!D88,\"\")","v":""},{"$f":"'Energy & Production '!F88","v":""}]
[null,{"$f":"IF('Energy & Production '!F10>0,'Energy & Production '!F10,\"-\")","v":"-"},null,{"$f":"'NAICS Data-Base'!AB79","v":" "},{"$f":"Total_OF","v":false},{"$f":"IF('Energy & Production '!D89>0,'Energy & Production '!D89,\"\")","v":""},{"$f":"'Energy & Production '!F89","v":""}]
[null,{"$f":"'Translation '!A861","v":"Grand Total "},null,null,{"$f":"ROUND(SUM(E18:E21),0)","v":0},{"$f":"IF(SUM(F18:F21)>0,ROUND(SUM(F18:F21),0),\"\")","v":""},{"$f":"SUM(G18:G21)","v":0}]
[]
[null,{"$f":"'Translation '!A728","v":"Figures 1a and 1b show the annual site electricity , natural gas, steam, and other fuels consumption in mega joules; and the cost of each energy stream."}]
[]
[]
[]
[]
[]
[]
[]
[]
[]
[]
[]
[]
[]
[]
[]
[]
[]
[null,{"$f":"'Translation '!A729","v":"Table 3 shows the annual production for the different products that are produced in the plant along with the energy intensity for the baseline year. "}]
[]
[null,{"$f":"'Translation '!A730","v":"Table 3: Production Energy Use"}]
[null,{"$f":"'Translation '!A731","v":"Production Stream "},null,{"$f":"'Translation '!A732","v":"Quantity"},{"$f":"'Translation '!A725","v":"Total Site Energy Use (0)"},{"$f":"CONCATENATE(List!C47,\" \",\"(\",List!G47,\"/\",\"Unit\",\")\")","v":"Energy Use per Unit of Production (0/Unit)"}]
[null,{"$f":"'Translation '!A735","v":"Product 1"},null,{"$f":"'Energy & Production '!H86","v":false},{"$f":"SUM('Energy & Production '!B86:C89)","v":0},{"$f":"IFERROR((E46/SUM(D46:D48)),\"\")","v":""}]
[null,{"$f":"'Translation '!A736","v":"Product 2"},null,{"$f":"'Energy & Production '!I86","v":false}]
[null,{"$f":"'Translation '!A737","v":"Product 3"},null,{"$f":"'Energy & Production '!J86","v":false}]
[]
[null,{"$f":"'Translation '!A738","v":"Fig. 2a shows the distribution of electricity , natural gas, and other fuel.  "}]
[]
[]
[null,{"$f":"CONCATENATE('Translation '!A740,\" \",TEXT(E22,\"###,###\"),\"  \",EI_Metric,\"  \",'Translation '!A741:A741,\"  \",TEXT('NAICS Data-Base'!Q145,\"#,###\"),\"  \",'Energy & Production '!J19)","v":"Total annual consumption for baseline year was estimated at     with annual production of    Unit"}]
[]
[]
[]
[]
[]
[]
[]
[]
[]
[]
[]
[]
[]
[]
[]
[]
[]
[]
[]
[]
[]
[]
[]
[]
[null,{"$f":"'Translation '!A739","v":"Fig. 2b shows the monthly energy consumption (electricity, natural gas, steam, and other fuels) of the plant along with their monthly production data."}]
[]
[]
[]
[]
[]
[]
[]
[]
[]
[]
[]
[]
[]
[]
[]
[]
[]
[]
[]
[]
[]
[]
[]
[]
[]
[]
[]
[]
[null,{"$f":"'Translation '!A742","v":"Figure 2c shows the correlation between Energy Intensity and production. "}]
[]
[]
[]
[]
[]
[]
[]
[]
[]
[]
[]
[]
[]
[]
[]
[]
[]
[]
[]
[]
[]
[]
[null,{"$f":"'Translation '!A743","v":"Figure 3a. shows the different energy type used by each system type present in the plant. This helps the user to understand how much energy each system is using. "}]
[]
[]
[]
[]
[]
[]
[]
[]
[]
[]
[]
[]
[]
[]
[]
[]
[]
[]
[]
[]
[]
[]
[]
[null,{"$f":"'Translation '!A755","v":"Fig 3b. shows the percentage energy consumption per system. "}]
[]
[]
[]
[]
[]
[]
[]
[]
[]
[]
[]
[]
[]
[]
[]
[]
[]
[]
[]
[]
[]
[]
[]
[]
[null,{"$f":"'Translation '!A744","v":"Table 4. summarizes the source energy consumption of each system. The user can see score from the scorecard if they have filled the forms for the system present in the plant. The tool uses the score from the scorecard (if the user has filled the scorecard) or the input from the \"Energy saving opportunity\" tab  to categorize the energy saving opportunity and gives the energy saving that can be achieved."}]
[]
[]
[]
[null,{"$f":"'Translation '!A746","v":"Note:"},{"$f":"'Translation '!A745","v":"The savings shown below correspond with the system and component recommendations shown in the suggested next steps table. The United Nations Industrial Development Organization Motor Systems Efficiency Supply Curves report shows that higher savings may be achievable for each system area."}]
[]
[]
[null,{"$f":"'Translation '!A747","v":"Table 4: Potential Annual Energy Savings()"}]
[null,{"$f":"'Translation '!A748","v":"System Name"},{"$f":"'Translation '!A749","v":"Site Energy Consumption ()"},{"$f":"'Translation '!A834","v":"Cost per System($)"},{"$f":"'Translation '!A276","v":"% Energy Consumption by system "},{"$f":"'Translation '!A752","v":"Potential Energy Savings by System\n(%)"},{"$f":"'Translation '!A753","v":"Potential Site Energy Savings()"},{"$f":"'Translation '!A824","v":"Potential Cost Saving($)"},null,"Savings Oppurtunity"]
[null,{"$f":"'Translation '!A161","v":"Combined Heat and Power (Cogeneration)"},{"$f":"'NAICS Data-Base'!J88","v":0},{"$f":"'NAICS Data-Base'!M88","v":0},{"$f":"IFERROR('NAICS Data-Base'!H133,0)","v":0},{"$f":"'NAICS Data-Base'!F133","v":0},{"$f":"'NAICS Data-Base'!G133","v":0},{"$f":"'NAICS Data-Base'!R88","v":0},null,{"$f":"'NAICS Data-Base'!E133","v":0}]
[null,{"$f":"'Translation '!A162","v":"Compressed Air"},{"$f":"'NAICS Data-Base'!J89","v":0},{"$f":"'NAICS Data-Base'!M89","v":0},{"$f":"IFERROR('NAICS Data-Base'!H134,0)","v":0},{"$f":"'NAICS Data-Base'!F134","v":0},{"$f":"'NAICS Data-Base'!G134","v":0},{"$f":"'NAICS Data-Base'!R89","v":0},null,{"$f":"'NAICS Data-Base'!E134","v":0}]
[null,{"$f":"'Translation '!A163","v":"Electrochemical Processes"},{"$f":"'NAICS Data-Base'!J90","v":0},{"$f":"'NAICS Data-Base'!M90","v":0},{"$f":"IFERROR('NAICS Data-Base'!H135,0)","v":0},{"$f":"'NAICS Data-Base'!F135","v":0},{"$f":"'NAICS Data-Base'!G135","v":0},{"$f":"'NAICS Data-Base'!R90","v":0},null,{"$f":"'NAICS Data-Base'!E135","v":0}]
[null,{"$f":"'Translation '!A164","v":"Fans and Blowers"},{"$f":"'NAICS Data-Base'!J91","v":0},{"$f":"'NAICS Data-Base'!M91","v":0},{"$f":"IFERROR('NAICS Data-Base'!H136,0)","v":0},{"$f":"'NAICS Data-Base'!F136","v":0},{"$f":"'NAICS Data-Base'!G136","v":0},{"$f":"'NAICS Data-Base'!R91","v":0},null,{"$f":"'NAICS Data-Base'!E136","v":0}]
[null,{"$f":"'Translation '!A165","v":"Industrial Facilities (Lighting)"},{"$f":"'NAICS Data-Base'!J92","v":0},{"$f":"'NAICS Data-Base'!M92","v":0},{"$f":"IFERROR('NAICS Data-Base'!H137,0)","v":0},{"$f":"'NAICS Data-Base'!F137","v":0},{"$f":"'NAICS Data-Base'!G137","v":0},{"$f":"'NAICS Data-Base'!R92","v":0},null,{"$f":"'NAICS Data-Base'!E137","v":0}]
[null,{"$f":"'Translation '!A166","v":"Industrial Facilities (HVAC)"},{"$f":"'NAICS Data-Base'!J93","v":0},{"$f":"'NAICS Data-Base'!M93","v":0},{"$f":"IFERROR('NAICS Data-Base'!H138,0)","v":0},{"$f":"'NAICS Data-Base'!F138","v":0},{"$f":"'NAICS Data-Base'!G138","v":0},{"$f":"'NAICS Data-Base'!R93","v":0},null,{"$f":"'NAICS Data-Base'!E138","v":0}]
[null,{"$f":"'Translation '!A167","v":"Material Handling"},{"$f":"'NAICS Data-Base'!J94","v":0},{"$f":"'NAICS Data-Base'!M94","v":0},{"$f":"IFERROR('NAICS Data-Base'!H139,0)","v":0},{"$f":"'NAICS Data-Base'!F139","v":0},{"$f":"'NAICS Data-Base'!G139","v":0},{"$f":"'NAICS Data-Base'!R94","v":0},null,{"$f":"'NAICS Data-Base'!E139","v":0}]
[null,{"$f":"'Translation '!A168","v":"Material Processing"},{"$f":"'NAICS Data-Base'!J95","v":0},{"$f":"'NAICS Data-Base'!M95","v":0},{"$f":"IFERROR('NAICS Data-Base'!H140,0)","v":0},{"$f":"'NAICS Data-Base'!F140","v":0},{"$f":"'NAICS Data-Base'!G140","v":0},{"$f":"'NAICS Data-Base'!R95","v":0},null,{"$f":"'NAICS Data-Base'!E140","v":0}]
[null,{"$f":"'Translation '!A169","v":"Process Cooling and Refrigeration"},{"$f":"'NAICS Data-Base'!J96","v":0},{"$f":"'NAICS Data-Base'!M96","v":0},{"$f":"IFERROR('NAICS Data-Base'!H141,0)","v":0},{"$f":"'NAICS Data-Base'!F141","v":0},{"$f":"'NAICS Data-Base'!G141","v":0},{"$f":"'NAICS Data-Base'!R96","v":0},null,{"$f":"'NAICS Data-Base'!E141","v":0}]
[null,{"$f":"'Translation '!A170","v":"Process Heating"},{"$f":"'NAICS Data-Base'!J97","v":0},{"$f":"'NAICS Data-Base'!M97","v":0},{"$f":"IFERROR('NAICS Data-Base'!H142,0)","v":0},{"$f":"'NAICS Data-Base'!F142","v":0},{"$f":"'NAICS Data-Base'!G142","v":0},{"$f":"'NAICS Data-Base'!R97","v":0},null,{"$f":"'NAICS Data-Base'!E142","v":0}]
[null,{"$f":"'Translation '!A171","v":"Pumps"},{"$f":"'NAICS Data-Base'!J98","v":0},{"$f":"'NAICS Data-Base'!M98","v":0},{"$f":"IFERROR('NAICS Data-Base'!H143,0)","v":0},{"$f":"'NAICS Data-Base'!F143","v":0},{"$f":"'NAICS Data-Base'!G143","v":0},{"$f":"'NAICS Data-Base'!R98","v":0},null,{"$f":"'NAICS Data-Base'!E143","v":0}]
[null,{"$f":"'Translation '!A172","v":"Steam Generation Equipment"},{"$f":"'NAICS Data-Base'!J99","v":0},{"$f":"'NAICS Data-Base'!M99","v":0},{"$f":"IFERROR('NAICS Data-Base'!H144,0)","v":0},{"$f":"'NAICS Data-Base'!F144","v":0},{"$f":"'NAICS Data-Base'!G144","v":0},{"$f":"'NAICS Data-Base'!R99","v":0},null,{"$f":"'NAICS Data-Base'!E144","v":0}]
[null,{"$f":"'Translation '!A277","v":"Miscellaneous"},{"$f":"'NAICS Data-Base'!Q76","v":0},{"$f":"'NAICS Data-Base'!Q79","v":0},{"$f":"IFERROR('NAICS Data-Base'!H145,0)","v":0}]
[null,{"$f":"'Translation '!A754","v":"Total"},{"$f":"SUM(C188:C200)","v":0},{"$f":"IF(SUM(D188:D200)>0,SUM(D188:D200),\"\")","v":""},{"$f":"SUM(E188:E200)","v":0},null,{"$f":"SUM(G188:G199)","v":0},{"$f":"SUM(H188:H199)","v":0}]
[]
[]
[]
[null,{"$f":"'Translation '!A756","v":"Fig. 4a shows the annual energy consumption and the potential energy saving for each system."}]
[]
[]
[]
[]
[]
[]
[]
[]
[]
[]
[]
[]
[]
[]
[]
[]
[]
[]
[]
[]
[]
[]
[]
[]
[]
[]
[]
[null,{"$f":"'Translation '!A757","v":"Fig. 4b shows the annual energy consumption and the potential energy saving for each fuel source."}]
[]
[]
[]
[]
[]
[]
[]
[]
[]
[]
[]
[]
[]
[]
[]
[]
[]
[]
[null,{"$f":"'Translation '!A758","v":"Figures 5a, 5b , 5c and 5d provide a breakdown of the annual energy consumption and the potential energy saving for each fuel source in its original units."}]
[]
[]
[]
[]
[]
[]
[]
[]
[]
[]
[]
[]
[]
[]
[]
[]
[]
[]
[]
[]
[]
[]
[]
[null,{"$f":"'Translation '!A759","v":"Electricity Use and Potential Savings by System "}]
[]
[null,{"$f":"'Translation '!B771","v":"Figures 6a presents the breakdown of the annual electricity consumption a by system in a pie chart. "}]
[]
[]
[]
[]
[]
[]
[]
[]
[]
[]
[]
[]
[]
[]
[]
[]
[]
[]
[]
[]
[]
[]
[]
[]
[null,{"$f":"'Translation '!B775","v":"Figures 6b presents the breakdown of the annual electricity consumption and the potential electricity saving by system in a stacked bar chart. "}]
[]
[]
[]
[]
[]
[]
[]
[]
[]
[]
[]
[]
[]
[]
[]
[]
[]
[]
[]
[]
[]
[]
[]
[]
[]
[]
[]
[null,{"$f":"'Translation '!A760","v":"Natural Gas Use and Potential Savings by System "}]
[]
[null,{"$f":"'Translation '!B772","v":"Figures 7a presents the breakdown of the annual natural gas consumptionby system in a pie chart. "}]
[]
[]
[]
[]
[]
[]
[]
[]
[]
[]
[]
[]
[]
[]
[]
[]
[]
[]
[]
[]
[]
[]
[]
[]
[]
[null,{"$f":"'Translation '!B776","v":"Figures 7b presents the breakdown of the annual natural gas consumption and the potential natural gas saving by system in a stacked bar chart. "}]
[]
[]
[]
[]
[]
[]
[]
[]
[]
[]
[]
[]
[]
[]
[]
[]
[]
[]
[]
[]
[]
[]
[]
[]
[]
[]
[]
[]
[null,{"$f":"'Translation '!A761","v":"Steam Use and Potential Savings by System "}]
[]
[null,{"$f":"'Translation '!B773","v":"Figures 8a presents the breakdown of the annual steam consumption by system in a pie chart. The outher pie represents the total steam used while the inner pie represents the potential saings."}]
[]
[]
[]
[]
[]
[]
[]
[]
[]
[]
[]
[]
[]
[]
[]
[]
[]
[]
[]
[]
[]
[]
[]
[]
[]
[null,{"$f":"'Translation '!B777","v":"Figures 8b presents the breakdown of the annual steam consumption and the potential steam saving by system in a stacked bar chart. "}]
[]
[]
[]
[]
[]
[]
[]
[]
[]
[]
[]
[]
[]
[]
[]
[]
[]
[]
[]
[]
[]
[]
[]
[]
[]
[]
[]
[]
[]
[null,{"$f":"'Translation '!A762","v":"Other Fuel Usage and Potential Savings by System "}]
[]
[null,{"$f":"'Translation '!B774","v":"Figures 9a presents the breakdown of the annual consumption of miscellaneous fuel by system in a pie chart. "}]
[]
[]
[]
[]
[]
[]
[]
[]
[]
[]
[]
[]
[]
[]
[]
[]
[]
[]
[]
[]
[]
[]
[]
[]
[]
[]
[null,{"$f":"'Translation '!B778","v":"Figures 9b presents the breakdown of the annual  consumption and the potential electricity saving by system in a stacked bar chart. "}]
[]
[]
[]
[]
[]
[]
[]
[]
[]
[]
[]
[]
[]
[]
[]
[]
[]
[]
[]
[]
[]
[]
[]
[]
[]
[]
[]
[]
[]
[]
[null,"Potential Annual CO2 Emissions Savings"]
[null,{"$f":"'Translation '!A780","v":"Based on the potential energy savings identified above, your plant may be able to reduce emissions of CO2. The following potential annual CO2 emission savings numbers are broad estimates based on industry averages and are not meant to reflect actual realized savings at your plant. Factors such as CHP system or steam generator efficiency and primary fuel source for energy use systems such as furnaces and boilers make a large difference in the actual amount of CO2 emission saved. These numbers are presented as a broad estimate based on estimated savings and industry averages only.\nNOTE: Actual CO2 savings from fuel/steam energy savings are based on the primary fuel source. The exact breakdown of the individual primary fuels that are used at your plant for process heating, power generation and steam generation is beyond the scope of this tool. The table below shows a range of potential CO2 savings from fuel/steam use in your plant. The low end of the range is based on the use of fuels that contain relatively low amounts of carbon such as natural gas. The high end of the range is based on fuels that have a high amount of carbon such as coal (anthracite, bituminous or lignite). Your actual CO2 emission reduction will depend on the actual primary fuels that are used at your plant."}]
[]
[]
[]
[]
[]
[]
[]
[]
[]
[]
[null,{"$f":"'Translation '!A781","v":"Potential Annual CO2 from Electricity"},null,null,null,{"$f":"IFERROR('NAICS Data-Base'!I209,0)","v":""},{"$f":"'Translation '!$A$784","v":"Metric Ton"}]
[null,{"$f":"'Translation '!A782","v":"Potential Annual CO2 from Natural gas"},null,null,null,{"$f":"IFERROR('NAICS Data-Base'!I208,0)","v":""},{"$f":"'Translation '!$A$784","v":"Metric Ton"}]
[null,{"$f":"'Translation '!A783","v":"Potential Annual CO2 from Coal"},null,null,null,{"$f":"IFERROR('NAICS Data-Base'!I210,0)","v":""},{"$f":"'Translation '!$A$784","v":"Metric Ton"}]
[]
[]
[]
[]
[]
[]
[]
[]
[]
[]
[]
[]
[]
[]
[]
[]
[]
[]
[]
[]
[]
[]
[null,{"$f":"'Translation '!A785","v":"Implemented Energy Efficiency Projects and Potential Opportunities "}]
[]
[null,{"$f":"'Translation '!A786","v":"Plant's energy management team is actively identifying and implementing energy efficiency projects. The plant has implemented the following energy efficiency projects and initiatives recently."}]
[null,{"$f":"'Translation '!A790","v":"Name of the Project"},null,{"$f":"'Translation '!A791","v":"Description of the project "}]
[null,{"$f":"'Energy Saving Opportunities'!A32","v":0},null,{"$f":"'Energy Saving Opportunities'!D32:J32","v":0}]
[null,{"$f":"'Energy Saving Opportunities'!A33","v":0},null,{"$f":"'Energy Saving Opportunities'!D33:J33","v":0}]
[null,{"$f":"'Energy Saving Opportunities'!A34","v":0},null,{"$f":"'Energy Saving Opportunities'!D34:J34","v":0}]
[null,{"$f":"'Energy Saving Opportunities'!A35","v":0},null,{"$f":"'Energy Saving Opportunities'!D35:J35","v":0}]
[null,{"$f":"'Energy Saving Opportunities'!A36","v":0},null,{"$f":"'Energy Saving Opportunities'!D36:J36","v":0}]
[]
[null,{"$f":"'Translation '!A792","v":"Based on the scores of system specific scorecards and/or the user selection in the 'Energy Saving Opportunity' section a ranking has been given to each system. This ranking helped us to determine the possible next steps the plant can take to further reduce their energy consumption. "}]
[]
[]
[null,{"$f":"'Translation '!A793","v":"Energy Efficiency Projects Identified or Potential Project Opportunities"}]
[null,{"$f":"'Translation '!A748","v":"System Name"},{"$f":"'Translation '!A794","v":"Energy Efficiency Projects Identified or Potential Project Opportunities"}]
[null,{"$f":"'Translation '!A161","v":"Combined Heat and Power (Cogeneration)"},{"$f":"IF(OR(J188=List!$A$8,J188=List!$A$9,J188=0),\"The system is not present in your plant\",VLOOKUP(B558,'NAICS Data-Base'!$B$149:$N$202,MATCH(J188,'NAICS Data-Base'!$B$149:$N$149,0),FALSE))","v":"The system is not present in your plant"}]
[null,{"$f":"'Translation '!A162","v":"Compressed Air"},{"$f":"IF(OR(J189=List!$A$8,J189=List!$A$9,J189=0),\"The system is not present in your plant\",VLOOKUP(B559,'NAICS Data-Base'!$B$149:$N$202,MATCH(J189,'NAICS Data-Base'!$B$149:$N$149,0),FALSE))","v":"The system is not present in your plant"}]
[null,{"$f":"'Translation '!A164","v":"Fans and Blowers"},{"$f":"IF(OR(J191=List!$A$8,J191=List!$A$9,J191=0),\"The system is not present in your plant\",VLOOKUP(B560,'NAICS Data-Base'!$B$149:$N$202,MATCH(J191,'NAICS Data-Base'!$B$149:$N$149,0),FALSE))","v":"The system is not present in your plant"}]
[null,{"$f":"'Translation '!A165","v":"Industrial Facilities (Lighting)"},{"$f":"IF(OR(J192=List!$A$8,J192=List!$A$9,J192=0),\"The system is not present in your plant\",VLOOKUP(B561,'NAICS Data-Base'!$B$149:$N$202,MATCH(J192,'NAICS Data-Base'!$B$149:$N$149,0),FALSE))","v":"The system is not present in your plant"}]
[null,{"$f":"'Translation '!A166","v":"Industrial Facilities (HVAC)"},{"$f":"IF(OR(J193=List!$A$8,J193=List!$A$9,J193=0),\"The system is not present in your plant\",VLOOKUP(B562,'NAICS Data-Base'!$B$149:$N$202,MATCH(J193,'NAICS Data-Base'!$B$149:$N$149,0),FALSE))","v":"The system is not present in your plant"}]
[null,{"$f":"'Translation '!A169","v":"Process Cooling and Refrigeration"},{"$f":"IF(OR(J196=List!$A$8,J196=List!$A$9,J196=0),\"The system is not present in your plant\",VLOOKUP(B563,'NAICS Data-Base'!$B$149:$N$202,MATCH(J196,'NAICS Data-Base'!$B$149:$N$149,0),FALSE))","v":"The system is not present in your plant"}]
[null,{"$f":"'Translation '!A170","v":"Process Heating"},{"$f":"IF(OR(J197=List!$A$8,J197=List!$A$9,J197=0),\"The system is not present in your plant\",VLOOKUP(B564,'NAICS Data-Base'!$B$149:$N$202,MATCH(J197,'NAICS Data-Base'!$B$149:$N$149,0),FALSE))","v":"The system is not present in your plant"}]
[null,{"$f":"'Translation '!A171","v":"Pumps"},{"$f":"IF(OR(J198=List!$A$8,J198=List!$A$9,J198=0),\"The system is not present in your plant\",VLOOKUP(B565,'NAICS Data-Base'!$B$149:$N$202,MATCH(J198,'NAICS Data-Base'!$B$149:$N$149,0),FALSE))","v":"The system is not present in your plant"}]
[null,{"$f":"'Translation '!A172","v":"Steam Generation Equipment"},{"$f":"IF(OR(J199=List!$A$8,J199=List!$A$9,J199=0),\"The system is not present in your plant\",VLOOKUP(B566,'NAICS Data-Base'!$B$149:$N$202,MATCH(J199,'NAICS Data-Base'!$B$149:$N$149,0),FALSE))","v":"The system is not present in your plant"}]
[null,{"$f":"'Translation '!A173","v":"Energy Management"},{"$f":"'Energy Management Opportunity'!D4","v":"1.) Put together an energy management plan\n\n2.) Form a cross functional energy team\n\n3.) Construct a formal methodolgy to communicate energy management practices to the emplyees\n\n4.) Make use of life cycle cost analysis to evaluate the energy efficiecy projects\n\n5.) Establish a suitable payback period for energy efficiency projects"}]

{"sheet":"Tutorial","index":13,"n_rows":344,"n_cols":3,"rows_kept":344,"cut":false,"hidden":true,"merged":[[343,2,343,14],[266,2,267,14],[263,2,264,14],[260,2,261,14],[255,2,258,14],[271,2,274,14],[276,2,276,14],[289,2,289,14],[306,2,306,14],[326,2,326,14],[195,2,197,14],[199,2,202,14],[204,2,207,14],[211,2,215,14],[217,2,218,14],[147,2,150,14],[140,2,143,14],[97,2,99,14],[158,2,160,14],[154,2,156,14],[57,2,58,13],[87,2,88,14],[91,2,92,13],[34,2,36,14],[11,2,14,14],[16,2,17,14]]}
[]
[]
[]
[]
[]
[]
[]
[]
[]
[]
[]
[null,null,"This software tool helps plants quickly “diagnose” their energy use and begin identifying opportunities for savings. It does this by providing an overview of the amount of energy that your plant purchases, identifying the major industrial systems that consume that energy, describing your plant’s savings potential, and pointing out specific measures you can take to realize savings. PEPEx is like a road map that directs you to specific, targeted ways to save energy and money. "]
[]
[]
[]
[]
[null,null,"Using PEPex and information about your particular plant, you can complete a plant profile in about one hour. This tutorial explains the information you’ll need to complete the profile. "]
[]
[]
[]
[]
[]
[]
[]
[]
[]
[]
[]
[]
[]
[]
[]
[null,null,"Understanding Tool Layout"]
[]
[null,null,"PHASTEx consist of 7 core excel worksheets. Based on its function the sheets are categorized as introduction sheets, user input sheets and result sheet. The user manually completes the input data  sheets and the output graphs and tables are populated accordingly in the “Results” sheet"]
[]
[]
[]
[]
[]
[]
[]
[]
[]
[]
[]
[]
[]
[]
[]
[]
[]
[]
[]
[]
[null,null,"Step 1: Basic Information"]
[]
[null,null,"The Basic Information sheet is the first step in PEPex. On this screen you will enter some basic information about your facility. "]
[]
[]
[]
[]
[]
[]
[]
[]
[]
[]
[]
[]
[]
[]
[]
[]
[]
[]
[]
[]
[]
[]
[]
[]
[]
[]
[]
[]
[]
[null,null,"The only madated field in this sheet is the “Indusrty Type”. PEPEx uses the industry type data to calculate default breakdown of the energy uses per system in Step 3."]
[]
[]
[]
[null,null,"The remaining questions which include basic information regarding the plant location, operating schedule and energy management are primarily for book keeping purposes and do not affect the results."]
[]
[]
[]
[null,null,"Step 2: Energy and Production Data"]
[]
[null,null,"The second input sheet in the PEPEx application is “Energy and Production”. You are asked to enter data from utility bills and/or sub meter recordings. Some of the important fields on this sheet are discussed below. "]
[]
[]
[]
[]
[]
[]
[]
[]
[]
[]
[]
[]
[]
[]
[]
[]
[]
[]
[]
[]
[]
[]
[]
[]
[]
[]
[]
[]
[]
[]
[]
[]
[]
[]
[]
[]
[]
[]
[]
[]
[null,null,"Units of Measurement "]
[]
[null,null,"PEPEx allows you to input your energy data for each fuel in the unit which is most familiar to you. Only when presenting results for the various energy sources together does PEPEx convert all units to a common output unit. The user further has the option to choose this output unit from a list of optons from the dropdown box in cell I11."]
[]
[]
[]
[]
[null,null,"Facility’s Energy and Production"]
[]
[null,null,"On cell B16, the user can choose to use either annual or monthly data for energy and production inputs. The appropriate tables popup based on the selection. Most of the PEPEx results can be generated with just the annual data some of the graphs/tables need monthly data. These graphs/tables will be hidden from the results if annual data is used. "]
[]
[]
[]
[]
[null,null,"Site to Source conversion (optional)"]
[]
[null,null,"The user also has the option to input a source energy factor for each fuel used. Source Energy factor is used to calculate the source energy for each energy stream. Source energy incorporates all transmission, delivery and production losses associated with each energy stream. "]
[]
[]
[]
[null,null,"The default source factor for each stream is provided , based on those used in Energy Star Portfolio Manager. The user may wish to make appropriate changes to this factor to account for losses associated with transmission, delivery, and production of each energy stream. PEPEx calculates all its results in terms of \"site energy\" unless explicitily stated."]
[]
[]
[]
[null,null,"Step 3: Energy Use Systems"]
[]
[]
[]
[]
[]
[]
[]
[]
[]
[]
[]
[]
[]
[]
[]
[]
[]
[]
[]
[]
[]
[]
[]
[]
[]
[]
[]
[]
[]
[]
[]
[]
[null,null,"In Step 3, select the energy end use systems that consume energy at your plant from the dropdown in Column C, rows 24 to 35. For each system that is used in the plant it is necessary to choose a primary energy source."]
[]
[]
[]
[null,null,"Based on this information PEPEx populates the default energy breakdown based on the industry type, defined in Step 1, in cells F39 – G50. The default percentages are based on data collected by the Manufacturing Energy Consumption Survey (MECS) administered by the U.S. Energy Information Administration in 2010. "]
[]
[]
[]
[]
[null,null,"The user may override these default values by providing an estimate of the facilities actual percentages in cells F24 – G35. For more accurate results, it is recommended that the user overrides the default values, even if it is with partial information. If you are not sure how much energy is used for each of the breakout categories, you can leave these cells blank and the default percentages will be used.\n \nThe user may override these default values by providing an estimate of the facilities actual percentages in cells F24 – G35. For more accurate results, it is recommended that the user overrides the default values, even if it is with partial information. If you are not sure how much energy is used for each of the breakout categories, you can leave these cells blank and the default percentages will be used."]
[]
[]
[]
[]
[null,null,"Step 4: Energy Savings Opportunities"]
[]
[null,null,"The fourth and final input sheet in the PEPEx application allows users to define the potential energy savings opportunities for each system. The is done by choosing between High/Medium and Low from the drop down list in rows 17 – 28. A high level guideline to determine the existing potential can be found in the instructions above the table. "]
[]
[]
[]
[]
[]
[null,null,"User also have the option to use a more rigorous approach to determine energy savings potential associated with a system by making use of the scorecards.  "]
[]
[]
[]
[]
[]
[]
[]
[]
[]
[]
[]
[]
[]
[]
[]
[]
[]
[]
[]
[]
[]
[]
[]
[]
[]
[]
[]
[]
[]
[]
[]
[]
[]
[]
[]
[null,null,"Energy use System Scorecard (Optional)"]
[]
[null,null,"When you first arrive at the “Energy savings Opportunities” sheet, each of the scorecards will be hidden by default. To “Unhide” a scorecard, click on the arrow in the right corner of the corresponding cell and choose ”Use scorecard”. This will make the scorecard to open so the questions can be viewed."]
[]
[]
[]
[]
[null,null,"Scorecards are not available for electrochemical processes, industrial facilities, fans and blowers, materials handling, or materials processing. "]
[]
[]
[null,null,"You are not required to answer all of the questions in Scorecard, although it is recommended to answer as many questions as possible to help PEPEx more accurately profile your facility. "]
[]
[]
[null,null,"After completing the scorecard questions, simple go back to the “Energy Savings Opportunities” tab to continue your data input."]
[]
[]
[null,null,"Results"]
[]
[null,null,"The final step in PEPEx is the results screen. The PEPEx results report has tables and graphs that show how much energy you are purchasing (and how much it costs), how you are consuming that energy, and potentially how much energy and money you could save. The graphs and tables in the results page can be broadly categorized into 5 groups listed below. "]
[]
[]
[]
[]
[null,null,"                        I.            Energy Usage Summary - Tables/ Figures 1 to 3."]
[]
[]
[]
[]
[]
[]
[]
[]
[]
[]
[]
[]
[null,null,"                        II.            Total Energy Savings Potential – Tables/ Figures 4."]
[]
[]
[]
[]
[]
[]
[]
[]
[]
[]
[]
[]
[]
[]
[]
[]
[null,null,"                        III.            Energy Savings Potential by Energy Source -  Tables / Figures 5 to 9."]
[]
[]
[]
[]
[]
[]
[]
[]
[]
[]
[]
[]
[]
[]
[]
[]
[]
[]
[]
[null,null,"                        IV.            Potential Emission Reductions"]
[]
[]
[]
[]
[]
[]
[]
[]
[]
[]
[]
[]
[]
[]
[]
[]
[null,null,"                        V.            Energy Efficiency Opportunity"]

{"sheet":"Energy Breakdown Calculations","index":14,"n_rows":34,"n_cols":11,"rows_kept":34,"cut":false,"hidden":true,"merged":[]}
[]
[]
[]
[null,{"$f":"'Energy Use System'!A69","v":"System "},{"$f":"'Energy Use System'!B69","v":"Quantity"},{"$f":"'Energy Use System'!C69","v":"Total Rated Size"},{"$f":"'Energy Use System'!D69","v":"Unit for Rated Size"},{"$f":"'Energy Use System'!E69","v":"Energy Source"},{"$f":"'Energy Use System'!F69","v":"% Load factor"},{"$f":"'Energy Use System'!G69","v":"Annual Hours of Operation (hr/year) "},{"$f":"'Energy Use System'!H69","v":"% System Efficiency"},{"$f":"'Energy Use System'!I69","v":"Annual Consumption(0)"},{"$f":"'Energy Use System'!J69","v":"Percent of Energy Source"}]
[null,{"$f":"'Energy Use System'!A70","v":"CHP - Primary "},{"$f":"'Energy Use System'!B70","v":0},{"$f":"'Energy Use System'!C70","v":0},{"$f":"'Energy Use System'!D70","v":0},{"$f":"'Energy Use System'!E70","v":0},{"$f":"'Energy Use System'!F70","v":0},{"$f":"'Energy Use System'!G70","v":0},{"$f":"'Energy Use System'!H70","v":0},{"$f":"IFERROR(C5*D5*G5*H5/I5*C22,\"\")","v":""},{"$f":"IFERROR(J5/VLOOKUP(F5,$I$22:$J$25,2,FALSE),\"\")","v":""}]
[null,{"$f":"'Energy Use System'!A71","v":"CHP - Secondary "},{"$f":"'Energy Use System'!B71","v":0},{"$f":"'Energy Use System'!C71","v":0},{"$f":"'Energy Use System'!D71","v":0},{"$f":"'Energy Use System'!E71","v":0},{"$f":"'Energy Use System'!F71","v":0},{"$f":"'Energy Use System'!G71","v":0},{"$f":"'Energy Use System'!H71","v":0},{"$f":"IFERROR(C6*D6*G6*H6/I6*C23,\"\")","v":""},{"$f":"IFERROR(J6/VLOOKUP(F6,$I$22:$J$25,2,FALSE),\"\")","v":""}]
[null,{"$f":"'Energy Use System'!A72","v":"Air Compressors"},{"$f":"'Energy Use System'!B72","v":2},{"$f":"'Energy Use System'!C72","v":50},{"$f":"'Energy Use System'!D72","v":"HP"},{"$f":"'Energy Use System'!E72","v":0},{"$f":"'Energy Use System'!F72","v":0.3},{"$f":"'Energy Use System'!G72","v":6000},{"$f":"'Energy Use System'!H72","v":0.75},"",""]
[null,{"$f":"'Energy Use System'!A73","v":"Electrochemical Processes"},{"$f":"'Energy Use System'!B73","v":0},{"$f":"'Energy Use System'!C73","v":0},{"$f":"'Energy Use System'!D73","v":0},{"$f":"'Energy Use System'!E73","v":0},{"$f":"'Energy Use System'!F73","v":0},{"$f":"'Energy Use System'!G73","v":0},{"$f":"'Energy Use System'!H73","v":0},"",""]
[null,{"$f":"'Energy Use System'!A74","v":"Fans and Blowers"},{"$f":"'Energy Use System'!B74","v":0},{"$f":"'Energy Use System'!C74","v":0},{"$f":"'Energy Use System'!D74","v":0},{"$f":"'Energy Use System'!E74","v":0},{"$f":"'Energy Use System'!F74","v":0},{"$f":"'Energy Use System'!G74","v":0},{"$f":"'Energy Use System'!H74","v":0},"",""]
[null,{"$f":"'Energy Use System'!A75","v":"Industrial Facilities (Lighting)"},{"$f":"'Energy Use System'!B75","v":0},{"$f":"'Energy Use System'!C75","v":0},{"$f":"'Energy Use System'!D75","v":0},{"$f":"'Energy Use System'!E75","v":0},{"$f":"'Energy Use System'!F75","v":0},{"$f":"'Energy Use System'!G75","v":0},{"$f":"'Energy Use System'!H75","v":0},"",""]
[null,{"$f":"'Energy Use System'!A76","v":"Industrial Facilities (HVAC)"},{"$f":"'Energy Use System'!B76","v":0},{"$f":"'Energy Use System'!C76","v":0},{"$f":"'Energy Use System'!D76","v":0},{"$f":"'Energy Use System'!E76","v":0},{"$f":"'Energy Use System'!F76","v":0},{"$f":"'Energy Use System'!G76","v":0},{"$f":"'Energy Use System'!H76","v":0},"",""]
[null,{"$f":"'Energy Use System'!A77","v":"Material Handling"},{"$f":"'Energy Use System'!B77","v":0},{"$f":"'Energy Use System'!C77","v":0},{"$f":"'Energy Use System'!D77","v":0},{"$f":"'Energy Use System'!E77","v":0},{"$f":"'Energy Use System'!F77","v":0},{"$f":"'Energy Use System'!G77","v":0},{"$f":"'Energy Use System'!H77","v":0},"",""]
[null,{"$f":"'Energy Use System'!A78","v":"Material Processing"},{"$f":"'Energy Use System'!B78","v":0},{"$f":"'Energy Use System'!C78","v":0},{"$f":"'Energy Use System'!D78","v":0},{"$f":"'Energy Use System'!E78","v":0},{"$f":"'Energy Use System'!F78","v":0},{"$f":"'Energy Use System'!G78","v":0},{"$f":"'Energy Use System'!H78","v":0},"",""]
[null,{"$f":"'Energy Use System'!A79","v":"Process Cooling and Refrigeration"},{"$f":"'Energy Use System'!B79","v":0},{"$f":"'Energy Use System'!C79","v":0},{"$f":"'Energy Use System'!D79","v":0},{"$f":"'Energy Use System'!E79","v":0},{"$f":"'Energy Use System'!F79","v":0},{"$f":"'Energy Use System'!G79","v":0},{"$f":"'Energy Use System'!H79","v":0},"",""]
[null,{"$f":"'Energy Use System'!A80","v":"Process Heating"},{"$f":"'Energy Use System'!B80","v":0},{"$f":"'Energy Use System'!C80","v":0},{"$f":"'Energy Use System'!D80","v":0},{"$f":"'Energy Use System'!E80","v":0},{"$f":"'Energy Use System'!F80","v":0},{"$f":"'Energy Use System'!G80","v":0},{"$f":"'Energy Use System'!H80","v":0},"",""]
[null,{"$f":"'Energy Use System'!A81","v":"Pumps"},{"$f":"'Energy Use System'!B81","v":0},{"$f":"'Energy Use System'!C81","v":0},{"$f":"'Energy Use System'!D81","v":0},{"$f":"'Energy Use System'!E81","v":0},{"$f":"'Energy Use System'!F81","v":0},{"$f":"'Energy Use System'!G81","v":0},{"$f":"'Energy Use System'!H81","v":0},"",""]
[null,{"$f":"'Energy Use System'!A82","v":"Steam Generation Equipment"},{"$f":"'Energy Use System'!B82","v":0},{"$f":"'Energy Use System'!C82","v":0},{"$f":"'Energy Use System'!D82","v":0},{"$f":"'Energy Use System'!E82","v":0},{"$f":"'Energy Use System'!F82","v":0},{"$f":"'Energy Use System'!G82","v":0},{"$f":"'Energy Use System'!H82","v":0},"",""]
[]
[]
[null,"Conversion",null,null,null,null,{"$f":"EI_Metric","v":0}]
[null,"Unit of Rated Size",{"$f":"CONCATENATE(\"Conversion Factor to \",EI_Metric,\"/hr\")","v":"Conversion Factor to /hr"},null,null,"MBTU/hr",{"$f":"C21","v":"Conversion Factor to /hr"},null,"Energy Source","Total Consumption"]
[null,{"$f":"E5","v":0},{"$f":"IFERROR(VLOOKUP(B22,$E$22:$G$26,3,FALSE),\"\")","v":""},null,{"$f":"List!I45","v":"HP"},{"$f":"2544.43/1000","v":2.5444299999999997},{"$f":"HLOOKUP($G$20,Conversions!$F$2:$S$3,2,FALSE)*F22","v":{"$error":"#N/A"}},null,{"$f":"'Translation '!A129","v":"Electricity"},{"$f":"Total_Electricity","v":false}]
[null,{"$f":"E6","v":0},{"$f":"IFERROR(VLOOKUP(B23,$E$22:$G$26,3,FALSE),\"\")","v":""},null,{"$f":"List!I46","v":"Metric Tons"},{"$f":"12000/1000","v":12},{"$f":"HLOOKUP($G$20,Conversions!$F$2:$S$3,2,FALSE)*F23","v":{"$error":"#N/A"}},null,{"$f":"'Translation '!A130","v":"Natural Gas"},{"$f":"Total_NG","v":false}]
[null,"HP","",null,{"$f":"List!I47","v":"kJ/ Hr."},{"$f":"0.947817/1000","v":9.47817E-4},{"$f":"HLOOKUP($G$20,Conversions!$F$2:$S$3,2,FALSE)*F24","v":{"$error":"#N/A"}},null,{"$f":"'Translation '!A131","v":"Steam"},{"$f":"Total_Steam","v":false}]
[null,0,"",null,{"$f":"List!I48","v":"KW"},{"$f":"3412.14/1000","v":3.41214},{"$f":"HLOOKUP($G$20,Conversions!$F$2:$S$3,2,FALSE)*F25","v":{"$error":"#N/A"}},null,{"$f":"'Translation '!A132","v":"Other Fuel"},{"$f":"Total_OF","v":false}]
[null,0,"",null,{"$f":"List!I49","v":"MMBTU/hr"},{"$f":"10^6/1000","v":1000},{"$f":"HLOOKUP($G$20,Conversions!$F$2:$S$3,2,FALSE)*F26","v":{"$error":"#N/A"}}]
[null,0,""]
[null,0,""]
[null,0,""]
[null,0,""]
[null,0,""]
[null,0,""]
[null,0,""]
[null,0,""]

{"sheet":"List","index":15,"n_rows":97,"n_cols":10,"rows_kept":97,"cut":false,"hidden":true,"merged":[[64,2,64,7],[65,2,65,7],[66,2,66,7],[69,2,69,7],[70,2,70,7],[82,2,82,7],[71,2,71,7],[72,2,72,7],[73,2,73,7],[74,2,74,7],[75,2,75,7],[76,2,76,7],[77,2,77,7],[78,2,78,7],[79,2,79,7],[80,2,80,7],[81,2,81,7]]}
["Units"]
[{"$f":"'Translation '!A215","v":"Units Build"}]
[{"$f":"'Translation '!A216","v":"Metric Tons"}]
[]
[]
["Yes/No"]
[{"$f":"'Translation '!A217","v":"Yes"}]
[{"$f":"'Translation '!A218","v":"No"}]
[{"$f":"'Translation '!A219","v":"N/A"}]
[]
[]
[{"$f":"A7","v":"Yes"}]
[{"$f":"A8","v":"No"}]
[]
[]
["Unit"]
[{"$f":"'Translation '!A220","v":"MJ"}]
[{"$f":"'Translation '!A221","v":"MWH"}]
[]
["Industry",null,null,null,null,null,null,null,{"$f":"'Translation '!A198","v":"Industry"},"NAICS CODE"]
[{"$f":"'Translation '!A199","v":"Aluminum and Alumina "},null,null,null,null,null,null,null,{"$f":"'Translation '!A199","v":"Aluminum and Alumina "},3313]
[{"$f":"'Translation '!A200","v":"Cement "},null,null,null,null,null,null,null,{"$f":"'Translation '!A200","v":"Cement "},327310]
[{"$f":"'Translation '!A201","v":"Chemical and Allied Products "},null,null,null,null,null,null,null,{"$f":"'Translation '!A201","v":"Chemical and Allied Products "},325]
[{"$f":"'Translation '!A202","v":"Computer, Electronics and Appliances "},null,null,null,null,null,null,null,{"$f":"'Translation '!A202","v":"Computer, Electronics and Appliances "},334335]
[{"$f":"'Translation '!A203","v":"Fabricated Metal Products"},null,null,null,null,null,null,null,{"$f":"'Translation '!A203","v":"Fabricated Metal Products"},332]
[{"$f":"'Translation '!A204","v":"Food, Beverage and  Tobacco Products "},null,null,null,null,null,null,null,{"$f":"'Translation '!A204","v":"Food, Beverage and  Tobacco Products "},"311-312"]
[{"$f":"'Translation '!A205","v":"Foundries "},null,null,null,null,null,null,null,{"$f":"'Translation '!A205","v":"Foundries "},3315]
[{"$f":"'Translation '!A206","v":"Glass and Glass Products "},null,null,null,null,null,null,null,{"$f":"'Translation '!A206","v":"Glass and Glass Products "},3272327993]
[{"$f":"'Translation '!A207","v":"Heavy Machinery "},null,null,null,null,null,null,null,{"$f":"'Translation '!A207","v":"Heavy Machinery "},333]
[{"$f":"'Translation '!A208","v":"Integrated Steel "},null,null,null,null,null,null,null,{"$f":"'Translation '!A208","v":"Integrated Steel "},"3311, 3312"]
[{"$f":"'Translation '!A209","v":"Petroleum Refining "},null,null,null,null,null,null,null,{"$f":"'Translation '!A209","v":"Petroleum Refining "},324110]
[{"$f":"'Translation '!A210","v":"Plastic and Rubber Products "},null,null,null,null,null,null,null,{"$f":"'Translation '!A210","v":"Plastic and Rubber Products "},326]
[{"$f":"'Translation '!A211","v":"Textile and Apparels and Leather goods "},null,null,null,null,null,null,null,{"$f":"'Translation '!A211","v":"Textile and Apparels and Leather goods "},313316]
[{"$f":"'Translation '!A212","v":"Transportation Equipment "},null,null,null,null,null,null,null,{"$f":"'Translation '!A212","v":"Transportation Equipment "},336]
[{"$f":"'Translation '!A213","v":"Wood Produces, Pulp and Paper "},null,null,null,null,null,null,null,{"$f":"'Translation '!A213","v":"Wood Produces, Pulp and Paper "},321322]
[{"$f":"'Translation '!A214","v":"Others (All Manufacturing)"},null,null,null,null,null,null,null,{"$f":"'Translation '!A214","v":"Others (All Manufacturing)"},"31-33 "]
[]
["Cost",null,"Titles","Column2","Column1","Column12","Unit"]
[{"$f":"'Translation '!A222","v":"$/kWh"},null,"Monthly Site Electricity Consumption",null,null,null,{"$f":"'Energy & Production '!B10","v":0}]
[{"$f":"'Translation '!A223","v":"$/Kilo Joules"},null,"Monthly Natural Gas Consumption",null,null,null,{"$f":"'Energy & Production '!B11","v":0}]
[null,null,"Monthly Steam Consumption",null,null,null,{"$f":"'Energy & Production '!B12","v":0}]
["Time",null,"Monthly Other Fuel Consumption",null,null,null,{"$f":"'Energy & Production '!F11","v":0}]
[{"$f":"'Translation '!A224","v":"Weekly"},null,"Annual Consumption",null,null,null,{"$f":"'Energy & Production '!F12","v":0}]
[{"$f":"'Translation '!A225","v":"Monthly"},null,"Site Energy Use",null,null,null,{"$f":"'Energy & Production '!F12","v":0},null,"Rating"]
[{"$f":"'Translation '!A226","v":"Quarterly "},null,"Source Energy Use",null,null,null,{"$f":"'Energy & Production '!$F$12","v":0},null,{"$f":"'Translation '!A230","v":"HP"}]
[{"$f":"'Translation '!A227","v":"Semi-annually"},null,"Energy Use",null,null,null,{"$f":"'Energy & Production '!$F$12","v":0},null,{"$f":"'Translation '!A231","v":"Metric Tons"}]
[{"$f":"'Translation '!A228","v":"Annually"},null,"Energy Use per Unit of Production",null,null,null,{"$f":"'Energy & Production '!$F$12","v":0},null,{"$f":"'Translation '!A232","v":"kJ/ Hr."}]
[{"$f":"'Translation '!A229","v":"N/A"},null,"Total Monthly Electricity Cost",null,null,null,{"$f":"INDEX(Table16[],MATCH(Disclaimer!$C$3,Table16[Currency],0),2)","v":"$"},null,{"$f":"'Translation '!A233","v":"KW"}]
[null,null,"Total Monthly Natural Gas Cost",null,null,null,{"$f":"INDEX(Table16[],MATCH(Disclaimer!$C$3,Table16[Currency],0),2)","v":"$"},null,{"$f":"'Translation '!A234","v":"MMBTU/hr"}]
[null,null,"Total Monthly Steam Consumption Cost",null,null,null,{"$f":"INDEX(Table16[],MATCH(Disclaimer!$C$3,Table16[Currency],0),2)","v":"$"}]
[null,null,"Total Monthly Other Fuel Cost",null,null,null,{"$f":"INDEX(Table16[],MATCH(Disclaimer!$C$3,Table16[Currency],0),2)","v":"$"}]
[null,null,"Annual Cost of Energy",null,null,null,{"$f":"INDEX(Table16[],MATCH(Disclaimer!$C$3,Table16[Currency],0),2)","v":"$"}]
[null,null,"Annual Cost",null,null,null,{"$f":"INDEX(Table16[],MATCH(Disclaimer!$C$3,Table16[Currency],0),2)","v":"$"}]
[null,null,"Site Energy Cost",null,null,null,{"$f":"INDEX(Table16[],MATCH(Disclaimer!$C$3,Table16[Currency],0),2)","v":"$"}]
[null,null,{"$f":"CONCATENATE(\"Potential Savings\",\"(\",Table14[[#This Row],[Unit]],\")\")","v":"Potential Savings(0)"},null,null,null,{"$f":"G44","v":0}]
["Percentage"]
[{"$f":"'Translation '!A235","v":"Greater than 80%"}]
[{"$f":"'Translation '!A236","v":"40% to 80%"}]
[{"$f":"'Translation '!A237","v":"20% to 40%"}]
[{"$f":"'Translation '!A238","v":"less than 20%"}]
[]
["Level ","Column1"]
[{"$f":"'Translation '!A239","v":"Use Scorecard"}]
[{"$f":"'Translation '!A240","v":"High "},{"$f":"Table9[[#This Row],[Level ]]","v":"High "}]
[{"$f":"'Translation '!A241","v":"Medium"},{"$f":"Table9[[#This Row],[Level ]]","v":"Medium"}]
[{"$f":"'Translation '!A242","v":"Low"},{"$f":"Table9[[#This Row],[Level ]]","v":"Low"}]
[{"$f":"'Translation '!A243","v":"N/A"},{"$f":"Table9[[#This Row],[Level ]]","v":"N/A"}]
["NAICS"]
[{"$f":"'Translation '!A244","v":"Electricity"}]
[{"$f":"'Translation '!A245","v":"Natural Gas"}]
[{"$f":"'Translation '!A246","v":"Steam"}]
[{"$f":"'Translation '!A247","v":"Other Fuel"}]
[]
["Cost Unit"]
[{"$f":"'Translation '!A248","v":"$/kWh"}]
[{"$f":"'Translation '!A249","v":"$/MWh"}]
[{"$f":"'Translation '!A250","v":"$/MJ"}]
[{"$f":"'Translation '!A251","v":"$/cu.ft"}]
[{"$f":"'Translation '!A252","v":"$/gallon"}]
[{"$f":"'Translation '!A253","v":"$/metric ton"}]
[]
["Level"]
[{"$f":"'Translation '!A240","v":"High "}]
[{"$f":"'Translation '!A241","v":"Medium"}]
[{"$f":"'Translation '!A242","v":"Low"}]
[{"$f":"'Translation '!A243","v":"N/A"}]
[]
["Language"]
["English"]
["Russian"]
["Ukrainian"]
[]
["Currency","Symbol"]
["USD($)","$"]
["GBP(₤)","₤"]
["Ruble (₽)","₽"]
["Chinese Yuan(¥)","¥"]

{"sheet":"Named List","index":16,"n_rows":37,"n_cols":19,"rows_kept":37,"cut":false,"hidden":true,"merged":[]}
[]
[]
[]
[]
[]
[]
[]
[]
[]
[]
[]
[]
["Propane","Пропан","SCF","CCF","MCF","M^3","Gallon","BBL","MBTU","MMBTU","kJ","MJ","GJ","TJ","Therms","DTh","kCal","Gcal ","Tonne of Oil Equivalent"]
["Butane","Бутан","SCF","CCF","MCF","M^4","Gallon","BBL","MBTU","MMBTU","kJ","MJ","GJ","TJ","Therms","DTh","kCal","Gcal ","Tonne of Oil Equivalent"]
["LNG","СПГ","Gallon","BBL"]
["Fuel_Oil_1","Горючее_1","Gallon","BBL"]
["Fuel_Oil_2","Горючее_2","Gallon","BBL"]
["Fuel_Oil_4","Горючее_4","Gallon","BBL"]
["Fuel_Oil_5","Горючее_5","Gallon","BBL"]
["Fuel_Oil_6_low sulfer","Горючее_6","Gallon","BBL"]
["Fuel_Oil_6_high_sulfer","Горючее_6_высокая Сера","Gallon","BBL"]
["Gasoline","бензин","Gallon","BBL"]
["Kerosene","керосин","Gallon","BBL"]
["Coal","Каменный уголь","Lb","Short Ton","Long Ton","kg","Metric Ton"]
["Coke","коксовый","Lb","Short Ton","Long Ton","kg","Metric Ton"]
["Wood","Дерево","Lb","Short Ton","Long Ton","kg","Metric Ton"]
["Fuel_Oil_1","Мазут_1","Gallon","BBL"]
["Fuel_Oil_2","Мазут_2","Gallon","BBL"]
["Fuel_Oil_4","Мазут_4","Gallon","BBL"]
["Fuel_Oil_5","Мазут_5 ","Gallon","BBL"]
["Fuel_Oil_6_low sulfer","Мазут_6","Gallon","BBL"]
["Fuel_Oil_6_high_sulfer","Мазут_6_висока Сірка","Gallon","BBL"]
["Gasoline","бензин","Gallon","BBL"]
["Kerosene","гас","Gallon","BBL"]
["Coal","вугілля","Lb","Short Ton","Long Ton","kg","Metric Ton"]
["Coke","коксовий","Lb","Short Ton","Long Ton","kg","Metric Ton"]
["Wood","дерево","Lb","Short Ton","Long Ton","kg","Metric Ton"]

{"sheet":"Energy Management Opportunity","index":17,"n_rows":35,"n_cols":7,"rows_kept":35,"cut":false,"hidden":true,"merged":[]}
[]
[]
[]
[null,"Energy Management Opputunity",{"$f":"E5*E6*E7*E8*E9","v":1},{"$f":"VLOOKUP(C4,F4:G35,2,FALSE)","v":"1.) Put together an energy management plan\n\n2.) Form a cross functional energy team\n\n3.) Construct a formal methodolgy to communicate energy management practices to the emplyees\n\n4.) Make use of life cycle cost analysis to evaluate the energy efficiecy projects\n\n5.) Establish a suitable payback period for energy efficiency projects"},null,1,{"$f":"CONCATENATE(\"1.) \",D5,CHAR(10),CHAR(10),\"2.) \",D6,CHAR(10),CHAR(10),\"3.) \",D7,CHAR(10),CHAR(10),\"4.) \",D8,CHAR(10),CHAR(10),\"5.) \",D9)","v":"1.) Put together an energy management plan\n\n2.) Form a cross functional energy team\n\n3.) Construct a formal methodolgy to communicate energy management practices to the emplyees\n\n4.) Make use of life cycle cost analysis to evaluate the energy efficiecy projects\n\n5.) Establish a suitable payback period for energy efficiency projects"}]
[null,null,{"$f":"'Basic Info '!H26","v":0},{"$f":"'Translation '!B879","v":"Put together an energy management plan"},{"$f":"IF('Basic Info '!H26=List!$A$7,2,1)","v":1},2,{"$f":"CONCATENATE(\"1.) \",D6,CHAR(10),CHAR(10),\"2.) \",D7,CHAR(10),CHAR(10),\"3.) \",D8,CHAR(10),CHAR(10),\"4.) \",D9)","v":"1.) Form a cross functional energy team\n\n2.) Construct a formal methodolgy to communicate energy management practices to the emplyees\n\n3.) Make use of life cycle cost analysis to evaluate the energy efficiecy projects\n\n4.) Establish a suitable payback period for energy efficiency projects"}]
[null,null,{"$f":"'Basic Info '!H27","v":0},{"$f":"'Translation '!B880","v":"Form a cross functional energy team"},{"$f":"IF('Basic Info '!H27=List!$A$7,3,1)","v":1},3,{"$f":"CONCATENATE(\"1.) \",D5,CHAR(10),CHAR(10),\"2.) \",D7,CHAR(10),CHAR(10),\"3.) \",D8,CHAR(10),CHAR(10),\"4.) \",D9)","v":"1.) Put together an energy management plan\n\n2.) Construct a formal methodolgy to communicate energy management practices to the emplyees\n\n3.) Make use of life cycle cost analysis to evaluate the energy efficiecy projects\n\n4.) Establish a suitable payback period for energy efficiency projects"}]
[null,null,{"$f":"'Basic Info '!H28","v":0},{"$f":"'Translation '!B881","v":"Construct a formal methodolgy to communicate energy management practices to the emplyees"},{"$f":"IF('Basic Info '!H28=List!$A$7,5,1)","v":1},5,{"$f":"CONCATENATE(\"1.) \",D5,CHAR(10),CHAR(10),\"2.) \",D6,CHAR(10),CHAR(10),\"3.) \",D8,CHAR(10),CHAR(10),\"4.) \",D9)","v":"1.) Put together an energy management plan\n\n2.) Form a cross functional energy team\n\n3.) Make use of life cycle cost analysis to evaluate the energy efficiecy projects\n\n4.) Establish a suitable payback period for energy efficiency projects"}]
[null,null,{"$f":"'Basic Info '!H29","v":0},{"$f":"'Translation '!B882","v":"Make use of life cycle cost analysis to evaluate the energy efficiecy projects"},{"$f":"IF('Basic Info '!H29=List!$A$7,7,1)","v":1},7,{"$f":"CONCATENATE(\"1.) \",D5,CHAR(10),CHAR(10),\"2.) \",D6,CHAR(10),CHAR(10),\"3.) \",D7,CHAR(10),CHAR(10),\"4.) \",D9)","v":"1.) Put together an energy management plan\n\n2.) Form a cross functional energy team\n\n3.) Construct a formal methodolgy to communicate energy management practices to the emplyees\n\n4.) Establish a suitable payback period for energy efficiency projects"}]
[null,null,{"$f":"'Basic Info '!H30","v":0},{"$f":"'Translation '!B883","v":"Establish a suitable payback period for energy efficiency projects"},{"$f":"IF('Basic Info '!H30=List!$A$7,11,1)","v":1},11,{"$f":"CONCATENATE(\"1.) \",D5,CHAR(10),CHAR(10),\"2.) \",D6,CHAR(10),CHAR(10),\"3.) \",D7,CHAR(10),CHAR(10),\"4.) \",D8)","v":"1.) Put together an energy management plan\n\n2.) Form a cross functional energy team\n\n3.) Construct a formal methodolgy to communicate energy management practices to the emplyees\n\n4.) Make use of life cycle cost analysis to evaluate the energy efficiecy projects"}]
[null,null,null,null,null,{"$f":"F5*F6","v":6},{"$f":"CONCATENATE(\"1.) \",D7,CHAR(10),CHAR(10),\"2.) \",D8,CHAR(10),CHAR(10),\"3.) \",D9)","v":"1.) Construct a formal methodolgy to communicate energy management practices to the emplyees\n\n2.) Make use of life cycle cost analysis to evaluate the energy efficiecy projects\n\n3.) Establish a suitable payback period for energy efficiency projects"}]
[null,null,null,null,null,{"$f":"F5*F7","v":10},{"$f":"CONCATENATE(\"1.) \",D6,CHAR(10),CHAR(10),\"2.) \",D8,CHAR(10),CHAR(10),\"3.) \",D9)","v":"1.) Form a cross functional energy team\n\n2.) Make use of life cycle cost analysis to evaluate the energy efficiecy projects\n\n3.) Establish a suitable payback period for energy efficiency projects"}]
[null,null,null,null,null,{"$f":"F5*F8","v":14},{"$f":"CONCATENATE(\"1.) \",D6,CHAR(10),CHAR(10),\"2.) \",D7,CHAR(10),CHAR(10),\"3.) \",D9)","v":"1.) Form a cross functional energy team\n\n2.) Construct a formal methodolgy to communicate energy management practices to the emplyees\n\n3.) Establish a suitable payback period for energy efficiency projects"}]
[null,null,null,{"$f":"2^5","v":32},null,{"$f":"F5*F9","v":22},{"$f":"CONCATENATE(\"1.) \",D6,CHAR(10),CHAR(10),\"2.) \",D7,CHAR(10),CHAR(10),\"3.) \",D8)","v":"1.) Form a cross functional energy team\n\n2.) Construct a formal methodolgy to communicate energy management practices to the emplyees\n\n3.) Make use of life cycle cost analysis to evaluate the energy efficiecy projects"}]
[null,null,null,null,null,{"$f":"F6*F7","v":15},{"$f":"CONCATENATE(\"1.) \",D5,CHAR(10),CHAR(10),\"2.) \",D8,CHAR(10),CHAR(10),\"3.) \",D9)","v":"1.) Put together an energy management plan\n\n2.) Make use of life cycle cost analysis to evaluate the energy efficiecy projects\n\n3.) Establish a suitable payback period for energy efficiency projects"}]
[null,null,null,null,null,{"$f":"F6*F8","v":21},{"$f":"CONCATENATE(\"1.) \",D5,CHAR(10),CHAR(10),\"2.) \",D7,CHAR(10),CHAR(10),\"3.) \",D9)","v":"1.) Put together an energy management plan\n\n2.) Construct a formal methodolgy to communicate energy management practices to the emplyees\n\n3.) Establish a suitable payback period for energy efficiency projects"}]
[null,null,null,null,null,{"$f":"F6*F9","v":33},{"$f":"CONCATENATE(\"1.) \",D5,CHAR(10),CHAR(10),\"2.) \",D7,CHAR(10),CHAR(10),\"3.) \",D8)","v":"1.) Put together an energy management plan\n\n2.) Construct a formal methodolgy to communicate energy management practices to the emplyees\n\n3.) Make use of life cycle cost analysis to evaluate the energy efficiecy projects"}]
[null,null,null,null,null,{"$f":"F7*F8","v":35},{"$f":"CONCATENATE(\"1.) \",D5,CHAR(10),CHAR(10),\"2.) \",D6,CHAR(10),CHAR(10),\"3.) \",D9)","v":"1.) Put together an energy management plan\n\n2.) Form a cross functional energy team\n\n3.) Establish a suitable payback period for energy efficiency projects"}]
[null,null,null,null,null,{"$f":"F7*F9","v":55},{"$f":"CONCATENATE(\"1.) \",D5,CHAR(10),CHAR(10),\"2.) \",D6,CHAR(10),CHAR(10),\"3.) \",D8)","v":"1.) Put together an energy management plan\n\n2.) Form a cross functional energy team\n\n3.) Make use of life cycle cost analysis to evaluate the energy efficiecy projects"}]
[null,null,null,null,null,{"$f":"F8*F9","v":77},{"$f":"CONCATENATE(\"1.) \",D5,CHAR(10),CHAR(10),\"2.) \",D6,CHAR(10),CHAR(10),\"3.) \",D7)","v":"1.) Put together an energy management plan\n\n2.) Form a cross functional energy team\n\n3.) Construct a formal methodolgy to communicate energy management practices to the emplyees"}]
[null,null,null,null,null,{"$f":"F5*F6*F7","v":30},{"$f":"CONCATENATE(\"1.) \",D8,CHAR(10),CHAR(10),\"2.) \",D9)","v":"1.) Make use of life cycle cost analysis to evaluate the energy efficiecy projects\n\n2.) Establish a suitable payback period for energy efficiency projects"}]
[null,null,null,null,null,{"$f":"F5*F6*F8","v":42},{"$f":"CONCATENATE(\"1.) \",D7,CHAR(10),CHAR(10),\"2.) \",D9)","v":"1.) Construct a formal methodolgy to communicate energy management practices to the emplyees\n\n2.) Establish a suitable payback period for energy efficiency projects"}]
[null,null,null,null,null,{"$f":"F5*F6*F9","v":66},{"$f":"CONCATENATE(\"1.) \",D7,CHAR(10),CHAR(10),\"2.) \",D8)","v":"1.) Construct a formal methodolgy to communicate energy management practices to the emplyees\n\n2.) Make use of life cycle cost analysis to evaluate the energy efficiecy projects"}]
[null,null,null,null,null,{"$f":"F5*F7*F8","v":70},{"$f":"CONCATENATE(\"1.) \",D6,CHAR(10),CHAR(10),\"2.) \",D9)","v":"1.) Form a cross functional energy team\n\n2.) Establish a suitable payback period for energy efficiency projects"}]
[null,null,null,null,null,{"$f":"F5*F7*F9","v":110},{"$f":"CONCATENATE(\"1.) \",D6,CHAR(10),CHAR(10),\"2.) \",D8)","v":"1.) Form a cross functional energy team\n\n2.) Make use of life cycle cost analysis to evaluate the energy efficiecy projects"}]
[null,null,null,null,null,{"$f":"F5*F8*F9","v":154},{"$f":"CONCATENATE(\"1.) \",D6,CHAR(10),CHAR(10),\"2.) \",D7)","v":"1.) Form a cross functional energy team\n\n2.) Construct a formal methodolgy to communicate energy management practices to the emplyees"}]
[null,null,null,null,null,{"$f":"F6*F7*F8","v":105},{"$f":"CONCATENATE(\"1.) \",D5,CHAR(10),CHAR(10),\"2.) \",D9)","v":"1.) Put together an energy management plan\n\n2.) Establish a suitable payback period for energy efficiency projects"}]
[null,null,null,null,null,{"$f":"F6*F7*F9","v":165},{"$f":"CONCATENATE(\"1.) \",D5,CHAR(10),CHAR(10),\"2.) \",D8)","v":"1.) Put together an energy management plan\n\n2.) Make use of life cycle cost analysis to evaluate the energy efficiecy projects"}]
[null,null,null,null,null,{"$f":"F6*F8*F9","v":231},{"$f":"CONCATENATE(\"1.) \",D5,CHAR(10),CHAR(10),\"2.) \",D7)","v":"1.) Put together an energy management plan\n\n2.) Construct a formal methodolgy to communicate energy management practices to the emplyees"}]
[null,null,null,null,null,{"$f":"F7*F8*F9","v":385},{"$f":"CONCATENATE(\"1.) \",D5,CHAR(10),CHAR(10),\"2.) \",D6)","v":"1.) Put together an energy management plan\n\n2.) Form a cross functional energy team"}]
[null,null,null,null,null,{"$f":"F5*F7*F8*F9","v":770},{"$f":"CONCATENATE(\"1.) \",D6)","v":"1.) Form a cross functional energy team"}]
[null,null,null,null,null,{"$f":"F5*F6*F8*F9","v":462},{"$f":"CONCATENATE(\"1.) \",D7)","v":"1.) Construct a formal methodolgy to communicate energy management practices to the emplyees"}]
[null,null,null,null,null,{"$f":"F5*F6*F7*F9","v":330},"1.) Make use of life cycle cost analysis to evaluate the energy efficiecy projects"]
[null,null,null,null,null,{"$f":"F5*F6*F7*F8","v":210},"1.) Establish a suitable payback period for energy efficiency projects"]
[null,null,null,null,null,{"$f":"F6*F7*F8*F9","v":1155},{"$f":"CONCATENATE(\"1.) \",D5)","v":"1.) Put together an energy management plan"}]
[null,null,null,null,null,{"$f":"F5*F6*F8*F7*F9","v":2310},"1.) Look into ISO 50001 Certification for your facility"]

{"sheet":"NAICS Data-Base","index":18,"n_rows":384,"n_cols":38,"rows_kept":384,"cut":false,"hidden":true,"merged":[[78,25,78,26],[74,27,74,28],[74,24,74,26],[75,25,75,26],[76,25,76,26],[77,25,77,26],[73,19,73,21],[148,10,148,13],[0,0,0,17],[148,6,148,9],[148,2,148,5],[108,1,108,5],[139,1,139,2],[140,1,140,2],[137,1,137,2],[131,1,131,2],[132,1,132,2],[133,1,133,2],[109,1,109,2],[123,1,123,2],[115,1,115,2],[110,1,110,2],[194,1,201,1],[194,2,201,5],[170,2,173,5],[170,6,173,9],[188,2,193,5],[188,1,193,1],[180,2,187,5],[180,1,187,1],[174,2,179,5],[174,1,179,1],[194,10,201,13],[174,6,179,9],[180,6,187,9],[188,6,193,9],[194,6,201,9],[188,10,193,13],[180,10,187,13],[174,10,179,13],[170,10,173,13],[149,10,153,13],[154,10,158,13],[159,10,165,13],[166,10,169,13],[166,6,169,9],[166,2,169,5],[166,1,169,1],[138,1,138,2],[149,2,153,5],[149,1,153,1],[154,2,158,5],[154,6,158,9],[159,6,165,9],[159,2,165,5],[159,1,165,1],[149,6,153,9],[111,1,111,2],[112,1,112,2],[113,1,113,2],[134,1,134,2],[124,1,124,2],[125,1,125,2],[126,1,126,2],[127,1,127,2],[114,1,114,2],[122,1,122,2],[121,1,121,2],[120,1,120,2],[119,1,119,2],[116,1,116,2],[101,1,101,3],[212,1,212,2],[85,19,85,22],[85,24,85,27],[205,1,205,2],[130,1,130,7],[118,1,118,2],[117,1,117,2],[170,1,173,1],[143,1,143,2],[141,1,141,2],[142,1,142,2],[135,1,135,2],[136,1,136,2],[154,1,158,1],[144,1,144,2]]}
[{"$f":"'Translation '!A309","v":"Default Energy Distribution Values by System and Fuel Type for Different Industries"}]
[]
[null,{"$f":"'Translation '!A244","v":"Electricity"},{"$f":"'Translation '!A214","v":"Others (All Manufacturing)"},{"$f":"'Translation '!A199","v":"Aluminum and Alumina "},{"$f":"'Translation '!A200","v":"Cement "},{"$f":"'Translation '!A201","v":"Chemical and Allied Products "},{"$f":"'Translation '!B202","v":"Computer, Electronics and Appliances "},{"$f":"'Translation '!B204","v":"Food, Beverage and  Tobacco Products "},{"$f":"'Translation '!B213","v":"Wood Produces, Pulp and Paper "},{"$f":"'Translation '!B205","v":"Foundries "},{"$f":"'Translation '!B206","v":"Glass and Glass Products "},{"$f":"'Translation '!B207","v":"Heavy Machinery "},{"$f":"'Translation '!B203","v":"Fabricated Metal Products"},{"$f":"'Translation '!B209","v":"Petroleum Refining "},{"$f":"'Translation '!B210","v":"Plastic and Rubber Products "},{"$f":"'Translation '!B208","v":"Integrated Steel "},{"$f":"'Translation '!B211","v":"Textile and Apparels and Leather goods "},{"$f":"'Translation '!B212","v":"Transportation Equipment "}]
[null,{"$f":"'Translation '!A172","v":"Steam Generation Equipment"},0.03,0,0,0.04,0.01,0.02,0.06,0,0,0.01,0.01,0.01,0.01,0,0.01,0.01]
[null,{"$f":"'Translation '!A161","v":"Combined Heat and Power (Cogeneration)"},0,0,0,0,0,0,0,0,0,0,0,0,0,0,0,0]
[null,{"$f":"'Translation '!A254","v":"Other Electricity Generation"},0,0,0,0,0,0,0,0,0,0,0,0,0,0,0,0]
[null,{"$f":"'Translation '!A170","v":"Process Heating"},0.11,0.05,0.09,0.05,0.15,0.06,0.05,0.46,0.37,7.0000000000000007E-2,0.2,0.03,0.15,0.41,0.1,0.14000000000000001]
[null,{"$f":"'Translation '!A169","v":"Process Cooling and Refrigeration"},7.0000000000000007E-2,0.01,0,0.08,0.09,0.26,0.02,0.02,0.03,0.03,0.03,0.06,0.09,0,0.12,0.06]
[null,{"$f":"'Translation '!A163","v":"Electrochemical Processes"},0.08,0.78,0,0.14000000000000001,0.01,0,0.01,0.04,0,0,0.02,0,0,0.04,0,0.01]
[null,{"$f":"'Translation '!A171","v":"Pumps"},0.14000000000000001,0.01,0.06,0.16,0.05,0.11,0.24,0.03,0.09,0.09,0.1,0.5,0.13,0.04,0.1,0.08]
[null,{"$f":"'Translation '!A164","v":"Fans and Blowers"},0.08,0.02,0.11,7.0000000000000007E-2,0.03,0.05,0.15,0.05,7.0000000000000007E-2,7.0000000000000007E-2,7.0000000000000007E-2,0.08,7.0000000000000007E-2,7.0000000000000007E-2,7.0000000000000007E-2,0.05]
[null,{"$f":"'Translation '!A162","v":"Compressed Air"},0.09,0.02,0.11,0.17,0.04,0.05,0.04,0.05,7.0000000000000007E-2,7.0000000000000007E-2,0.08,0.13,0.09,7.0000000000000007E-2,0.08,0.06]
[null,{"$f":"'Translation '!A167","v":"Material Handling"},7.0000000000000007E-2,0.06,0.36,0.01,0.02,0.04,0.06,0.14000000000000001,0.04,0.05,0.06,0.02,7.0000000000000007E-2,0.22,0.06,0.04]
[null,{"$f":"'Translation '!A168","v":"Material Processing"},0.13,0.02,0.1,0.14000000000000001,7.0000000000000007E-2,0.17,0.16,0.03,0.15,0.15,0.17,0.09,0.12,0.06,0.17,0.12]
[null,{"$f":"'Translation '!A255","v":"Other Machine Driven Systems"},0.02,0,0.01,0.01,0.05,0.04,0.11,0,0.02,0.02,0.02,0.02,0.03,0.01,0.02,0.02]
[null,{"$f":"'Translation '!A256","v":"Other Process Uses"},0.01,0,0.02,0.01,0.06,0.01,0.01,0.02,0.05,0.02,0.03,0,0.02,0,0.01,0.03]
[null,{"$f":"'Translation '!A166","v":"Industrial Facilities (HVAC)"},0.09,0.01,7.0000000000000007E-2,0.06,0.24,0.09,0.05,0.09,0.05,0.23,0.1,0.03,0.11,0.03,0.14000000000000001,0.19]
[null,{"$f":"'Translation '!A165","v":"Industrial Facilities (Lighting)"},7.0000000000000007E-2,0.02,0.04,0.04,0.12,7.0000000000000007E-2,0.05,0.05,0.06,0.15,0.1,0.02,0.09,0.04,0.1,0.15]
[null,{"$f":"'Translation '!A257","v":"Other Facility Support"},0.02,0.01,0.02,0.01,0.06,0.02,0.01,0.02,0,0.03,0.02,0.01,0.03,0,0.02,0.04]
[null,{"$f":"'Translation '!A258","v":"Onsite Transportation"},0,0,0,0,0,0,0,0,0,0.01,0,0,0.01,0,0,0.01]
[null,{"$f":"'Translation '!A259","v":"Other Nonprocess Uses"},0,0,0,0,0.01,0,0,0,0,0.01,0,0,0,0,0,0.01]
[]
[null,{"$f":"'Translation '!A247","v":"Other Fuel"},{"$f":"'Translation '!A214","v":"Others (All Manufacturing)"},{"$f":"'Translation '!A199","v":"Aluminum and Alumina "},{"$f":"'Translation '!A200","v":"Cement "},{"$f":"'Translation '!A201","v":"Chemical and Allied Products "},{"$f":"'Translation '!B202","v":"Computer, Electronics and Appliances "},{"$f":"'Translation '!B204","v":"Food, Beverage and  Tobacco Products "},{"$f":"'Translation '!B213","v":"Wood Produces, Pulp and Paper "},{"$f":"'Translation '!B205","v":"Foundries "},{"$f":"'Translation '!B206","v":"Glass and Glass Products "},{"$f":"'Translation '!B207","v":"Heavy Machinery "},{"$f":"'Translation '!B203","v":"Fabricated Metal Products"},{"$f":"'Translation '!B209","v":"Petroleum Refining "},{"$f":"'Translation '!B210","v":"Plastic and Rubber Products "},{"$f":"'Translation '!B208","v":"Integrated Steel "},{"$f":"'Translation '!B211","v":"Textile and Apparels and Leather goods "},{"$f":"'Translation '!B212","v":"Transportation Equipment "}]
[null,{"$f":"'Translation '!A172","v":"Steam Generation Equipment"},0.17,0.03,0,0.25,0.31,0.48,0.08,0.03,0.09,0.19,0.15,0.15,0.52,0.1,0.48,0.17]
[null,{"$f":"'Translation '!A161","v":"Combined Heat and Power (Cogeneration)"},0.32,0.12,0.11,0.44,0,0.18,0.79,0,0,0.08,0.02,0.16,0,0.14000000000000001,0.11,0.06]
[null,{"$f":"'Translation '!A254","v":"Other Electricity Generation"},0,0,0,0,0,0,0,0,0,0,0,0,0,0.01,0,0]
[null,{"$f":"'Translation '!A170","v":"Process Heating"},0.42,0.76,0.88,0.22,0.31,0.25,0.1,0.79,0.86,0.27,0.65,0.65,0.24,0.7,0.3,0.28000000000000003]
[null,{"$f":"'Translation '!A169","v":"Process Cooling and Refrigeration"},0,0.02,0,0.01,0.01,0,0,0,0,0,0,0,0,0,0,0.01]
[null,{"$f":"'Translation '!A163","v":"Electrochemical Processes"},0,0,0,0,0,0,0,0,0,0,0,0,0,0,0,0]
[null,{"$f":"'Translation '!A171","v":"Pumps"},0.01,0.01,0.01,0.02,0,0.01,0.01,0.01,0,0,0,0.01,0.01,0,0.01,0.01]
[null,{"$f":"'Translation '!A164","v":"Fans and Blowers"},0.01,0,0,0.01,0,0,0,0,0,0,0,0,0.01,0,0.01,0]
[null,{"$f":"'Translation '!A162","v":"Compressed Air"},0,0,0,0,0,0,0,0,0,0,0,0,0,0,0,0]
[null,{"$f":"'Translation '!A167","v":"Material Handling"},0,0,0,0,0,0,0,0,0,0,0,0,0,0,0,0]
[null,{"$f":"'Translation '!A168","v":"Material Processing"},0,0,0,0,0,0,0,0,0,0,0,0,0,0,0,0]
[null,{"$f":"'Translation '!A255","v":"Other Machine Driven Systems"},0,0,0,0,0,0,0,0,0,0,0,0,0,0,0,0]
[null,{"$f":"'Translation '!A256","v":"Other Process Uses"},0.02,0.01,0,0.02,0.02,0.02,0,0.01,0,0.04,0,0.02,0.02,0.02,0.01,0.12]
[null,{"$f":"'Translation '!A166","v":"Industrial Facilities (HVAC)"},0.04,0.03,0,0.01,0.3,0.04,0.01,0.13,0.05,0.36,0.15,0,0.18,0.02,7.0000000000000007E-2,0.32]
[null,{"$f":"'Translation '!A165","v":"Industrial Facilities (Lighting)"},0,0,0,0,0,0,0,0,0,0,0,0,0,0,0,0]
[null,{"$f":"'Translation '!A257","v":"Other Facility Support"},0,0.01,0,0,0,0.01,0,0.01,0,0.02,0.01,0,0.01,0,0,0.01]
[null,{"$f":"'Translation '!A258","v":"Onsite Transportation"},0.01,0.01,0.01,0,0.03,0,0.01,0.01,0,0.01,0.01,0,0.01,0,0.01,0.01]
[null,{"$f":"'Translation '!A259","v":"Other Nonprocess Uses"},0,0,0,0,0.01,0,0,0,0,0.02,0,0,0,0,0,0]
[]
[null,{"$f":"'Translation '!A246","v":"Steam"},{"$f":"'Translation '!A214","v":"Others (All Manufacturing)"},{"$f":"'Translation '!A199","v":"Aluminum and Alumina "},{"$f":"'Translation '!A200","v":"Cement "},{"$f":"'Translation '!A201","v":"Chemical and Allied Products "},{"$f":"'Translation '!B202","v":"Computer, Electronics and Appliances "},{"$f":"'Translation '!B204","v":"Food, Beverage and  Tobacco Products "},{"$f":"'Translation '!B213","v":"Wood Produces, Pulp and Paper "},{"$f":"'Translation '!B205","v":"Foundries "},{"$f":"'Translation '!B206","v":"Glass and Glass Products "},{"$f":"'Translation '!B207","v":"Heavy Machinery "},{"$f":"'Translation '!B203","v":"Fabricated Metal Products"},{"$f":"'Translation '!B209","v":"Petroleum Refining "},{"$f":"'Translation '!B210","v":"Plastic and Rubber Products "},{"$f":"'Translation '!B208","v":"Integrated Steel "},{"$f":"'Translation '!B211","v":"Textile and Apparels and Leather goods "},{"$f":"'Translation '!B212","v":"Transportation Equipment "}]
[null,{"$f":"'Translation '!A172","v":"Steam Generation Equipment"},0,0,0,0,0,0,0,0,0,0,0,0,0,0,0,0]
[null,{"$f":"'Translation '!A161","v":"Combined Heat and Power (Cogeneration)"},0,0,0,0,0,0,0,0,0,0,0,0,0,0,0,0]
[null,{"$f":"'Translation '!A254","v":"Other Electricity Generation"},0,0,0,0,0,0,0,0,0,0,0,0,0,0,0,0]
[null,{"$f":"'Translation '!A170","v":"Process Heating"},0.8,0.04,0.04,0.86,0.15,0.78,0.85,0.04,0.04,0.35,0.35,0.97,0.59,0.04,0.77,0]
[null,{"$f":"'Translation '!A169","v":"Process Cooling and Refrigeration"},0,0,0,0,0,0,0,0,0,0,0,0,0,0,0,0]
[null,{"$f":"'Translation '!A163","v":"Electrochemical Processes"},0,0,0,0,0,0,0,0,0,0,0,0,0,0,0,0]
[null,{"$f":"'Translation '!A171","v":"Pumps"},7.0000000000000007E-2,0.59,0.59,7.0000000000000007E-2,0.01,0.03,0.05,0.59,0.59,0.01,0.01,0.01,0.03,0.59,0.03,0.05]
[null,{"$f":"'Translation '!A164","v":"Fans and Blowers"},0.03,0.23,null,0.03,0,0.01,0.02,0.23,0.23,0,0,0.01,0.01,0.23,0.01,0.02]
[null,{"$f":"'Translation '!A162","v":"Compressed Air"},0,0,0,0,0,0,0,0,0,0,0,0,0,0,0,0]
[null,{"$f":"'Translation '!A167","v":"Material Handling"},0,0,0,0,0,0,0,0,0,0,0,0,0,0,0,0]
[null,{"$f":"'Translation '!A168","v":"Material Processing"},0,0,0,0,0,0,0,0,0,0,0,0,0,0,0,0]
[null,{"$f":"'Translation '!A255","v":"Other Machine Driven Systems"},0.01,0.09,0.09,0.01,0,0.01,0.01,0.09,0.09,0,0,0,0,0.09,0.01,0.01]
[null,{"$f":"'Translation '!A256","v":"Other Process Uses"},0.01,0,0,0,0,0,0,0,0,0,0,0,0,0,0,0.7]
[null,{"$f":"'Translation '!A166","v":"Industrial Facilities (HVAC)"},0.08,0.06,0.06,0.04,0.84,0.16,0.08,0.06,0.06,0.64,0.64,0.01,0.37,0.06,0.18,0.23]
[null,{"$f":"'Translation '!A165","v":"Industrial Facilities (Lighting)"},0,0,0,0,0,0,0,0,0,0,0,0,0,0,0,0]
[null,{"$f":"'Translation '!A257","v":"Other Facility Support"},0,0,0,0,0,0,0,0,0,0,0,0,0,0,0,0]
[null,{"$f":"'Translation '!A258","v":"Onsite Transportation"},0,0,0,0,0,0,0,0,0,0,0,0,0,0,0,0]
[null,{"$f":"'Translation '!A259","v":"Other Nonprocess Uses"},0,0,0,0,0,0,0,0,0,0,0,0,0,0,0,0]
[]
[null,"Energy Conversion Factors","Input","Type of Input Unit","Output","Concate","Conversion Factor",null,"Energy Unit"]
[null,"Electricity",{"$f":"'Energy & Production '!B10","v":0},{"$f":"VLOOKUP(C64,Conversions!U29:V53,2,FALSE)","v":{"$error":"#N/A"}},{"$f":"'Energy & Production '!$F$12","v":0},{"$f":"IF('NAICS Data-Base'!D64='NAICS Data-Base'!$I$63,CONCATENATE(D64,C64),CONCATENATE(D64,B64,C64))","v":{"$error":"#N/A"}},{"$f":"IFERROR(INDEX(Conversions!$F$3:$S$65,MATCH('NAICS Data-Base'!F64,Conversions!$E$3:$E$65,0),MATCH(E64,Conversions!$D$3:$D$16,0)),0)","v":0}]
[null,"Natural Gas",{"$f":"'Energy & Production '!B11","v":0},{"$f":"VLOOKUP(C65,Conversions!U29:V54,2,FALSE)","v":{"$error":"#N/A"}},{"$f":"'Energy & Production '!$F$12","v":0},{"$f":"IF('NAICS Data-Base'!D65='NAICS Data-Base'!$I$63,CONCATENATE(D65,C65),CONCATENATE(D65,B65,C65))","v":{"$error":"#N/A"}},{"$f":"IFERROR(INDEX(Conversions!$F$3:$S$65,MATCH('NAICS Data-Base'!F65,Conversions!$E$3:$E$65,0),MATCH(E65,Conversions!$D$3:$D$16,0)),0)","v":0}]
[null,"Steam",{"$f":"'Energy & Production '!B12","v":0},{"$f":"IFERROR(VLOOKUP(C66,Conversions!U29:V55,2,FALSE),0)","v":0},{"$f":"'Energy & Production '!$F$12","v":0},{"$f":"IF('NAICS Data-Base'!D66='NAICS Data-Base'!$I$63,CONCATENATE(D66,C66),CONCATENATE(D66,B66,C66))","v":"0Steam0"},{"$f":"IFERROR(INDEX(Conversions!$F$3:$S$65,MATCH('NAICS Data-Base'!F66,Conversions!$E$3:$E$65,0),MATCH(E66,Conversions!$D$3:$D$16,0)),0)","v":0}]
[null,{"$f":"IF('Energy & Production '!F10=0,\"Other Fuel\",'Energy & Production '!F10)","v":"Other Fuel"},{"$f":"'Energy & Production '!F11","v":0},{"$f":"IFERROR(VLOOKUP(C67,Conversions!U29:V56,2,FALSE),0)","v":0},{"$f":"'Energy & Production '!$F$12","v":0},{"$f":"IF('NAICS Data-Base'!D67='NAICS Data-Base'!$I$63,CONCATENATE(D67,C67),CONCATENATE(D67,B67,C67))","v":"0Other Fuel0"},{"$f":"IFERROR(INDEX(Conversions!$F$3:$S$65,MATCH('NAICS Data-Base'!F67,Conversions!$E$3:$E$65,0),MATCH(E67,Conversions!$D$3:$D$16,0)),0)","v":0}]
[]
[]
[null,"User defined"]
[null,{"$f":"'Basic Info '!B6:F6","v":0},{"$f":"'Translation '!A260","v":"Yes/No"},{"$f":"'Translation '!A155","v":"Primary Energy Source"},{"$f":"'Translation '!A156","v":"Secondary Energy Source"},{"$f":"'Translation '!A157","v":"% Primary Energy Source"},{"$f":"'Translation '!A158","v":"% Secondary Energy Source"},{"$f":"'Translation '!A261","v":"Annual Primary Energy"},{"$f":"'Translation '!A262","v":"Annual Secondary Energy"},{"$f":"'Translation '!A159","v":"Annual Consumption(0)"},{"$f":"'Translation '!A263","v":"Primary Energy Cost"},{"$f":"'Translation '!A264","v":"Secondary Energy Cost"},{"$f":"'Translation '!A160","v":"Annual Cost($)"}]
[null,{"$f":"'Translation '!A161","v":"Combined Heat and Power (Cogeneration)"},{"$f":"'Energy Use System'!C24","v":0},{"$f":"'Energy Use System'!D24","v":0},{"$f":"'Energy Use System'!E24","v":0},{"$f":"'Energy Use System'!F24","v":0},{"$f":"'Energy Use System'!G24","v":0},{"$f":"IF(D72=List!$A$69,Total_Electricity*F72,IF(D72=List!$A$70,Total_NG*F72,IF(D72=List!$A$71,Total_Steam*F72,IF(D72=List!$A$72,Total_OF*F72,0))))","v":0},{"$f":"IF(E72=List!$A$69,Total_Electricity*G72,IF(E72=List!$A$70,Total_NG*G72,IF(E72=List!$A$71,Total_Steam*G72,IF(E72=List!$A$72,Total_OF*G72,0))))","v":0},{"$f":"IF(C72=\"yes\",SUM(H72:I72),0)","v":0},{"$f":"IF(D72=List!$A$69,H72*$C$104,IF(D72=List!$A$70,H72*$C$105,IF(D72=List!$A$71,H72*$C$106,IF(D72=List!$A$72,H72*$C$107,0))))","v":0},{"$f":"IF(E72=List!$A$69,I72*$C$104,IF(E72=List!$A$70,I72*$C$105,IF(E72=List!$A$71,I72*$C$106,IF(E72=List!$A$72,I72*$C$107,0))))","v":0},{"$f":"SUM(K72:L72)","v":0}]
[null,{"$f":"'Translation '!A162","v":"Compressed Air"},{"$f":"'Energy Use System'!C25","v":0},{"$f":"'Energy Use System'!D25","v":0},{"$f":"'Energy Use System'!E25","v":0},{"$f":"'Energy Use System'!F25","v":0},{"$f":"'Energy Use System'!G25","v":0},{"$f":"IF(D73=List!$A$69,Total_Electricity*F73,IF(D73=List!$A$70,Total_NG*F73,IF(D73=List!$A$71,Total_Steam*F73,IF(D73=List!$A$72,Total_OF*F73,0))))","v":0},{"$f":"IF(E73=List!$A$69,Total_Electricity*G73,IF(E73=List!$A$70,Total_NG*G73,IF(E73=List!$A$71,Total_Steam*G73,IF(E73=List!$A$72,Total_OF*G73,0))))","v":0},{"$f":"IF(C73=\"yes\",SUM(H73:I73),0)","v":0},{"$f":"IF(D73=List!$A$69,H73*$C$104,IF(D73=List!$A$70,H73*$C$105,IF(D73=List!$A$71,H73*$C$106,IF(D73=List!$A$72,H73*$C$107,0))))","v":0},{"$f":"IF(E73=List!$A$69,I73*$C$104,IF(E73=List!$A$70,I73*$C$105,IF(E73=List!$A$71,I73*$C$106,IF(E73=List!$A$72,I73*$C$107,0))))","v":0},{"$f":"SUM(K73:L73)","v":0},null,null,null,"Method 1"]
[null,{"$f":"'Translation '!A163","v":"Electrochemical Processes"},{"$f":"'Energy Use System'!C26","v":0},{"$f":"'Energy Use System'!D26","v":0},{"$f":"'Energy Use System'!E26","v":0},{"$f":"'Energy Use System'!F26","v":0},{"$f":"'Energy Use System'!G26","v":0},{"$f":"IF(D74=List!$A$69,Total_Electricity*F74,IF(D74=List!$A$70,Total_NG*F74,IF(D74=List!$A$71,Total_Steam*F74,IF(D74=List!$A$72,Total_OF*F74,0))))","v":0},{"$f":"IF(E74=List!$A$69,Total_Electricity*G74,IF(E74=List!$A$70,Total_NG*G74,IF(E74=List!$A$71,Total_Steam*G74,IF(E74=List!$A$72,Total_OF*G74,0))))","v":0},0,{"$f":"IF(D74=List!$A$69,H74*$C$104,IF(D74=List!$A$70,H74*$C$105,IF(D74=List!$A$71,H74*$C$106,IF(D74=List!$A$72,H74*$C$107,0))))","v":0},{"$f":"IF(E74=List!$A$69,I74*$C$104,IF(E74=List!$A$70,I74*$C$105,IF(E74=List!$A$71,I74*$C$106,IF(E74=List!$A$72,I74*$C$107,0))))","v":0},0,null,null,{"$f":"'Translation '!A305","v":"Annual Power consumption in (MJ)"},{"$f":"Total_Electricity+Total_NG+Total_Steam+Total_OF","v":0},null,null,"Energy Use by Fuel vs Potential Savings by Fuel"]
[null,{"$f":"'Translation '!A164","v":"Fans and Blowers"},{"$f":"'Energy Use System'!C27","v":0},{"$f":"'Energy Use System'!D27","v":0},{"$f":"'Energy Use System'!E27","v":0},{"$f":"'Energy Use System'!F27","v":0},{"$f":"'Energy Use System'!G27","v":0},{"$f":"IF(D75=List!$A$69,Total_Electricity*F75,IF(D75=List!$A$70,Total_NG*F75,IF(D75=List!$A$71,Total_Steam*F75,IF(D75=List!$A$72,Total_OF*F75,0))))","v":0},{"$f":"IF(E75=List!$A$69,Total_Electricity*G75,IF(E75=List!$A$70,Total_NG*G75,IF(E75=List!$A$71,Total_Steam*G75,IF(E75=List!$A$72,Total_OF*G75,0))))","v":0},0,{"$f":"IF(D75=List!$A$69,H75*$C$104,IF(D75=List!$A$70,H75*$C$105,IF(D75=List!$A$71,H75*$C$106,IF(D75=List!$A$72,H75*$C$107,0))))","v":0},{"$f":"IF(E75=List!$A$69,I75*$C$104,IF(E75=List!$A$70,I75*$C$105,IF(E75=List!$A$71,I75*$C$106,IF(E75=List!$A$72,I75*$C$107,0))))","v":0},0,null,null,{"$f":"'Translation '!A306","v":"Power consumption by System (MJ)"},{"$f":"SUM(J88:J99)","v":0},null,null,null,"Energy Use ","Potential Savings","Energy Use",{"$f":"V75","v":"Potential Savings"},"Units",null,null,null,null,"Cost Savings"]
[null,{"$f":"'Translation '!A165","v":"Industrial Facilities (Lighting)"},{"$f":"'Energy Use System'!C28","v":0},{"$f":"'Energy Use System'!D28","v":0},{"$f":"'Energy Use System'!E28","v":0},{"$f":"'Energy Use System'!F28","v":0},{"$f":"'Energy Use System'!G28","v":0},{"$f":"IF(D76=List!$A$69,Total_Electricity*F76,IF(D76=List!$A$70,Total_NG*F76,IF(D76=List!$A$71,Total_Steam*F76,IF(D76=List!$A$72,Total_OF*F76,0))))","v":0},{"$f":"IF(E76=List!$A$69,Total_Electricity*G76,IF(E76=List!$A$70,Total_NG*G76,IF(E76=List!$A$71,Total_Steam*G76,IF(E76=List!$A$72,Total_OF*G76,0))))","v":0},0,{"$f":"IF(D76=List!$A$69,H76*$C$104,IF(D76=List!$A$70,H76*$C$105,IF(D76=List!$A$71,H76*$C$106,IF(D76=List!$A$72,H76*$C$107,0))))","v":0},{"$f":"IF(E76=List!$A$69,I76*$C$104,IF(E76=List!$A$70,I76*$C$105,IF(E76=List!$A$71,I76*$C$106,IF(E76=List!$A$72,I76*$C$107,0))))","v":0},0,null,null,{"$f":"'Translation '!A307","v":"Other (MJ)"},{"$f":"IF(Q75=0,0,Q74-Q75)","v":0},null,null,"Electricity",{"$f":"Total_Electricity","v":false},{"$f":"Y101","v":0},{"$f":"IFERROR(U76/G64,\"\")","v":""},{"$f":"IFERROR(V76/U76*W76,\"\")","v":""},{"$f":"CONCATENATE(W75,\" - \",TEXT(W76,\"#,#\"),\" \",'Energy & Production '!B10)","v":"Energy Use -  "},{"$f":"CONCATENATE($X$75,\" - \",TEXT(X76,\"#,#\"),\" \",'Energy & Production '!B10,CHAR(10),$AD$75,\" -  $\",TEXT(AD76,\"#,#\"))","v":"Potential Savings -  \nCost Savings -  $"},null,{"$f":"CONCATENATE(TEXT(W76,\"#,#\"),\" \",'Energy & Production '!B10)","v":" "},null,{"$f":"IFERROR(X76*D104,\"\")","v":""}]
[null,{"$f":"'Translation '!A166","v":"Industrial Facilities (HVAC)"},{"$f":"'Energy Use System'!C29","v":0},{"$f":"'Energy Use System'!D29","v":0},{"$f":"'Energy Use System'!E29","v":0},{"$f":"'Energy Use System'!F29","v":0},{"$f":"'Energy Use System'!G29","v":0},{"$f":"IF(D77=List!$A$69,Total_Electricity*F77,IF(D77=List!$A$70,Total_NG*F77,IF(D77=List!$A$71,Total_Steam*F77,IF(D77=List!$A$72,Total_OF*F77,0))))","v":0},{"$f":"IF(E77=List!$A$69,Total_Electricity*G77,IF(E77=List!$A$70,Total_NG*G77,IF(E77=List!$A$71,Total_Steam*G77,IF(E77=List!$A$72,Total_OF*G77,0))))","v":0},0,{"$f":"IF(D77=List!$A$69,H77*$C$104,IF(D77=List!$A$70,H77*$C$105,IF(D77=List!$A$71,H77*$C$106,IF(D77=List!$A$72,H77*$C$107,0))))","v":0},{"$f":"IF(E77=List!$A$69,I77*$C$104,IF(E77=List!$A$70,I77*$C$105,IF(E77=List!$A$71,I77*$C$106,IF(E77=List!$A$72,I77*$C$107,0))))","v":0},0,null,null,{"$f":"'Translation '!A308","v":"% of Total Energy Consumption "},{"$f":"Q76/Q74","v":{"$error":"#DIV/0!"}},null,null,"Natural Gas",{"$f":"Total_NG","v":false},{"$f":"Z101","v":0},{"$f":"IFERROR(U77/G65,\"\")","v":""},{"$f":"IFERROR(V77/U77*W77,\"\")","v":""},{"$f":"CONCATENATE(W75,\" - \",TEXT(W77,\"#,#\"),\" \",'Energy & Production '!$B$11)","v":"Energy Use -  "},{"$f":"CONCATENATE($X$75,\" - \",TEXT(X77,\"#,#\"),\" \",'Energy & Production '!B11,CHAR(10),$AD$75,\" -  $\",TEXT(AD77,\"#,#\"))","v":"Potential Savings -  \nCost Savings -  $"},null,{"$f":"CONCATENATE(TEXT(W77,\"#,#\"),\" \",'Energy & Production '!B11)","v":" "},null,{"$f":"IFERROR(X77*D105,\"\")","v":""}]
[null,{"$f":"'Translation '!A167","v":"Material Handling"},{"$f":"'Energy Use System'!C30","v":0},{"$f":"'Energy Use System'!D30","v":0},{"$f":"'Energy Use System'!E30","v":0},{"$f":"'Energy Use System'!F30","v":0},{"$f":"'Energy Use System'!G30","v":0},{"$f":"IF(D78=List!$A$69,Total_Electricity*F78,IF(D78=List!$A$70,Total_NG*F78,IF(D78=List!$A$71,Total_Steam*F78,IF(D78=List!$A$72,Total_OF*F78,0))))","v":0},{"$f":"IF(E78=List!$A$69,Total_Electricity*G78,IF(E78=List!$A$70,Total_NG*G78,IF(E78=List!$A$71,Total_Steam*G78,IF(E78=List!$A$72,Total_OF*G78,0))))","v":0},0,{"$f":"IF(D78=List!$A$69,H78*$C$104,IF(D78=List!$A$70,H78*$C$105,IF(D78=List!$A$71,H78*$C$106,IF(D78=List!$A$72,H78*$C$107,0))))","v":0},{"$f":"IF(E78=List!$A$69,I78*$C$104,IF(E78=List!$A$70,I78*$C$105,IF(E78=List!$A$71,I78*$C$106,IF(E78=List!$A$72,I78*$C$107,0))))","v":0},0,null,null,"Total Cost",{"$f":"SUM('Energy & Production '!F86:G89)","v":0},null,null,"Steam",{"$f":"Total_Steam","v":false},{"$f":"IF(AA101>0,AA101,\"\")","v":""},"",{"$f":"IFERROR(V78/U78*W78,\"\")","v":""},{"$f":"CONCATENATE(W75,\" - \",TEXT(W78,\"#,#\"),\" \",'Energy & Production '!$B$12)","v":"Energy Use -  "},{"$f":"CONCATENATE($X$75,\" - \",TEXT(X78,\"#,#\"),\" \",'Energy & Production '!B12,CHAR(10),$AD$75,\" -  $\",TEXT(AD78,\"#,#\"))","v":"Potential Savings -  \nCost Savings -  $"},null,{"$f":"CONCATENATE(TEXT(W78,\"#,#\"),\" \",'Energy & Production '!B12)","v":" "},null,""]
[null,{"$f":"'Translation '!A168","v":"Material Processing"},{"$f":"'Energy Use System'!C31","v":0},{"$f":"'Energy Use System'!D31","v":0},{"$f":"'Energy Use System'!E31","v":0},{"$f":"'Energy Use System'!F31","v":0},{"$f":"'Energy Use System'!G31","v":0},{"$f":"IF(D79=List!$A$69,Total_Electricity*F79,IF(D79=List!$A$70,Total_NG*F79,IF(D79=List!$A$71,Total_Steam*F79,IF(D79=List!$A$72,Total_OF*F79,0))))","v":0},{"$f":"IF(E79=List!$A$69,Total_Electricity*G79,IF(E79=List!$A$70,Total_NG*G79,IF(E79=List!$A$71,Total_Steam*G79,IF(E79=List!$A$72,Total_OF*G79,0))))","v":0},0,{"$f":"IF(D79=List!$A$69,H79*$C$104,IF(D79=List!$A$70,H79*$C$105,IF(D79=List!$A$71,H79*$C$106,IF(D79=List!$A$72,H79*$C$107,0))))","v":0},{"$f":"IF(E79=List!$A$69,I79*$C$104,IF(E79=List!$A$70,I79*$C$105,IF(E79=List!$A$71,I79*$C$106,IF(E79=List!$A$72,I79*$C$107,0))))","v":0},0,null,null,"Others cost ",{"$f":"Q78-SUM(M88:M99)","v":0},null,null,{"$f":"'Energy & Production '!F10","v":0},{"$f":"Total_OF","v":false},{"$f":"AB101","v":0},"",{"$f":"IFERROR(V79/U79*W79,\"\")","v":""},{"$f":"CONCATENATE(W75,\" - \",TEXT(W79,\"#,#\"),\" \",'Energy & Production '!F11)","v":"Energy Use -  "},{"$f":"CONCATENATE($X$75,\" - \",TEXT(X79,\"#,#\"),\" \",'Energy & Production '!F11,CHAR(10),$AD$75,\" -  $\",TEXT(AD79,\"#,#\"))","v":"Potential Savings -  \nCost Savings -  $"},null,{"$f":"CONCATENATE(TEXT(W79,\"#,#\"),\" \",'Energy & Production '!F11)","v":" "},null,""]
[null,{"$f":"'Translation '!A169","v":"Process Cooling and Refrigeration"},{"$f":"'Energy Use System'!C32","v":0},{"$f":"'Energy Use System'!D32","v":0},{"$f":"'Energy Use System'!E32","v":0},{"$f":"'Energy Use System'!F32","v":0},{"$f":"'Energy Use System'!G32","v":0},{"$f":"IF(D80=List!$A$69,Total_Electricity*F80,IF(D80=List!$A$70,Total_NG*F80,IF(D80=List!$A$71,Total_Steam*F80,IF(D80=List!$A$72,Total_OF*F80,0))))","v":0},{"$f":"IF(E80=List!$A$69,Total_Electricity*G80,IF(E80=List!$A$70,Total_NG*G80,IF(E80=List!$A$71,Total_Steam*G80,IF(E80=List!$A$72,Total_OF*G80,0))))","v":0},0,{"$f":"IF(D80=List!$A$69,H80*$C$104,IF(D80=List!$A$70,H80*$C$105,IF(D80=List!$A$71,H80*$C$106,IF(D80=List!$A$72,H80*$C$107,0))))","v":0},{"$f":"IF(E80=List!$A$69,I80*$C$104,IF(E80=List!$A$70,I80*$C$105,IF(E80=List!$A$71,I80*$C$106,IF(E80=List!$A$72,I80*$C$107,0))))","v":0},0]
[null,{"$f":"'Translation '!A170","v":"Process Heating"},{"$f":"'Energy Use System'!C33","v":0},{"$f":"'Energy Use System'!D33","v":0},{"$f":"'Energy Use System'!E33","v":0},{"$f":"'Energy Use System'!F33","v":0},{"$f":"'Energy Use System'!G33","v":0},{"$f":"IF(D81=List!$A$69,Total_Electricity*F81,IF(D81=List!$A$70,Total_NG*F81,IF(D81=List!$A$71,Total_Steam*F81,IF(D81=List!$A$72,Total_OF*F81,0))))","v":0},{"$f":"IF(E81=List!$A$69,Total_Electricity*G81,IF(E81=List!$A$70,Total_NG*G81,IF(E81=List!$A$71,Total_Steam*G81,IF(E81=List!$A$72,Total_OF*G81,0))))","v":0},0,{"$f":"IF(D81=List!$A$69,H81*$C$104,IF(D81=List!$A$70,H81*$C$105,IF(D81=List!$A$71,H81*$C$106,IF(D81=List!$A$72,H81*$C$107,0))))","v":0},{"$f":"IF(E81=List!$A$69,I81*$C$104,IF(E81=List!$A$70,I81*$C$105,IF(E81=List!$A$71,I81*$C$106,IF(E81=List!$A$72,I81*$C$107,0))))","v":0},0]
[null,{"$f":"'Translation '!A171","v":"Pumps"},{"$f":"'Energy Use System'!C34","v":0},{"$f":"'Energy Use System'!D34","v":0},{"$f":"'Energy Use System'!E34","v":0},{"$f":"'Energy Use System'!F34","v":0},{"$f":"'Energy Use System'!G34","v":0},{"$f":"IF(D82=List!$A$69,Total_Electricity*F82,IF(D82=List!$A$70,Total_NG*F82,IF(D82=List!$A$71,Total_Steam*F82,IF(D82=List!$A$72,Total_OF*F82,0))))","v":0},{"$f":"IF(E82=List!$A$69,Total_Electricity*G82,IF(E82=List!$A$70,Total_NG*G82,IF(E82=List!$A$71,Total_Steam*G82,IF(E82=List!$A$72,Total_OF*G82,0))))","v":0},0,{"$f":"IF(D82=List!$A$69,H82*$C$104,IF(D82=List!$A$70,H82*$C$105,IF(D82=List!$A$71,H82*$C$106,IF(D82=List!$A$72,H82*$C$107,0))))","v":0},{"$f":"IF(E82=List!$A$69,I82*$C$104,IF(E82=List!$A$70,I82*$C$105,IF(E82=List!$A$71,I82*$C$106,IF(E82=List!$A$72,I82*$C$107,0))))","v":0},0]
[null,{"$f":"'Translation '!A172","v":"Steam Generation Equipment"},{"$f":"'Energy Use System'!C35","v":0},{"$f":"'Energy Use System'!D35","v":0},{"$f":"'Energy Use System'!E35","v":0},{"$f":"'Energy Use System'!F35","v":0},{"$f":"'Energy Use System'!G35","v":0},{"$f":"IF(D83=List!$A$69,Total_Electricity*F83,IF(D83=List!$A$70,Total_NG*F83,IF(D83=List!$A$71,Total_Steam*F83,IF(D83=List!$A$72,Total_OF*F83,0))))","v":0},{"$f":"IF(E83=List!$A$69,Total_Electricity*G83,IF(E83=List!$A$70,Total_NG*G83,IF(E83=List!$A$71,Total_Steam*G83,IF(E83=List!$A$72,Total_OF*G83,0))))","v":0},0,{"$f":"IF(D83=List!$A$69,H83*$C$104,IF(D83=List!$A$70,H83*$C$105,IF(D83=List!$A$71,H83*$C$106,IF(D83=List!$A$72,H83*$C$107,0))))","v":0},{"$f":"IF(E83=List!$A$69,I83*$C$104,IF(E83=List!$A$70,I83*$C$105,IF(E83=List!$A$71,I83*$C$106,IF(E83=List!$A$72,I83*$C$107,0))))","v":0},0]
[null,null,null,null,null,null,null,null,null,{"$f":"SUM(J72:J83)","v":0}]
[null,null,null,null,null,null,null,null,null,null,null,null,null,null,null,null,null,null,null,"Usage Split by Fuel Type ",null,null,null,null,"Potential Savings by Fuel Type",null,null,null,null,{"$f":"T85","v":"Usage Split by Fuel Type "},null,null,null,null,{"$f":"Y85","v":"Potential Savings by Fuel Type"}]
[null,"Default","Calculation Master Sheet",null,null,null,null,{"$f":"EI_Metric","v":0},{"$f":"EI_Metric","v":0},{"$f":"EI_Metric","v":0},null,null,null,null,null,null,null,null,null,{"$f":"EI_Metric","v":0},null,null,null,null,{"$f":"EI_Metric","v":0},null,null,null,null,{"$f":"'Energy & Production '!B10","v":0},{"$f":"'Energy & Production '!B11","v":0},{"$f":"'Energy & Production '!B12","v":0},{"$f":"'Energy & Production '!F11","v":0},null,{"$f":"AD86","v":0},{"$f":"AE86","v":0},{"$f":"AF86","v":0},{"$f":"AG86","v":0}]
[null,{"$f":"'Basic Info '!B6:F6","v":0},{"$f":"'Translation '!A260","v":"Yes/No"},{"$f":"'Translation '!A155","v":"Primary Energy Source"},{"$f":"'Translation '!A156","v":"Secondary Energy Source"},{"$f":"'Translation '!A157","v":"% Primary Energy Source"},{"$f":"'Translation '!A158","v":"% Secondary Energy Source"},{"$f":"'Translation '!A261","v":"Annual Primary Energy"},{"$f":"'Translation '!A262","v":"Annual Secondary Energy"},{"$f":"'Translation '!A159","v":"Annual Consumption(0)"},{"$f":"'Translation '!A263","v":"Primary Energy Cost"},{"$f":"'Translation '!A264","v":"Secondary Energy Cost"},{"$f":"'Translation '!A160","v":"Annual Cost($)"},"% primary","%secondary ","Cost saving primary ","Cost saving Secondary ","Cost Savings($)",null,"Electricity ","Natural gas","Steam","Other Fuel",null,"Electricity","Natural Gas ","Steam","Other Fuel",null,"Electricity","Natural Gas ","Steam","Other Fuel",null,"Electricity","Natural Gas ","Steam","Other Fuel"]
[null,{"$f":"'Translation '!A161","v":"Combined Heat and Power (Cogeneration)"},{"$f":"'Energy Use System'!C39","v":0},{"$f":"'Energy Use System'!D39","v":0},{"$f":"'Energy Use System'!E39","v":0},{"$f":"IF(F72>0,F72,IF(OR(C88=0,C88=List!$A$8,C88=List!$A$9),0,IF(D88=List!$A$69,(VLOOKUP(B88,$B$3:$R$21,MATCH($B$87,$B$3:$R$3,0),FALSE)),IF(OR(D88=List!$A$70,D88=List!$A$72),VLOOKUP(B88,$B$23:$R$41,MATCH($B$87,$B$23:$R$23,0),FALSE),IF(D88=List!$A$71,VLOOKUP(B88,$B$43:$R$61,MATCH($B$87,$B$43:$R$43,0),FALSE),0)))))","v":0},{"$f":"IF(G72>0,G72,IF(OR(C88=0,C88=List!$A$8,C88=List!$A$9),0,IF(E88=List!$A$69,(VLOOKUP(B88,$B$3:$R$21,MATCH($B$87,$B$3:$R$3,0),FALSE)),IF(OR(E88=List!$A$70,E88=List!$A$72),VLOOKUP(B88,$B$23:$R$41,MATCH($B$87,$B$23:$R$23,0),FALSE),IF(E88=List!$A$71,VLOOKUP(B88,$B$43:$R$61,MATCH($B$87,$B$43:$R$43,0),FALSE),0)))))","v":0},{"$f":"IF(D88=List!$A$69,Total_Electricity*F88,IF(D88=List!$A$70,Total_NG*F88,IF(D88=List!$A$71,Total_Steam*F88,IF(D88=List!$A$72,Total_OF*F88,0))))","v":0},{"$f":"IF(E88=List!$A$69,Total_Electricity*G88,IF(E88=List!$A$70,Total_NG*G88,IF(E88=List!$A$71,Total_Steam*G88,IF(E88=List!$A$72,Total_OF*G88,0))))","v":0},{"$f":"SUM(H88:I88)","v":0},{"$f":"IF(D88=List!$A$69,H88*$C$104,IF(D88=List!$A$70,H88*$C$105,IF(D88=List!$A$71,H88*$C$106,IF(D88=List!$A$72,H88*$C$107,0))))","v":0},{"$f":"IF(E88=List!$A$69,I88*$C$104,IF(E88=List!$A$70,I88*$C$105,IF(E88=List!$A$71,I88*$C$106,IF(E88=List!$A$72,I88*$C$107,0))))","v":0},{"$f":"SUM(K88:L88)","v":0},{"$f":"IFERROR(F88/(F88+G88),0)","v":0},{"$f":"IFERROR(G88/(F88+G88),0)","v":0},{"$f":"IF(D88=List!$A$69,($C$104*N88),IF(D88=List!$A$70,$C$105*N88,IF(D88=List!$A$71,$C$106*N88,IF(D88=List!$A$72,$C$107*N88,0))))","v":0},{"$f":"IF(E88=List!$A$69,($C$104*O88),IF(E88=List!$A$70,$C$105*O88,IF(E88=List!$A$71,$C$106*O88,IF(E88=List!$A$72,$C$107*O88,0))))","v":0},{"$f":"IF(AND(F88=0,G88=0),0,G133*(P88+Q88))","v":0},null,{"$f":"IF(D88=List!$A$69,H88,0)+(IF(E88=List!$A$69,I88,0))","v":0},{"$f":"IF(D88=List!$A$70,H88,0)+IF(E88=List!$A$70,I88,0)","v":0},{"$f":"IF(D88=List!$A$71,H88,0)+(IF(E88=List!$A$71,I88,0))","v":0},{"$f":"IF(D88=List!$A$72,H88,0)+IF(E88=List!$A$72,I88,0)","v":0},null,{"$f":"F133*T88","v":0},{"$f":"F133*U88","v":0},{"$f":"F133*V88","v":0},{"$f":"F133*W88","v":0},null,{"$f":"IFERROR(T88/$G$64,0)","v":0},{"$f":"IFERROR(U88/$G$65,0)","v":0},{"$f":"IFERROR(V88/$G$66,0)","v":0},{"$f":"IFERROR(W88/$G$67,0)","v":0},null,{"$f":"F133*AD88","v":0},{"$f":"F133*AE88","v":0},{"$f":"F133*AF88","v":0},{"$f":"F133*AG88","v":0}]
[null,{"$f":"'Translation '!A162","v":"Compressed Air"},{"$f":"'Energy Use System'!C40","v":0},{"$f":"'Energy Use System'!D40","v":0},{"$f":"'Energy Use System'!E40","v":0},{"$f":"IF(F73>0,F73,IF(OR(C89=0,C89=List!$A$8,C89=List!$A$9),0,IF(D89=List!$A$69,(VLOOKUP(B89,$B$3:$R$21,MATCH($B$87,$B$3:$R$3,0),FALSE)),IF(OR(D89=List!$A$70,D89=List!$A$72),VLOOKUP(B89,$B$23:$R$41,MATCH($B$87,$B$23:$R$23,0),FALSE),IF(D89=List!$A$71,VLOOKUP(B89,$B$43:$R$61,MATCH($B$87,$B$43:$R$43,0),FALSE),0)))))","v":0},{"$f":"IF(G73>0,G73,IF(OR(C89=0,C89=List!$A$8,C89=List!$A$9),0,IF(E89=List!$A$69,(VLOOKUP(B89,$B$3:$R$21,MATCH($B$87,$B$3:$R$3,0),FALSE)),IF(OR(E89=List!$A$70,E89=List!$A$72),VLOOKUP(B89,$B$23:$R$41,MATCH($B$87,$B$23:$R$23,0),FALSE),IF(E89=List!$A$71,VLOOKUP(B89,$B$43:$R$61,MATCH($B$87,$B$43:$R$43,0),FALSE),0)))))","v":0},{"$f":"IF(D89=List!$A$69,Total_Electricity*F89,IF(D89=List!$A$70,Total_NG*F89,IF(D89=List!$A$71,Total_Steam*F89,IF(D89=List!$A$72,Total_OF*F89,0))))","v":0},{"$f":"IF(E89=List!$A$69,Total_Electricity*G89,IF(E89=List!$A$70,Total_NG*G89,IF(E89=List!$A$71,Total_Steam*G89,IF(E89=List!$A$72,Total_OF*G89,0))))","v":0},{"$f":"SUM(H89:I89)","v":0},{"$f":"IF(D89=List!$A$69,H89*$C$104,IF(D89=List!$A$70,H89*$C$105,IF(D89=List!$A$71,H89*$C$106,IF(D89=List!$A$72,H89*$C$107,0))))","v":0},{"$f":"IF(E89=List!$A$69,I89*$C$104,IF(E89=List!$A$70,I89*$C$105,IF(E89=List!$A$71,I89*$C$106,IF(E89=List!$A$72,I89*$C$107,0))))","v":0},{"$f":"SUM(K89:L89)","v":0},0,0,{"$f":"IF(D89=List!$A$69,($C$104*N89),IF(D89=List!$A$70,$C$105*N89,IF(D89=List!$A$71,$C$106*N89,IF(D89=List!$A$72,$C$107*N89,0))))","v":0},{"$f":"IF(E89=List!$A$69,($C$104*O89),IF(E89=List!$A$70,$C$105*O89,IF(E89=List!$A$71,$C$106*O89,IF(E89=List!$A$72,$C$107*O89,0))))","v":0},0,null,{"$f":"IF(D89=List!$A$69,H89,0)+(IF(E89=List!$A$69,I89,0))","v":0},{"$f":"IF(D89=List!$A$70,H89,0)+IF(E89=List!$A$70,I89,0)","v":0},{"$f":"IF(D89=List!$A$71,H89,0)+(IF(E89=List!$A$71,I89,0))","v":0},{"$f":"IF(D89=List!$A$72,H89,0)+IF(E89=List!$A$72,I89,0)","v":0},null,0,0,0,0,null,{"$f":"IFERROR(T89/$G$64,0)","v":0},{"$f":"IFERROR(U89/$G$65,0)","v":0},{"$f":"IFERROR(V89/$G$66,0)","v":0},{"$f":"IFERROR(W89/$G$67,0)","v":0},null,{"$f":"F134*AD89","v":0},{"$f":"F134*AE89","v":0},{"$f":"F134*AF89","v":0},{"$f":"F134*AG89","v":0}]
[null,{"$f":"'Translation '!A163","v":"Electrochemical Processes"},{"$f":"'Energy Use System'!C41","v":0},{"$f":"'Energy Use System'!D41","v":0},{"$f":"'Energy Use System'!E41","v":0},{"$f":"IF(F74>0,F74,IF(OR(C90=0,C90=List!$A$8,C90=List!$A$9),0,IF(D90=List!$A$69,(VLOOKUP(B90,$B$3:$R$21,MATCH($B$87,$B$3:$R$3,0),FALSE)),IF(OR(D90=List!$A$70,D90=List!$A$72),VLOOKUP(B90,$B$23:$R$41,MATCH($B$87,$B$23:$R$23,0),FALSE),IF(D90=List!$A$71,VLOOKUP(B90,$B$43:$R$61,MATCH($B$87,$B$43:$R$43,0),FALSE),0)))))","v":0},{"$f":"IF(G74>0,G74,IF(OR(C90=0,C90=List!$A$8,C90=List!$A$9),0,IF(E90=List!$A$69,(VLOOKUP(B90,$B$3:$R$21,MATCH($B$87,$B$3:$R$3,0),FALSE)),IF(OR(E90=List!$A$70,E90=List!$A$72),VLOOKUP(B90,$B$23:$R$41,MATCH($B$87,$B$23:$R$23,0),FALSE),IF(E90=List!$A$71,VLOOKUP(B90,$B$43:$R$61,MATCH($B$87,$B$43:$R$43,0),FALSE),0)))))","v":0},{"$f":"IF(D90=List!$A$69,Total_Electricity*F90,IF(D90=List!$A$70,Total_NG*F90,IF(D90=List!$A$71,Total_Steam*F90,IF(D90=List!$A$72,Total_OF*F90,0))))","v":0},{"$f":"IF(E90=List!$A$69,Total_Electricity*G90,IF(E90=List!$A$70,Total_NG*G90,IF(E90=List!$A$71,Total_Steam*G90,IF(E90=List!$A$72,Total_OF*G90,0))))","v":0},0,{"$f":"IF(D90=List!$A$69,H90*$C$104,IF(D90=List!$A$70,H90*$C$105,IF(D90=List!$A$71,H90*$C$106,IF(D90=List!$A$72,H90*$C$107,0))))","v":0},{"$f":"IF(E90=List!$A$69,I90*$C$104,IF(E90=List!$A$70,I90*$C$105,IF(E90=List!$A$71,I90*$C$106,IF(E90=List!$A$72,I90*$C$107,0))))","v":0},0,0,0,{"$f":"IF(D90=List!$A$69,($C$104*N90),IF(D90=List!$A$70,$C$105*N90,IF(D90=List!$A$71,$C$106*N90,IF(D90=List!$A$72,$C$107*N90,0))))","v":0},{"$f":"IF(E90=List!$A$69,($C$104*O90),IF(E90=List!$A$70,$C$105*O90,IF(E90=List!$A$71,$C$106*O90,IF(E90=List!$A$72,$C$107*O90,0))))","v":0},0,null,{"$f":"IF(D90=List!$A$69,H90,0)+(IF(E90=List!$A$69,I90,0))","v":0},{"$f":"IF(D90=List!$A$70,H90,0)+IF(E90=List!$A$70,I90,0)","v":0},{"$f":"IF(D90=List!$A$71,H90,0)+(IF(E90=List!$A$71,I90,0))","v":0},{"$f":"IF(D90=List!$A$72,H90,0)+IF(E90=List!$A$72,I90,0)","v":0},null,0,0,0,0,null,0,0,0,0,null,0,{"$f":"F135*AE90","v":0},0,0]
[null,{"$f":"'Translation '!A164","v":"Fans and Blowers"},{"$f":"'Energy Use System'!C42","v":0},{"$f":"'Energy Use System'!D42","v":0},{"$f":"'Energy Use System'!E42","v":0},{"$f":"IF(F75>0,F75,IF(OR(C91=0,C91=List!$A$8,C91=List!$A$9),0,IF(D91=List!$A$69,(VLOOKUP(B91,$B$3:$R$21,MATCH($B$87,$B$3:$R$3,0),FALSE)),IF(OR(D91=List!$A$70,D91=List!$A$72),VLOOKUP(B91,$B$23:$R$41,MATCH($B$87,$B$23:$R$23,0),FALSE),IF(D91=List!$A$71,VLOOKUP(B91,$B$43:$R$61,MATCH($B$87,$B$43:$R$43,0),FALSE),0)))))","v":0},{"$f":"IF(G75>0,G75,IF(OR(C91=0,C91=List!$A$8,C91=List!$A$9),0,IF(E91=List!$A$69,(VLOOKUP(B91,$B$3:$R$21,MATCH($B$87,$B$3:$R$3,0),FALSE)),IF(OR(E91=List!$A$70,E91=List!$A$72),VLOOKUP(B91,$B$23:$R$41,MATCH($B$87,$B$23:$R$23,0),FALSE),IF(E91=List!$A$71,VLOOKUP(B91,$B$43:$R$61,MATCH($B$87,$B$43:$R$43,0),FALSE),0)))))","v":0},{"$f":"IF(D91=List!$A$69,Total_Electricity*F91,IF(D91=List!$A$70,Total_NG*F91,IF(D91=List!$A$71,Total_Steam*F91,IF(D91=List!$A$72,Total_OF*F91,0))))","v":0},{"$f":"IF(E91=List!$A$69,Total_Electricity*G91,IF(E91=List!$A$70,Total_NG*G91,IF(E91=List!$A$71,Total_Steam*G91,IF(E91=List!$A$72,Total_OF*G91,0))))","v":0},0,{"$f":"IF(D91=List!$A$69,H91*$C$104,IF(D91=List!$A$70,H91*$C$105,IF(D91=List!$A$71,H91*$C$106,IF(D91=List!$A$72,H91*$C$107,0))))","v":0},{"$f":"IF(E91=List!$A$69,I91*$C$104,IF(E91=List!$A$70,I91*$C$105,IF(E91=List!$A$71,I91*$C$106,IF(E91=List!$A$72,I91*$C$107,0))))","v":0},0,0,0,{"$f":"IF(D91=List!$A$69,($C$104*N91),IF(D91=List!$A$70,$C$105*N91,IF(D91=List!$A$71,$C$106*N91,IF(D91=List!$A$72,$C$107*N91,0))))","v":0},{"$f":"IF(E91=List!$A$69,($C$104*O91),IF(E91=List!$A$70,$C$105*O91,IF(E91=List!$A$71,$C$106*O91,IF(E91=List!$A$72,$C$107*O91,0))))","v":0},0,null,{"$f":"IF(D91=List!$A$69,H91,0)+(IF(E91=List!$A$69,I91,0))","v":0},{"$f":"IF(D91=List!$A$70,H91,0)+IF(E91=List!$A$70,I91,0)","v":0},{"$f":"IF(D91=List!$A$71,H91,0)+(IF(E91=List!$A$71,I91,0))","v":0},{"$f":"IF(D91=List!$A$72,H91,0)+IF(E91=List!$A$72,I91,0)","v":0},null,0,0,0,0,null,0,0,0,0,null,0,0,0,0]
[null,{"$f":"'Translation '!A165","v":"Industrial Facilities (Lighting)"},{"$f":"'Energy Use System'!C43","v":0},{"$f":"'Energy Use System'!D43","v":0},{"$f":"'Energy Use System'!E43","v":0},{"$f":"IF(F76>0,F76,IF(OR(C92=0,C92=List!$A$8,C92=List!$A$9),0,IF(D92=List!$A$69,(VLOOKUP(B92,$B$3:$R$21,MATCH($B$87,$B$3:$R$3,0),FALSE)),IF(OR(D92=List!$A$70,D92=List!$A$72),VLOOKUP(B92,$B$23:$R$41,MATCH($B$87,$B$23:$R$23,0),FALSE),IF(D92=List!$A$71,VLOOKUP(B92,$B$43:$R$61,MATCH($B$87,$B$43:$R$43,0),FALSE),0)))))","v":0},{"$f":"IF(G76>0,G76,IF(OR(C92=0,C92=List!$A$8,C92=List!$A$9),0,IF(E92=List!$A$69,(VLOOKUP(B92,$B$3:$R$21,MATCH($B$87,$B$3:$R$3,0),FALSE)),IF(OR(E92=List!$A$70,E92=List!$A$72),VLOOKUP(B92,$B$23:$R$41,MATCH($B$87,$B$23:$R$23,0),FALSE),IF(E92=List!$A$71,VLOOKUP(B92,$B$43:$R$61,MATCH($B$87,$B$43:$R$43,0),FALSE),0)))))","v":0},{"$f":"IF(D92=List!$A$69,Total_Electricity*F92,IF(D92=List!$A$70,Total_NG*F92,IF(D92=List!$A$71,Total_Steam*F92,IF(D92=List!$A$72,Total_OF*F92,0))))","v":0},{"$f":"IF(E92=List!$A$69,Total_Electricity*G92,IF(E92=List!$A$70,Total_NG*G92,IF(E92=List!$A$71,Total_Steam*G92,IF(E92=List!$A$72,Total_OF*G92,0))))","v":0},0,{"$f":"IF(D92=List!$A$69,H92*$C$104,IF(D92=List!$A$70,H92*$C$105,IF(D92=List!$A$71,H92*$C$106,IF(D92=List!$A$72,H92*$C$107,0))))","v":0},{"$f":"IF(E92=List!$A$69,I92*$C$104,IF(E92=List!$A$70,I92*$C$105,IF(E92=List!$A$71,I92*$C$106,IF(E92=List!$A$72,I92*$C$107,0))))","v":0},0,0,0,{"$f":"IF(D92=List!$A$69,($C$104*N92),IF(D92=List!$A$70,$C$105*N92,IF(D92=List!$A$71,$C$106*N92,IF(D92=List!$A$72,$C$107*N92,0))))","v":0},{"$f":"IF(E92=List!$A$69,($C$104*O92),IF(E92=List!$A$70,$C$105*O92,IF(E92=List!$A$71,$C$106*O92,IF(E92=List!$A$72,$C$107*O92,0))))","v":0},0,null,{"$f":"IF(D92=List!$A$69,H92,0)+(IF(E92=List!$A$69,I92,0))","v":0},{"$f":"IF(D92=List!$A$70,H92,0)+IF(E92=List!$A$70,I92,0)","v":0},{"$f":"IF(D92=List!$A$71,H92,0)+(IF(E92=List!$A$71,I92,0))","v":0},{"$f":"IF(D92=List!$A$72,H92,0)+IF(E92=List!$A$72,I92,0)","v":0},null,0,0,0,0,null,0,0,0,0,null,0,0,0,0]
[null,{"$f":"'Translation '!A166","v":"Industrial Facilities (HVAC)"},{"$f":"'Energy Use System'!C44","v":0},{"$f":"'Energy Use System'!D44","v":0},{"$f":"'Energy Use System'!E44","v":0},{"$f":"IF(F77>0,F77,IF(OR(C93=0,C93=List!$A$8,C93=List!$A$9),0,IF(D93=List!$A$69,(VLOOKUP(B93,$B$3:$R$21,MATCH($B$87,$B$3:$R$3,0),FALSE)),IF(OR(D93=List!$A$70,D93=List!$A$72),VLOOKUP(B93,$B$23:$R$41,MATCH($B$87,$B$23:$R$23,0),FALSE),IF(D93=List!$A$71,VLOOKUP(B93,$B$43:$R$61,MATCH($B$87,$B$43:$R$43,0),FALSE),0)))))","v":0},{"$f":"IF(G77>0,G77,IF(OR(C93=0,C93=List!$A$8,C93=List!$A$9),0,IF(E93=List!$A$69,(VLOOKUP(B93,$B$3:$R$21,MATCH($B$87,$B$3:$R$3,0),FALSE)),IF(OR(E93=List!$A$70,E93=List!$A$72),VLOOKUP(B93,$B$23:$R$41,MATCH($B$87,$B$23:$R$23,0),FALSE),IF(E93=List!$A$71,VLOOKUP(B93,$B$43:$R$61,MATCH($B$87,$B$43:$R$43,0),FALSE),0)))))","v":0},{"$f":"IF(D93=List!$A$69,Total_Electricity*F93,IF(D93=List!$A$70,Total_NG*F93,IF(D93=List!$A$71,Total_Steam*F93,IF(D93=List!$A$72,Total_OF*F93,0))))","v":0},{"$f":"IF(E93=List!$A$69,Total_Electricity*G93,IF(E93=List!$A$70,Total_NG*G93,IF(E93=List!$A$71,Total_Steam*G93,IF(E93=List!$A$72,Total_OF*G93,0))))","v":0},{"$f":"SUM(H93:I93)","v":0},{"$f":"IF(D93=List!$A$69,H93*$C$104,IF(D93=List!$A$70,H93*$C$105,IF(D93=List!$A$71,H93*$C$106,IF(D93=List!$A$72,H93*$C$107,0))))","v":0},{"$f":"IF(E93=List!$A$69,I93*$C$104,IF(E93=List!$A$70,I93*$C$105,IF(E93=List!$A$71,I93*$C$106,IF(E93=List!$A$72,I93*$C$107,0))))","v":0},0,0,0,{"$f":"IF(D93=List!$A$69,($C$104*N93),IF(D93=List!$A$70,$C$105*N93,IF(D93=List!$A$71,$C$106*N93,IF(D93=List!$A$72,$C$107*N93,0))))","v":0},{"$f":"IF(E93=List!$A$69,($C$104*O93),IF(E93=List!$A$70,$C$105*O93,IF(E93=List!$A$71,$C$106*O93,IF(E93=List!$A$72,$C$107*O93,0))))","v":0},0,null,{"$f":"IF(D93=List!$A$69,H93,0)+(IF(E93=List!$A$69,I93,0))","v":0},{"$f":"IF(D93=List!$A$70,H93,0)+IF(E93=List!$A$70,I93,0)","v":0},{"$f":"IF(D93=List!$A$71,H93,0)+(IF(E93=List!$A$71,I93,0))","v":0},{"$f":"IF(D93=List!$A$72,H93,0)+IF(E93=List!$A$72,I93,0)","v":0},null,0,0,0,0,null,0,0,0,0,null,0,0,0,0]
[null,{"$f":"'Translation '!A167","v":"Material Handling"},{"$f":"'Energy Use System'!C45","v":0},{"$f":"'Energy Use System'!D45","v":0},{"$f":"'Energy Use System'!E45","v":0},{"$f":"IF(F78>0,F78,IF(OR(C94=0,C94=List!$A$8,C94=List!$A$9),0,IF(D94=List!$A$69,(VLOOKUP(B94,$B$3:$R$21,MATCH($B$87,$B$3:$R$3,0),FALSE)),IF(OR(D94=List!$A$70,D94=List!$A$72),VLOOKUP(B94,$B$23:$R$41,MATCH($B$87,$B$23:$R$23,0),FALSE),IF(D94=List!$A$71,VLOOKUP(B94,$B$43:$R$61,MATCH($B$87,$B$43:$R$43,0),FALSE),0)))))","v":0},{"$f":"IF(G78>0,G78,IF(OR(C94=0,C94=List!$A$8,C94=List!$A$9),0,IF(E94=List!$A$69,(VLOOKUP(B94,$B$3:$R$21,MATCH($B$87,$B$3:$R$3,0),FALSE)),IF(OR(E94=List!$A$70,E94=List!$A$72),VLOOKUP(B94,$B$23:$R$41,MATCH($B$87,$B$23:$R$23,0),FALSE),IF(E94=List!$A$71,VLOOKUP(B94,$B$43:$R$61,MATCH($B$87,$B$43:$R$43,0),FALSE),0)))))","v":0},{"$f":"IF(D94=List!$A$69,Total_Electricity*F94,IF(D94=List!$A$70,Total_NG*F94,IF(D94=List!$A$71,Total_Steam*F94,IF(D94=List!$A$72,Total_OF*F94,0))))","v":0},{"$f":"IF(E94=List!$A$69,Total_Electricity*G94,IF(E94=List!$A$70,Total_NG*G94,IF(E94=List!$A$71,Total_Steam*G94,IF(E94=List!$A$72,Total_OF*G94,0))))","v":0},0,{"$f":"IF(D94=List!$A$69,H94*$C$104,IF(D94=List!$A$70,H94*$C$105,IF(D94=List!$A$71,H94*$C$106,IF(D94=List!$A$72,H94*$C$107,0))))","v":0},{"$f":"IF(E94=List!$A$69,I94*$C$104,IF(E94=List!$A$70,I94*$C$105,IF(E94=List!$A$71,I94*$C$106,IF(E94=List!$A$72,I94*$C$107,0))))","v":0},0,0,0,{"$f":"IF(D94=List!$A$69,($C$104*N94),IF(D94=List!$A$70,$C$105*N94,IF(D94=List!$A$71,$C$106*N94,IF(D94=List!$A$72,$C$107*N94,0))))","v":0},{"$f":"IF(E94=List!$A$69,($C$104*O94),IF(E94=List!$A$70,$C$105*O94,IF(E94=List!$A$71,$C$106*O94,IF(E94=List!$A$72,$C$107*O94,0))))","v":0},0,null,{"$f":"IF(D94=List!$A$69,H94,0)+(IF(E94=List!$A$69,I94,0))","v":0},{"$f":"IF(D94=List!$A$70,H94,0)+IF(E94=List!$A$70,I94,0)","v":0},{"$f":"IF(D94=List!$A$71,H94,0)+(IF(E94=List!$A$71,I94,0))","v":0},{"$f":"IF(D94=List!$A$72,H94,0)+IF(E94=List!$A$72,I94,0)","v":0},null,0,0,0,0,null,0,0,0,0,null,0,0,0,0]
[null,{"$f":"'Translation '!A168","v":"Material Processing"},{"$f":"'Energy Use System'!C46","v":0},{"$f":"'Energy Use System'!D46","v":0},{"$f":"'Energy Use System'!E46","v":0},{"$f":"IF(F79>0,F79,IF(OR(C95=0,C95=List!$A$8,C95=List!$A$9),0,IF(D95=List!$A$69,(VLOOKUP(B95,$B$3:$R$21,MATCH($B$87,$B$3:$R$3,0),FALSE)),IF(OR(D95=List!$A$70,D95=List!$A$72),VLOOKUP(B95,$B$23:$R$41,MATCH($B$87,$B$23:$R$23,0),FALSE),IF(D95=List!$A$71,VLOOKUP(B95,$B$43:$R$61,MATCH($B$87,$B$43:$R$43,0),FALSE),0)))))","v":0},{"$f":"IF(G79>0,G79,IF(OR(C95=0,C95=List!$A$8,C95=List!$A$9),0,IF(E95=List!$A$69,(VLOOKUP(B95,$B$3:$R$21,MATCH($B$87,$B$3:$R$3,0),FALSE)),IF(OR(E95=List!$A$70,E95=List!$A$72),VLOOKUP(B95,$B$23:$R$41,MATCH($B$87,$B$23:$R$23,0),FALSE),IF(E95=List!$A$71,VLOOKUP(B95,$B$43:$R$61,MATCH($B$87,$B$43:$R$43,0),FALSE),0)))))","v":0},{"$f":"IF(D95=List!$A$69,Total_Electricity*F95,IF(D95=List!$A$70,Total_NG*F95,IF(D95=List!$A$71,Total_Steam*F95,IF(D95=List!$A$72,Total_OF*F95,0))))","v":0},{"$f":"IF(E95=List!$A$69,Total_Electricity*G95,IF(E95=List!$A$70,Total_NG*G95,IF(E95=List!$A$71,Total_Steam*G95,IF(E95=List!$A$72,Total_OF*G95,0))))","v":0},0,{"$f":"IF(D95=List!$A$69,H95*$C$104,IF(D95=List!$A$70,H95*$C$105,IF(D95=List!$A$71,H95*$C$106,IF(D95=List!$A$72,H95*$C$107,0))))","v":0},{"$f":"IF(E95=List!$A$69,I95*$C$104,IF(E95=List!$A$70,I95*$C$105,IF(E95=List!$A$71,I95*$C$106,IF(E95=List!$A$72,I95*$C$107,0))))","v":0},0,0,0,{"$f":"IF(D95=List!$A$69,($C$104*N95),IF(D95=List!$A$70,$C$105*N95,IF(D95=List!$A$71,$C$106*N95,IF(D95=List!$A$72,$C$107*N95,0))))","v":0},{"$f":"IF(E95=List!$A$69,($C$104*O95),IF(E95=List!$A$70,$C$105*O95,IF(E95=List!$A$71,$C$106*O95,IF(E95=List!$A$72,$C$107*O95,0))))","v":0},0,null,{"$f":"IF(D95=List!$A$69,H95,0)+(IF(E95=List!$A$69,I95,0))","v":0},{"$f":"IF(D95=List!$A$70,H95,0)+IF(E95=List!$A$70,I95,0)","v":0},{"$f":"IF(D95=List!$A$71,H95,0)+(IF(E95=List!$A$71,I95,0))","v":0},{"$f":"IF(D95=List!$A$72,H95,0)+IF(E95=List!$A$72,I95,0)","v":0},null,0,0,0,0,null,0,0,0,0,null,0,0,0,0]
[null,{"$f":"'Translation '!A169","v":"Process Cooling and Refrigeration"},{"$f":"'Energy Use System'!C47","v":0},{"$f":"'Energy Use System'!D47","v":0},{"$f":"'Energy Use System'!E47","v":0},{"$f":"IF(F80>0,F80,IF(OR(C96=0,C96=List!$A$8,C96=List!$A$9),0,IF(D96=List!$A$69,(VLOOKUP(B96,$B$3:$R$21,MATCH($B$87,$B$3:$R$3,0),FALSE)),IF(OR(D96=List!$A$70,D96=List!$A$72),VLOOKUP(B96,$B$23:$R$41,MATCH($B$87,$B$23:$R$23,0),FALSE),IF(D96=List!$A$71,VLOOKUP(B96,$B$43:$R$61,MATCH($B$87,$B$43:$R$43,0),FALSE),0)))))","v":0},{"$f":"IF(G80>0,G80,IF(OR(C96=0,C96=List!$A$8,C96=List!$A$9),0,IF(E96=List!$A$69,(VLOOKUP(B96,$B$3:$R$21,MATCH($B$87,$B$3:$R$3,0),FALSE)),IF(OR(E96=List!$A$70,E96=List!$A$72),VLOOKUP(B96,$B$23:$R$41,MATCH($B$87,$B$23:$R$23,0),FALSE),IF(E96=List!$A$71,VLOOKUP(B96,$B$43:$R$61,MATCH($B$87,$B$43:$R$43,0),FALSE),0)))))","v":0},{"$f":"IF(D96=List!$A$69,Total_Electricity*F96,IF(D96=List!$A$70,Total_NG*F96,IF(D96=List!$A$71,Total_Steam*F96,IF(D96=List!$A$72,Total_OF*F96,0))))","v":0},{"$f":"IF(E96=List!$A$69,Total_Electricity*G96,IF(E96=List!$A$70,Total_NG*G96,IF(E96=List!$A$71,Total_Steam*G96,IF(E96=List!$A$72,Total_OF*G96,0))))","v":0},0,{"$f":"IF(D96=List!$A$69,H96*$C$104,IF(D96=List!$A$70,H96*$C$105,IF(D96=List!$A$71,H96*$C$106,IF(D96=List!$A$72,H96*$C$107,0))))","v":0},{"$f":"IF(E96=List!$A$69,I96*$C$104,IF(E96=List!$A$70,I96*$C$105,IF(E96=List!$A$71,I96*$C$106,IF(E96=List!$A$72,I96*$C$107,0))))","v":0},0,0,0,{"$f":"IF(D96=List!$A$69,($C$104*N96),IF(D96=List!$A$70,$C$105*N96,IF(D96=List!$A$71,$C$106*N96,IF(D96=List!$A$72,$C$107*N96,0))))","v":0},{"$f":"IF(E96=List!$A$69,($C$104*O96),IF(E96=List!$A$70,$C$105*O96,IF(E96=List!$A$71,$C$106*O96,IF(E96=List!$A$72,$C$107*O96,0))))","v":0},0,null,{"$f":"IF(D96=List!$A$69,H96,0)+(IF(E96=List!$A$69,I96,0))","v":0},{"$f":"IF(D96=List!$A$70,H96,0)+IF(E96=List!$A$70,I96,0)","v":0},{"$f":"IF(D96=List!$A$71,H96,0)+(IF(E96=List!$A$71,I96,0))","v":0},{"$f":"IF(D96=List!$A$72,H96,0)+IF(E96=List!$A$72,I96,0)","v":0},null,0,0,0,0,null,0,0,0,0,null,0,0,0,0]
[null,{"$f":"'Translation '!A170","v":"Process Heating"},{"$f":"'Energy Use System'!C48","v":0},{"$f":"'Energy Use System'!D48","v":0},{"$f":"'Energy Use System'!E48","v":0},{"$f":"IF(F81>0,F81,IF(OR(C97=0,C97=List!$A$8,C97=List!$A$9),0,IF(D97=List!$A$69,(VLOOKUP(B97,$B$3:$R$21,MATCH($B$87,$B$3:$R$3,0),FALSE)),IF(OR(D97=List!$A$70,D97=List!$A$72),VLOOKUP(B97,$B$23:$R$41,MATCH($B$87,$B$23:$R$23,0),FALSE),IF(D97=List!$A$71,VLOOKUP(B97,$B$43:$R$61,MATCH($B$87,$B$43:$R$43,0),FALSE),0)))))","v":0},{"$f":"IF(G81>0,G81,IF(OR(C97=0,C97=List!$A$8,C97=List!$A$9),0,IF(E97=List!$A$69,(VLOOKUP(B97,$B$3:$R$21,MATCH($B$87,$B$3:$R$3,0),FALSE)),IF(OR(E97=List!$A$70,E97=List!$A$72),VLOOKUP(B97,$B$23:$R$41,MATCH($B$87,$B$23:$R$23,0),FALSE),IF(E97=List!$A$71,VLOOKUP(B97,$B$43:$R$61,MATCH($B$87,$B$43:$R$43,0),FALSE),0)))))","v":0},{"$f":"IF(D97=List!$A$69,Total_Electricity*F97,IF(D97=List!$A$70,Total_NG*F97,IF(D97=List!$A$71,Total_Steam*F97,IF(D97=List!$A$72,Total_OF*F97,0))))","v":0},{"$f":"IF(E97=List!$A$69,Total_Electricity*G97,IF(E97=List!$A$70,Total_NG*G97,IF(E97=List!$A$71,Total_Steam*G97,IF(E97=List!$A$72,Total_OF*G97,0))))","v":0},0,{"$f":"IF(D97=List!$A$69,H97*$C$104,IF(D97=List!$A$70,H97*$C$105,IF(D97=List!$A$71,H97*$C$106,IF(D97=List!$A$72,H97*$C$107,0))))","v":0},{"$f":"IF(E97=List!$A$69,I97*$C$104,IF(E97=List!$A$70,I97*$C$105,IF(E97=List!$A$71,I97*$C$106,IF(E97=List!$A$72,I97*$C$107,0))))","v":0},0,0,0,{"$f":"IF(D97=List!$A$69,($C$104*N97),IF(D97=List!$A$70,$C$105*N97,IF(D97=List!$A$71,$C$106*N97,IF(D97=List!$A$72,$C$107*N97,0))))","v":0},{"$f":"IF(E97=List!$A$69,($C$104*O97),IF(E97=List!$A$70,$C$105*O97,IF(E97=List!$A$71,$C$106*O97,IF(E97=List!$A$72,$C$107*O97,0))))","v":0},0,null,{"$f":"IF(D97=List!$A$69,H97,0)+(IF(E97=List!$A$69,I97,0))","v":0},{"$f":"IF(D97=List!$A$70,H97,0)+IF(E97=List!$A$70,I97,0)","v":0},{"$f":"IF(D97=List!$A$71,H97,0)+(IF(E97=List!$A$71,I97,0))","v":0},{"$f":"IF(D97=List!$A$72,H97,0)+IF(E97=List!$A$72,I97,0)","v":0},null,0,0,0,0,null,0,0,0,0,null,0,0,0,0]
[null,{"$f":"'Translation '!A171","v":"Pumps"},{"$f":"'Energy Use System'!C49","v":0},{"$f":"'Energy Use System'!D49","v":0},{"$f":"'Energy Use System'!E49","v":0},{"$f":"IF(F82>0,F82,IF(OR(C98=0,C98=List!$A$8,C98=List!$A$9),0,IF(D98=List!$A$69,(VLOOKUP(B98,$B$3:$R$21,MATCH($B$87,$B$3:$R$3,0),FALSE)),IF(OR(D98=List!$A$70,D98=List!$A$72),VLOOKUP(B98,$B$23:$R$41,MATCH($B$87,$B$23:$R$23,0),FALSE),IF(D98=List!$A$71,VLOOKUP(B98,$B$43:$R$61,MATCH($B$87,$B$43:$R$43,0),FALSE),0)))))","v":0},{"$f":"IF(G82>0,G82,IF(OR(C98=0,C98=List!$A$8,C98=List!$A$9),0,IF(E98=List!$A$69,(VLOOKUP(B98,$B$3:$R$21,MATCH($B$87,$B$3:$R$3,0),FALSE)),IF(OR(E98=List!$A$70,E98=List!$A$72),VLOOKUP(B98,$B$23:$R$41,MATCH($B$87,$B$23:$R$23,0),FALSE),IF(E98=List!$A$71,VLOOKUP(B98,$B$43:$R$61,MATCH($B$87,$B$43:$R$43,0),FALSE),0)))))","v":0},{"$f":"IF(D98=List!$A$69,Total_Electricity*F98,IF(D98=List!$A$70,Total_NG*F98,IF(D98=List!$A$71,Total_Steam*F98,IF(D98=List!$A$72,Total_OF*F98,0))))","v":0},{"$f":"IF(E98=List!$A$69,Total_Electricity*G98,IF(E98=List!$A$70,Total_NG*G98,IF(E98=List!$A$71,Total_Steam*G98,IF(E98=List!$A$72,Total_OF*G98,0))))","v":0},0,{"$f":"IF(D98=List!$A$69,H98*$C$104,IF(D98=List!$A$70,H98*$C$105,IF(D98=List!$A$71,H98*$C$106,IF(D98=List!$A$72,H98*$C$107,0))))","v":0},{"$f":"IF(E98=List!$A$69,I98*$C$104,IF(E98=List!$A$70,I98*$C$105,IF(E98=List!$A$71,I98*$C$106,IF(E98=List!$A$72,I98*$C$107,0))))","v":0},0,0,0,{"$f":"IF(D98=List!$A$69,($C$104*N98),IF(D98=List!$A$70,$C$105*N98,IF(D98=List!$A$71,$C$106*N98,IF(D98=List!$A$72,$C$107*N98,0))))","v":0},{"$f":"IF(E98=List!$A$69,($C$104*O98),IF(E98=List!$A$70,$C$105*O98,IF(E98=List!$A$71,$C$106*O98,IF(E98=List!$A$72,$C$107*O98,0))))","v":0},0,null,{"$f":"IF(D98=List!$A$69,H98,0)+(IF(E98=List!$A$69,I98,0))","v":0},{"$f":"IF(D98=List!$A$70,H98,0)+IF(E98=List!$A$70,I98,0)","v":0},{"$f":"IF(D98=List!$A$71,H98,0)+(IF(E98=List!$A$71,I98,0))","v":0},{"$f":"IF(D98=List!$A$72,H98,0)+IF(E98=List!$A$72,I98,0)","v":0},null,0,0,0,0,null,0,0,0,0,null,0,0,0,0]
[null,{"$f":"'Translation '!A172","v":"Steam Generation Equipment"},{"$f":"'Energy Use System'!C50","v":0},{"$f":"'Energy Use System'!D50","v":0},{"$f":"'Energy Use System'!E50","v":0},{"$f":"IF(F83>0,F83,IF(OR(C99=0,C99=List!$A$8,C99=List!$A$9),0,IF(D99=List!$A$69,(VLOOKUP(B99,$B$3:$R$21,MATCH($B$87,$B$3:$R$3,0),FALSE)),IF(OR(D99=List!$A$70,D99=List!$A$72),VLOOKUP(B99,$B$23:$R$41,MATCH($B$87,$B$23:$R$23,0),FALSE),IF(D99=List!$A$71,VLOOKUP(B99,$B$43:$R$61,MATCH($B$87,$B$43:$R$43,0),FALSE),0)))))","v":0},{"$f":"IF(G83>0,G83,IF(OR(C99=0,C99=List!$A$8,C99=List!$A$9),0,IF(E99=List!$A$69,(VLOOKUP(B99,$B$3:$R$21,MATCH($B$87,$B$3:$R$3,0),FALSE)),IF(OR(E99=List!$A$70,E99=List!$A$72),VLOOKUP(B99,$B$23:$R$41,MATCH($B$87,$B$23:$R$23,0),FALSE),IF(E99=List!$A$71,VLOOKUP(B99,$B$43:$R$61,MATCH($B$87,$B$43:$R$43,0),FALSE),0)))))","v":0},{"$f":"IF(D99=List!$A$69,Total_Electricity*F99,IF(D99=List!$A$70,Total_NG*F99,IF(D99=List!$A$71,Total_Steam*F99,IF(D99=List!$A$72,Total_OF*F99,0))))","v":0},{"$f":"IF(E99=List!$A$69,Total_Electricity*G99,IF(E99=List!$A$70,Total_NG*G99,IF(E99=List!$A$71,Total_Steam*G99,IF(E99=List!$A$72,Total_OF*G99,0))))","v":0},0,{"$f":"IF(D99=List!$A$69,H99*$C$104,IF(D99=List!$A$70,H99*$C$105,IF(D99=List!$A$71,H99*$C$106,IF(D99=List!$A$72,H99*$C$107,0))))","v":0},{"$f":"IF(E99=List!$A$69,I99*$C$104,IF(E99=List!$A$70,I99*$C$105,IF(E99=List!$A$71,I99*$C$106,IF(E99=List!$A$72,I99*$C$107,0))))","v":0},0,0,0,{"$f":"IF(D99=List!$A$69,($C$104*N99),IF(D99=List!$A$70,$C$105*N99,IF(D99=List!$A$71,$C$106*N99,IF(D99=List!$A$72,$C$107*N99,0))))","v":0},{"$f":"IF(E99=List!$A$69,($C$104*O99),IF(E99=List!$A$70,$C$105*O99,IF(E99=List!$A$71,$C$106*O99,IF(E99=List!$A$72,$C$107*O99,0))))","v":0},0,null,{"$f":"IF(D99=List!$A$69,H99,0)+(IF(E99=List!$A$69,I99,0))","v":0},{"$f":"IF(D99=List!$A$70,H99,0)+IF(E99=List!$A$70,I99,0)","v":0},{"$f":"IF(D99=List!$A$71,H99,0)+(IF(E99=List!$A$71,I99,0))","v":0},{"$f":"IF(D99=List!$A$72,H99,0)+IF(E99=List!$A$72,I99,0)","v":0},null,0,0,0,0,null,0,0,0,0,null,0,0,0,0]
[null,"Oth",null,null,null,null,null,null,null,{"$f":"Q76","v":0},null,null,{"$f":"Q79","v":0},null,null,null,null,null,null,{"$f":"Total_Electricity-SUM(T88:T99)","v":0},{"$f":"Total_NG-SUM(U88:U99)","v":0},{"$f":"Total_Steam-SUM(V88:V99)","v":0},{"$f":"Total_OF-SUM(W88:W99)","v":0},null,{"$f":"F145*T100","v":0},{"$f":"F145*U100","v":0},{"$f":"F145*V100","v":0},{"$f":"F145*W100","v":0},null,{"$f":"IFERROR(T100/$G$64,0)","v":0},{"$f":"IFERROR(U100/$G$65,0)","v":0},{"$f":"IFERROR(V100/$G$66,0)","v":0},{"$f":"IFERROR(W100/$G$67,0)","v":0},null,{"$f":"F145*AD100","v":0},{"$f":"F145*AE100","v":0},{"$f":"F145*AF100","v":0},{"$f":"F145*AG100","v":0}]
[null,null,null,null,null,null,null,null,null,null,null,null,null,null,null,null,null,null,null,null,null,null,null,null,{"$f":"SUM(Y88:Y100)","v":0},{"$f":"SUM(Z88:Z100)","v":0},0,0]
[null,{"$f":"'Translation '!A265","v":"Unit cost of Energy"}]
[null,{"$f":"'Translation '!A266","v":"Energy Type"},"S/Output Unit","$/input unit"]
[null,{"$f":"'Translation '!A129","v":"Electricity"},{"$f":"IFERROR('Energy & Production '!F86/Total_Electricity,\"NA\")","v":"NA"},{"$f":"C104*G64","v":{"$error":"#VALUE!"}}]
[null,{"$f":"'Translation '!A130","v":"Natural Gas"},{"$f":"IFERROR('Energy & Production '!F87/Total_NG,\"NA\")","v":"NA"},{"$f":"C105*G65","v":{"$error":"#VALUE!"}}]
[null,{"$f":"'Translation '!A131","v":"Steam"},{"$f":"IFERROR('Energy & Production '!F88/Total_Steam,\"NA\")","v":"NA"},{"$error":"#VALUE!"}]
[null,{"$f":"'Translation '!A132","v":"Other Fuel"},{"$f":"IFERROR('Energy & Production '!F89/Total_OF,\"NA\")","v":"NA"},{"$error":"#VALUE!"}]
[]
[null,{"$f":"'Translation '!A267","v":"Ranges for ePeP scorecard Result"},null,null,null,null,null,{"$f":"'Translation '!A271","v":"End Use"},{"$f":"'Translation '!A240","v":"High "},{"$f":"'Translation '!A241","v":"Medium"},{"$f":"'Translation '!A242","v":"Low"},null,{"$f":"'Translation '!A170","v":"Process Heating"},{"$f":"'Translation '!A240","v":"High "},{"$f":"'Translation '!A241","v":"Medium"},{"$f":"'Translation '!A242","v":"Low"}]
[null,{"$f":"'Translation '!A268","v":"Score Card"},null,{"$f":"'Translation '!A269","v":"Point"},{"$f":"'Translation '!A269","v":"Point"},{"$f":"'Translation '!A270","v":"Ranking"},null,{"$f":"'Translation '!A161","v":"Combined Heat and Power (Cogeneration)"},0.05,0.03,0.01,null,{"$f":"'Translation '!A199","v":"Aluminum and Alumina "},0.4,0.25,0.1]
[null,{"$f":"'Translation '!A162","v":"Compressed Air"},null,0,40,{"$f":"'Translation '!A240","v":"High "},null,{"$f":"'Translation '!A162","v":"Compressed Air"},0.2,0.15,0.05,null,{"$f":"'Translation '!A200","v":"Cement "},0.4,0.25,0.1]
[null,{"$f":"'Translation '!A162","v":"Compressed Air"},null,40,80,{"$f":"'Translation '!A241","v":"Medium"},null,{"$f":"'Translation '!A163","v":"Electrochemical Processes"},0,0,0,null,{"$f":"'Translation '!A201","v":"Chemical and Allied Products "},0.25,0.15,7.4999999999999997E-2]
[null,{"$f":"'Translation '!A162","v":"Compressed Air"},null,80,100,{"$f":"'Translation '!A242","v":"Low"},null,{"$f":"'Translation '!A164","v":"Fans and Blowers"},0.1,0.1,0.1,null,{"$f":"'Translation '!A202","v":"Computer, Electronics and Appliances "},0.15,0.1,0.05]
[null,{"$f":"'Translation '!A169","v":"Process Cooling and Refrigeration"},null,0,40,{"$f":"'Translation '!A240","v":"High "},null,{"$f":"'Translation '!A165","v":"Industrial Facilities (Lighting)"},0.15,0.15,0.15,null,{"$f":"'Translation '!A203","v":"Fabricated Metal Products"},0.25,0.15,7.4999999999999997E-2]
[null,{"$f":"'Translation '!A169","v":"Process Cooling and Refrigeration"},null,40,85,{"$f":"'Translation '!A241","v":"Medium"},null,{"$f":"'Translation '!A166","v":"Industrial Facilities (HVAC)"},0.15,0.15,0.15,null,{"$f":"'Translation '!A204","v":"Food, Beverage and  Tobacco Products "},0.15,0.1,0.05]
[null,{"$f":"'Translation '!A169","v":"Process Cooling and Refrigeration"},null,85,100,{"$f":"'Translation '!A242","v":"Low"},null,{"$f":"'Translation '!A167","v":"Material Handling"},0,0,0,null,{"$f":"'Translation '!A205","v":"Foundries "},0.4,0.25,0.1]
[null,{"$f":"'Translation '!A170","v":"Process Heating"},null,0,25,{"$f":"'Translation '!A240","v":"High "},null,{"$f":"'Translation '!A168","v":"Material Processing"},0,0,0,null,{"$f":"'Translation '!A206","v":"Glass and Glass Products "},0.4,0.25,0.1]
[null,{"$f":"'Translation '!A170","v":"Process Heating"},null,25,50,{"$f":"'Translation '!A241","v":"Medium"},null,{"$f":"'Translation '!A169","v":"Process Cooling and Refrigeration"},0.15,0.1,0.05,null,{"$f":"'Translation '!A207","v":"Heavy Machinery "},0.15,0.1,0.05]
[null,{"$f":"'Translation '!A170","v":"Process Heating"},null,50,100,{"$f":"'Translation '!A242","v":"Low"},null,{"$f":"'Translation '!A171","v":"Pumps"},0.5,0.3,0.15,null,{"$f":"'Translation '!A208","v":"Integrated Steel "},0.4,0.25,0.1]
[null,{"$f":"'Translation '!A171","v":"Pumps"},null,0,40,{"$f":"'Translation '!A240","v":"High "},null,{"$f":"'Translation '!A172","v":"Steam Generation Equipment"},0.2,0.15,0.05,null,{"$f":"'Translation '!A209","v":"Petroleum Refining "},0.25,0.15,7.4999999999999997E-2]
[null,{"$f":"'Translation '!A171","v":"Pumps"},null,40,80,{"$f":"'Translation '!A241","v":"Medium"},null,null,null,null,null,null,{"$f":"'Translation '!A210","v":"Plastic and Rubber Products "},0.15,0.1,0.05]
[null,{"$f":"'Translation '!A171","v":"Pumps"},null,80,100,{"$f":"'Translation '!A242","v":"Low"},null,null,null,null,null,null,{"$f":"'Translation '!A211","v":"Textile and Apparels and Leather goods "},0.15,0.1,0.05]
[null,{"$f":"'Translation '!A161","v":"Combined Heat and Power (Cogeneration)"},null,0,40,{"$f":"'Translation '!A240","v":"High "},null,null,null,null,null,null,{"$f":"'Translation '!A212","v":"Transportation Equipment "},0.15,0.1,0.05]
[null,{"$f":"'Translation '!A161","v":"Combined Heat and Power (Cogeneration)"},null,40,80,{"$f":"'Translation '!A241","v":"Medium"},null,null,null,null,null,null,{"$f":"'Translation '!A213","v":"Wood Produces, Pulp and Paper "},0.15,0.1,0.05]
[null,{"$f":"'Translation '!A161","v":"Combined Heat and Power (Cogeneration)"},null,80,100,{"$f":"'Translation '!A242","v":"Low"},null,null,null,null,null,null,{"$f":"'Translation '!A214","v":"Others (All Manufacturing)"},0.15,0.1,0.05]
[null,{"$f":"'Translation '!A172","v":"Steam Generation Equipment"},null,0,50,{"$f":"'Translation '!A240","v":"High "}]
[null,{"$f":"'Translation '!A172","v":"Steam Generation Equipment"},null,50,80,{"$f":"'Translation '!A241","v":"Medium"}]
[null,{"$f":"'Translation '!A172","v":"Steam Generation Equipment"},null,80,100,{"$f":"'Translation '!A242","v":"Low"}]
[]
[]
[null,{"$f":"'Translation '!A272","v":"Ranking  and Potential Percent of Savings for each End Use based on Scorecard and User Input"}]
[null,{"$f":"'Translation '!A153","v":"System "},null,{"$f":"'Translation '!A273","v":"User Input"},{"$f":"'Translation '!A268","v":"Score Card"},{"$f":"'Translation '!A274","v":"% saving based on input"},{"$f":"CONCATENATE('Translation '!A275,\" \",H86)","v":"Energy Saving  0"},{"$f":"'Translation '!A276","v":"% Energy Consumption by system "},"Score Card Score",null,null,{"$f":"'Translation '!A310","v":"Month"},{"$f":"'Translation '!A244","v":"Electricity"},{"$f":"'Translation '!A245","v":"Natural Gas"},{"$f":"'Translation '!A246","v":"Steam"},{"$f":"'Translation '!A247","v":"Other Fuel"},{"$f":"'Translation '!A311","v":"Production "}]
[null,{"$f":"'Translation '!A161","v":"Combined Heat and Power (Cogeneration)"},null,{"$f":"'Energy Saving Opportunities'!G17","v":0},{"$f":"IF(AND(CHP!N69>D123,CHP!N69<=E123),List!$A$64,IF(AND(CHP!N69>D124,CHP!N69<=E124),List!$A$65,IF(CHP!N69>D125,List!$A$66,D133)))","v":0},{"$f":"IF(OR(ISBLANK(E133),E133=List!$A$67,E133=0),0,VLOOKUP(B133,$H$109:$K$120,MATCH(E133,$H$109:$K$109,0),FALSE))","v":0},{"$f":"IF(OR(ISBLANK('Energy Saving Opportunities'!G17),'Energy Saving Opportunities'!G17=List!$A$67),0,IF(J72>0,J72*F133,J88*F133))","v":0},{"$f":"Results!C188/'NAICS Data-Base'!$Q$74","v":{"$error":"#DIV/0!"}},{"$f":"CHP!N69","v":0},null,null,{"$f":"'Translation '!A102","v":"January"},{"$f":"'Energy & Production '!B20*'Energy & Production '!$B$76*$G$64","v":0},{"$f":"'Energy & Production '!D20*$G$65","v":0},{"$f":"'Energy & Production '!F20*$G$66","v":0},{"$f":"'Energy & Production '!H20*$G$67","v":0},{"$f":"'Energy & Production '!J20+'Energy & Production '!K20+'Energy & Production '!L20","v":0}]
[null,{"$f":"'Translation '!A162","v":"Compressed Air"},null,{"$f":"'Energy Saving Opportunities'!G18","v":0},{"$f":"IF(AND('Compressed Air'!K51>D111,'Compressed Air'!K51<=E111),List!$A$64,IF(AND('Compressed Air'!K51>D112,'Compressed Air'!K51<=E112),List!$A$65,IF('Compressed Air'!K51>D113,List!$A$66,D134)))","v":0},{"$f":"IF(OR(ISBLANK(E134),E134=List!$A$67,E134=0),0,VLOOKUP(B134,$H$109:$K$120,MATCH(E134,$H$109:$K$109,0),FALSE))","v":0},{"$f":"IF(OR(ISBLANK('Energy Saving Opportunities'!G18),'Energy Saving Opportunities'!G18=List!$A$67),0,IF(J73>0,J73*F134,J89*F134))","v":0},{"$f":"Results!C189/'NAICS Data-Base'!$Q$74","v":{"$error":"#DIV/0!"}},{"$f":"'Compressed Air'!K51","v":0},null,null,{"$f":"'Translation '!A103","v":"February"},{"$f":"'Energy & Production '!B21*'Energy & Production '!$B$76*$G$64","v":0},{"$f":"'Energy & Production '!D21*$G$65","v":0},{"$f":"'Energy & Production '!F21*$G$66","v":0},{"$f":"'Energy & Production '!H21*$G$67","v":0},{"$f":"'Energy & Production '!J21+'Energy & Production '!K21+'Energy & Production '!L21","v":0}]
[null,{"$f":"'Translation '!A163","v":"Electrochemical Processes"},null,{"$f":"'Energy Saving Opportunities'!G19","v":0},{"$f":"IF(AND(CHP!N71>0,CHP!N71<=40),List!$A$64,IF(AND(CHP!N71>40,CHP!N71<=80),List!$A$65,IF(CHP!N71>80,List!$A$66,D135)))","v":0},{"$f":"IF(OR(ISBLANK(E135),E135=List!$A$67,E135=0),0,VLOOKUP(B135,$H$109:$K$120,MATCH(E135,$H$109:$K$109,0),FALSE))","v":0},{"$f":"IF(OR(ISBLANK('Energy Saving Opportunities'!G19),'Energy Saving Opportunities'!G19=List!$A$67),0,IF(J74>0,J74*F135,J90*F135))","v":0},{"$f":"Results!C190/'NAICS Data-Base'!$Q$74","v":{"$error":"#DIV/0!"}},null,null,null,{"$f":"'Translation '!A104","v":"March"},{"$f":"'Energy & Production '!B22*'Energy & Production '!$B$76*$G$64","v":0},{"$f":"'Energy & Production '!D22*$G$65","v":0},{"$f":"'Energy & Production '!F22*$G$66","v":0},{"$f":"'Energy & Production '!H22*$G$67","v":0},{"$f":"'Energy & Production '!J22+'Energy & Production '!K22+'Energy & Production '!L22","v":0}]
[null,{"$f":"'Translation '!A164","v":"Fans and Blowers"},null,{"$f":"'Energy Saving Opportunities'!G20","v":0},{"$f":"IF(AND(CHP!N72>0,CHP!N72<=40),List!$A$64,IF(AND(CHP!N72>40,CHP!N72<=80),List!$A$65,IF(CHP!N72>80,List!$A$66,D136)))","v":0},{"$f":"IF(OR(ISBLANK(E136),E136=List!$A$67,E136=0),0,VLOOKUP(B136,$H$109:$K$120,MATCH(E136,$H$109:$K$109,0),FALSE))","v":0},{"$f":"IF(OR(ISBLANK('Energy Saving Opportunities'!G20),'Energy Saving Opportunities'!G20=List!$A$67),0,IF(J75>0,J75*F136,J91*F136))","v":0},{"$f":"Results!C191/'NAICS Data-Base'!$Q$74","v":{"$error":"#DIV/0!"}},null,null,null,{"$f":"'Translation '!A105","v":"April"},{"$f":"'Energy & Production '!B23*'Energy & Production '!$B$76*$G$64","v":0},{"$f":"'Energy & Production '!D23*$G$65","v":0},{"$f":"'Energy & Production '!F23*$G$66","v":0},{"$f":"'Energy & Production '!H23*$G$67","v":0},{"$f":"'Energy & Production '!J23+'Energy & Production '!K23+'Energy & Production '!L23","v":0}]
[null,{"$f":"'Translation '!A165","v":"Industrial Facilities (Lighting)"},null,{"$f":"'Energy Saving Opportunities'!G21","v":0},{"$f":"IF(AND(CHP!N73>0,CHP!N73<=40),List!$A$64,IF(AND(CHP!N73>40,CHP!N73<=80),List!$A$65,IF(CHP!N73>80,List!$A$66,D137)))","v":0},{"$f":"IF(OR(ISBLANK(E137),E137=List!$A$67,E137=0),0,VLOOKUP(B137,$H$109:$K$120,MATCH(E137,$H$109:$K$109,0),FALSE))","v":0},{"$f":"IF(OR(ISBLANK('Energy Saving Opportunities'!G21),'Energy Saving Opportunities'!G21=List!$A$67),0,IF(J76>0,J76*F137,J92*F137))","v":0},{"$f":"Results!C192/'NAICS Data-Base'!$Q$74","v":{"$error":"#DIV/0!"}},null,null,null,{"$f":"'Translation '!A106","v":"May"},{"$f":"'Energy & Production '!B24*'Energy & Production '!$B$76*$G$64","v":0},{"$f":"'Energy & Production '!D24*$G$65","v":0},{"$f":"'Energy & Production '!F24*$G$66","v":0},{"$f":"'Energy & Production '!H24*$G$67","v":0},{"$f":"'Energy & Production '!J24+'Energy & Production '!K24+'Energy & Production '!L24","v":0}]
[null,{"$f":"'Translation '!A166","v":"Industrial Facilities (HVAC)"},null,{"$f":"'Energy Saving Opportunities'!G22","v":0},{"$f":"IF(AND(CHP!N74>0,CHP!N74<=40),List!$A$64,IF(AND(CHP!N74>40,CHP!N74<=80),List!$A$65,IF(CHP!N74>80,List!$A$66,D138)))","v":0},{"$f":"IF(OR(ISBLANK(E138),E138=List!$A$67,E138=0),0,VLOOKUP(B138,$H$109:$K$120,MATCH(E138,$H$109:$K$109,0),FALSE))","v":0},{"$f":"IF(OR(ISBLANK('Energy Saving Opportunities'!G22),'Energy Saving Opportunities'!G22=List!$A$67),0,IF(J77>0,J77*F138,J93*F138))","v":0},{"$f":"Results!C193/'NAICS Data-Base'!$Q$74","v":{"$error":"#DIV/0!"}},null,null,null,{"$f":"'Translation '!A107","v":"June"},{"$f":"'Energy & Production '!B25*'Energy & Production '!$B$76*$G$64","v":0},{"$f":"'Energy & Production '!D25*$G$65","v":0},{"$f":"'Energy & Production '!F25*$G$66","v":0},{"$f":"'Energy & Production '!H25*$G$67","v":0},{"$f":"'Energy & Production '!J25+'Energy & Production '!K25+'Energy & Production '!L25","v":0}]
[null,{"$f":"'Translation '!A167","v":"Material Handling"},null,{"$f":"'Energy Saving Opportunities'!G23","v":0},{"$f":"IF(AND(CHP!N75>0,CHP!N75<=40),List!$A$64,IF(AND(CHP!N75>40,CHP!N75<=80),List!$A$65,IF(CHP!N75>80,List!$A$66,D139)))","v":0},{"$f":"IF(OR(ISBLANK(E139),E139=List!$A$67,E139=0),0,VLOOKUP(B139,$H$109:$K$120,MATCH(E139,$H$109:$K$109,0),FALSE))","v":0},{"$f":"IF(OR(ISBLANK('Energy Saving Opportunities'!G23),'Energy Saving Opportunities'!G23=List!$A$67),0,IF(J78>0,J78*F139,J94*F139))","v":0},{"$f":"Results!C194/'NAICS Data-Base'!$Q$74","v":{"$error":"#DIV/0!"}},null,null,null,{"$f":"'Translation '!A108","v":"July"},{"$f":"'Energy & Production '!B26*'Energy & Production '!$B$76*$G$64","v":0},{"$f":"'Energy & Production '!D26*$G$65","v":0},{"$f":"'Energy & Production '!F26*$G$66","v":0},{"$f":"'Energy & Production '!H26*$G$67","v":0},{"$f":"'Energy & Production '!J26+'Energy & Production '!K26+'Energy & Production '!L26","v":0}]
[null,{"$f":"'Translation '!A168","v":"Material Processing"},null,{"$f":"'Energy Saving Opportunities'!G24","v":0},{"$f":"IF(AND(CHP!N76>0,CHP!N76<=40),List!$A$64,IF(AND(CHP!N76>40,CHP!N76<=80),List!$A$65,IF(CHP!N76>80,List!$A$66,D140)))","v":0},{"$f":"IF(OR(ISBLANK(E140),E140=List!$A$67,E140=0),0,VLOOKUP(B140,$H$109:$K$120,MATCH(E140,$H$109:$K$109,0),FALSE))","v":0},{"$f":"IF(OR(ISBLANK('Energy Saving Opportunities'!G24),'Energy Saving Opportunities'!G24=List!$A$67),0,IF(J79>0,J79*F140,J95*F140))","v":0},{"$f":"Results!C195/'NAICS Data-Base'!$Q$74","v":{"$error":"#DIV/0!"}},null,null,null,{"$f":"'Translation '!A109","v":"August"},{"$f":"'Energy & Production '!B27*'Energy & Production '!$B$76*$G$64","v":0},{"$f":"'Energy & Production '!D27*$G$65","v":0},{"$f":"'Energy & Production '!F27*$G$66","v":0},{"$f":"'Energy & Production '!H27*$G$67","v":0},{"$f":"'Energy & Production '!J27+'Energy & Production '!K27+'Energy & Production '!L27","v":0}]
[null,{"$f":"'Translation '!A169","v":"Process Cooling and Refrigeration"},null,{"$f":"'Energy Saving Opportunities'!G25","v":0},{"$f":"IF(AND('Process Cooling & Refrigeration'!K108>D114,'Process Cooling & Refrigeration'!K108<=E114),List!$A$64,IF(AND('Process Cooling & Refrigeration'!K108>D115,'Process Cooling & Refrigeration'!K108<=E115),List!$A$65,IF('Process Cooling & Refrigeration'!K108>D116,List!$A$66,D141)))","v":0},{"$f":"IF(OR(ISBLANK(E141),E141=List!$A$67,E141=0),0,VLOOKUP(B141,$H$109:$K$120,MATCH(E141,$H$109:$K$109,0),FALSE))","v":0},{"$f":"IF(OR(ISBLANK('Energy Saving Opportunities'!G25),'Energy Saving Opportunities'!G25=List!$A$67),0,IF(J80>0,J80*F141,J96*F141))","v":0},{"$f":"Results!C196/'NAICS Data-Base'!$Q$74","v":{"$error":"#DIV/0!"}},{"$f":"'Process Cooling & Refrigeration'!K108","v":0},null,null,{"$f":"'Translation '!A110","v":"September"},{"$f":"'Energy & Production '!B28*'Energy & Production '!$B$76*$G$64","v":0},{"$f":"'Energy & Production '!D28*$G$65","v":0},{"$f":"'Energy & Production '!F28*$G$66","v":0},{"$f":"'Energy & Production '!H28*$G$67","v":0},{"$f":"'Energy & Production '!J28+'Energy & Production '!K28+'Energy & Production '!L28","v":0}]
[null,{"$f":"'Translation '!A170","v":"Process Heating"},null,{"$f":"'Energy Saving Opportunities'!G26","v":0},{"$f":"IF(AND('Process Heating'!F47>0,'Process Heating'!F47<=25),List!$A$64,IF(AND('Process Heating'!F47>25,'Process Heating'!F47<=50),List!$A$65,IF('Process Heating'!F47>50,List!$A$66,D142)))","v":0},{"$f":"IF(OR(ISBLANK(E142),E142=List!$A$67,E142=0),0,VLOOKUP('Basic Info '!B6,M109:P125,MATCH(E142,'NAICS Data-Base'!M109:P109,0),FALSE))","v":0},{"$f":"IF(OR(ISBLANK('Energy Saving Opportunities'!G26),'Energy Saving Opportunities'!G26=List!$A$67),0,IF(J81>0,J81*F142,J97*F142))","v":0},{"$f":"Results!C197/'NAICS Data-Base'!$Q$74","v":{"$error":"#DIV/0!"}},{"$f":"'Process Heating'!F47","v":0},null,null,{"$f":"'Translation '!A111","v":"October"},{"$f":"'Energy & Production '!B29*'Energy & Production '!$B$76*$G$64","v":0},{"$f":"'Energy & Production '!D29*$G$65","v":0},{"$f":"'Energy & Production '!F29*$G$66","v":0},{"$f":"'Energy & Production '!H29*$G$67","v":0},{"$f":"'Energy & Production '!J29+'Energy & Production '!K29+'Energy & Production '!L29","v":0}]
[null,{"$f":"'Translation '!A171","v":"Pumps"},null,{"$f":"'Energy Saving Opportunities'!G27","v":0},{"$f":"IF(AND(Pumps!O28>0,Pumps!O28<=40),List!$A$64,IF(AND(Pumps!O28>40,Pumps!O28<=80),List!$A$65,IF(Pumps!O28>80,List!$A$66,D143)))","v":0},{"$f":"IF(OR(ISBLANK(E143),E143=List!$A$67,E143=0),0,VLOOKUP(B143,$H$109:$K$120,MATCH(E143,$H$109:$K$109,0),FALSE))","v":0},{"$f":"IF(OR(ISBLANK('Energy Saving Opportunities'!G27),'Energy Saving Opportunities'!G27=List!$A$67),0,IF(J82>0,J82*F143,J98*F143))","v":0},{"$f":"Results!C198/'NAICS Data-Base'!$Q$74","v":{"$error":"#DIV/0!"}},{"$f":"Pumps!O28","v":0},null,null,{"$f":"'Translation '!A112","v":"November"},{"$f":"'Energy & Production '!B30*'Energy & Production '!$B$76*$G$64","v":0},{"$f":"'Energy & Production '!D30*$G$65","v":0},{"$f":"'Energy & Production '!F30*$G$66","v":0},{"$f":"'Energy & Production '!H30*$G$67","v":0},{"$f":"'Energy & Production '!J30+'Energy & Production '!K30+'Energy & Production '!L30","v":0}]
[null,{"$f":"'Translation '!A172","v":"Steam Generation Equipment"},null,{"$f":"'Energy Saving Opportunities'!G28","v":0},{"$f":"IF(AND('Steam Generation Equipment'!N85>0,'Steam Generation Equipment'!N85<=50),List!$A$64,IF(AND('Steam Generation Equipment'!N85>50,'Steam Generation Equipment'!N85<=80),List!$A$65,IF('Steam Generation Equipment'!N85>80,List!$A$66,D144)))","v":0},{"$f":"IF(OR(ISBLANK(E144),E144=List!$A$67,E144=0),0,VLOOKUP(B144,$H$109:$K$120,MATCH(E144,$H$109:$K$109,0),FALSE))","v":0},{"$f":"IF(OR(ISBLANK('Energy Saving Opportunities'!G28),'Energy Saving Opportunities'!G28=List!$A$67),0,IF(J83>0,J83*F144,J99*F144))","v":0},{"$f":"Results!C199/'NAICS Data-Base'!$Q$74","v":{"$error":"#DIV/0!"}},{"$f":"'Steam Generation Equipment'!N85","v":0},null,null,{"$f":"'Translation '!A113","v":"December"},{"$f":"'Energy & Production '!B31*'Energy & Production '!$B$76*$G$64","v":0},{"$f":"'Energy & Production '!D31*$G$65","v":0},{"$f":"'Energy & Production '!F31*$G$66","v":0},{"$f":"'Energy & Production '!H31*$G$67","v":0},{"$f":"'Energy & Production '!J31+'Energy & Production '!K31+'Energy & Production '!L31","v":0}]
[null,{"$f":"'Translation '!A277","v":"Miscellaneous"},null,null,null,0,null,{"$f":"Q77","v":{"$error":"#DIV/0!"}},null,null,null,null,{"$f":"SUM(M133:M144)","v":0},{"$f":"SUM(N133:N144)","v":0},{"$f":"SUM(O133:O144)","v":0},{"$f":"SUM(P133:P144)","v":0},{"$f":"ROUND(IF(SUM(Q133:Q144)>0,SUM(Q133:Q144),SUM('Energy & Production '!G56:I59)),0)","v":0}]
[null,null,null,null,null,null,{"$f":"SUM(G133:G145)","v":0}]
[]
[]
[null,{"$f":"'Translation '!A153","v":"System "},{"$f":"'Translation '!A240","v":"High "},null,null,null,{"$f":"'Translation '!A241","v":"Medium"},null,null,null,{"$f":"'Translation '!A242","v":"Low"}]
[null,{"$f":"'Translation '!A161","v":"Combined Heat and Power (Cogeneration)"},{"$f":"'Translation '!A278","v":"1) Consider use of heat from diesel generator engine (cooling water and exhaust gases) for steam generation or in heating processes.\n\n2) Consider use of heat from gas turbine exhaust gases for steam generation or in heating processes.\n\n3) Develop and implement a preventive and predictive maintenance program for the system.\n\n4) Maximize use of HRSG to meet the plant steam requirements, minimize load on boilers outside the co-gen system"},null,null,null,{"$f":"'Translation '!A279","v":"1) Consider use of HRSG with a duct burner (if not used currently) for gas turbine based on-site power generation system\n\n2) Investigate possibility of selling excess steam or/and power if there is a potential customer close by.\n\n3) Minimize flue gases temperature from HRSG by recovering heat from HRSG flue gases.\n\n4) Use system optimization tools to minimize combined cost of steam and electric power for the plant"},null,null,null,{"$f":"'Translation '!A280","v":"1) Analyze economics of use of additional CHP capacity to reduce peak power demand for the plant.\n\n2) Consider evaporative cooling for turbine combustion air using HRSG exhaust gases or other source of waste heat.\n\n3) Consider use of turbine exhaust gases for process heating equipment (process heaters, furnaces etc.)"}]
[]
[]
[]
[]
[null,{"$f":"'Translation '!A162","v":"Compressed Air"},{"$f":"'Translation '!A281","v":"1) Eliminate inappropriate uses of compressed air.\n\n2) Implement air leak management program.\n\n3) Perform a detailed Compressed Air System Assessment at your site.\n\n4) Reduce compressor operating pressure with or without controls."},null,null,null,{"$f":"'Translation '!A282","v":"1) Implement the recommendations of the Compressed Air System Assessment at your site.\n\n2) Install and operate equipment (including storage) that matches shifting demands\n\n3) Install or upgrade system controls\n\n4) Use the DOE AirMaster+ software tool & other resources to verify energy saving opportunities\n\n5) Install instrumentation to measure and trend compressed air cost indicators (kW/100 cfm)."},null,null,null,{"$f":"'Translation '!A283","v":"1) Evaluate heat recovery with compressed air systems.\n\n2) Monitor performance and document energy and cost savings on recently completed projects.\n\n3) Replace inefficient cooling and drying equipment.\n\n4) Install instrumentation to measure and trend compressed air cost indicators (kW/100 cfm)\n"}]
[]
[]
[]
[]
[null,{"$f":"'Translation '!A164","v":"Fans and Blowers"},{"$f":"'Translation '!A284","v":"1) Evaluate and reduce \"system effect\" through better inlet and outlet designs and duct sizing.\n\n2) Improve O&M practices such as belt tightening, cleaning fans and changing filters regularly.\n\n3) Minimize leakage and perform tightness tests, if needed.\n\n4) Perform a detailed Fan and Blower System Assessment at your site.\n\n5) Replace dampers, variable inlet vanes with electronic variable speed drives for meeting variable loads.\n\n6) Use the DOE FSAT software tool & other resources to identify and quantify energy saving opportunities"},null,null,null,{"$f":"'Translation '!A285","v":"1)Implement the recommendations of the Fans / Blowers System Assessment at your site\n\n2)Reduce and control fan speed by using variable speed drives\n\n3)Reduce fan oversizing by matching demand with proper fan type and size (for example: Use of axial fan with controllable pitch blades)\n\n4)Replace standard V-belts with cogged V-belts.\n\n5)Use the DOE FSAT software tool & other resources to verify energy saving opportunities"},null,null,null,{"$f":"'Translation '!A286","v":"1) Evaluate use of a back-pressure turbine drive instead of an electric motor, if applicable\n\n2) Evaluate use of multiple smaller fans (operating close to their Best Efficiency Point) than one large fan\n\n3) Install instrumentation to measure and trend fan performance (efficiency) periodically\n\n4) Monitor performance and document energy and cost savings on recently completed projects\n\n5) Replace electric motor with premium efficiency model\n\n6) Replace fan / blower with more efficient model"}]
[]
[]
[]
[]
[]
[]
[null,{"$f":"'Translation '!A165","v":"Industrial Facilities (Lighting)"},{"$f":"'Translation '!A287","v":"1)Evaluate lighting upgrades that includes implementing group relamp & maintenance programs.\n\n2)Install occupancy sensors.\n\n3)Perform a detailed Lighting Assessment at your site to identify and quantify energy saving opportunities\n\n\n\n"},null,null,null,{"$f":"'Translation '!A288","v":"1) Implement lighting control systems and zone areas based on task lighting\n\n2) Implement the recommendations of the Lighting Assessment at your site"},null,null,null,{"$f":"'Translation '!A289","v":"1) Evaluate incorporating daylighting, skylights, dimming, etc.\n\n2) Implement a central computerized Energy Management System to control Lights.\n\n3) Monitor performance and document energy and cost savings on recently completed projects"}]
[]
[]
[]
[null,{"$f":"'Translation '!A166","v":"Industrial Facilities (HVAC)"},{"$f":"'Translation '!A290","v":"1) Implement night setback and weekend/vacation temperature / ventilation controls\n\n2) Perform a detailed  HVAC System Assessment at your site to identify and quantify energy saving opportunities\n\n3) Shut-off steam / chilled water flows to air handlers that are not needed or are out of service\n"},null,null,null,{"$f":"'Translation '!A291","v":"1) Implement the recommendations of the HVAC System Assessment at your site.\n\n2) Install dry-bulb and/or enthalpy economizers.\n\n3) Optimize the operation of air handling units - start/stop.\n\n4) Rebalance the air-side system to reduce overall supply or meet changed zone demands"},null,null,null,{"$f":"'Translation '!A292","v":"1) Implement a central computerized Energy Management System to control HVAC system\n\n2) Implement demand controlled ventilation (CO2 sensor-based)\n\n3) Install instrumentation to measure and trend efficiency (Watts per sq. ft.) periodically.\n\n4) Monitor performance and document energy and cost savings on recently completed projects.\n\n5) Replace air conditioning  or air handling unit with a properly sized higher efficiency unit.\n"}]
[]
[]
[]
[null,{"$f":"'Translation '!A169","v":"Process Cooling and Refrigeration"},{"$f":"'Translation '!A293","v":"1) Ensure proper refrigerant charge and eliminate non-condensable from the system.\n\n2) Evaluate use of variable speed drives on chilled water pumps, cooling tower fans, etc. \n\n3) Float head pressure to minimum possible.\n\n4) Implement chilled water temperature and condenser water temperature reset.\n\n5) Perform a detailed Refrigeration / Process Cooling System Assessment at your site.\n\n6) Use the DOE CWSAT software tool & other resources to identify and quantify energy saving opportunities\n\n"},null,null,null,{"$f":"'Translation '!A294","v":"1)Eliminate fouling on heat exchanger tubes\n\n2)Evaluate use of an economizer in the system (cooling tower water vs. chilled water)\n\n3)Implement a predictive maintenance program that correlates performance with fluid contaminants in the system\n\n4)Implement the recommendations of the Refrigeration / Process Cooling System Assessment at your site\n\n5)Incorporate optimized chiller sequencing and controls\n\n6)Use the DOE CWSAT software tool & other resources to verify energy saving opportunities"},null,null,null,{"$f":"'Translation '!A295","v":"1)Convert air-cooled chillers to water-cooled units\n\n2)Evaluate chiller replacement (type, size) for a more efficient overall system or plant efficiency\n\n3)Evaluate heat recovery from chiller systems\n\n4)Evaluate use of thermally driven (absorption, engine, steam-turbine driven) chiller systems to balance steam and electric demand\n\n5)Install instrumentation to measure and trend individual compressor and overall system performance (efficiency - kW/ton) periodically\n\n6)Monitor performance and document energy and cost savings on recently completed projects\n\n"}]
[]
[]
[]
[]
[]
[null,{"$f":"'Translation '!A170","v":"Process Heating"},{"$f":"'Translation '!A296","v":"1)Conduct a detail energy assessment for your heating equipment using tools such as Process Heating Survey and Assessment Tool (PHAST) to identify energy saving opportunities.\n\n2)Keep heat transfer surfaces clean by eliminating build up of soot, scale or other material.\n\n3)Measure oxygen (O2) and Carbon Monoxide CO or combustible in flue gases and take actions to reduce O2 in flue gases while maintaining near zero value for CO or combustibles.  In certain cases safety requirements may require to have high values of O2 in flue gases.  Consult your equipment supplier before making any changes.\n\n4)Operate the furnace at or close to design load by proper furnace scheduling and loading- avoid delays, waits, cooling between operations etc. as much a possible.\n\n5)Reduce or eliminate openings in the furnace to reduce radiation heat losses.  Repair cracks and damaged insulation in furnace walls, doors etc. Keep the door opening to minimum during operations."},null,null,null,{"$f":"'Translation '!A297","v":"1)Consider use of combustion air preheating by recovering heat from furnace flue gases.  Evaluate use of recuperator, regenerators or regenerative burners.\n\n2)Consider use of heat from furnace flue gases to heat charge material, fixtures etc.\n\n3)Insulate water or air cooled parts used in the furnaces.  Examples are: rolls, supports etc. used in furnaces.\n\n4)Maintain proper (balanced or slightly positive) pressure in furnaces using proper control to avoid air leakage in the furnace.\n\n5)Reduce weight of fixtures, trays and other material handling weight and use 'hot-return' as much as possible."},null,null,null,{"$f":"'Translation '!A298","v":"1)Consider use of alternate source of heat such as switching from steam heating to direct fired heating for processes where possible.  Consider safety and process requirements before making changes.\n\n2)Consider use of heat from furnace flue gases in lower temperature processes, for steam generation, for water heating or air heating for the plant or other applications.\n\n3)Consider use of oxygen enriched air or oxy-fuel fired burners for high temperature processes.\n\n4)Design and build or rebuild furnaces and other heated components with adequate insulation to reduce wall heat losses"}]
[]
[]
[]
[]
[]
[]
[]
[null,{"$f":"'Translation '!A171","v":"Pumps"},{"$f":"'Translation '!A299","v":"1)Evaluate the use of adjustable speed drives on pumps that have variable flow and are being throttled.\n\n2)Explore the potential for using a fixed speed pump to supply base load and a smaller, properly sized fixed speed pump for trim.\n\n3)Perform a detailed Pumping System Assessment at your site\n\n4)Turn pumps ON and OFF to match needs.\n\n5)Use the DOE PSAT software tool & other resources to identify and quantify energy saving opportunities."},null,null,null,{"$f":"'Translation '!A300","v":"1)Identify the true pumping need (flow rate and head required) and ensure pumps are operating at their best efficiency point\n\n2)Implement the recommendations of the Pumping System Assessment at your site\n\n3)Use the DOE PSAT software tool & other resources to verify energy saving opportunities\n\n4)Install instrumentation to measure and trend pump performance (efficiency) periodically"},null,null,null,{"$f":"'Translation '!A301","v":"1)Monitor performance and document energy and cost savings on recently completed projects\n\n2)Purchase premium efficiency motors and specify energy efficiency guidelines for new pump purchases and/or retrofits\n\n3)Install instrumentation to measure and trend pump performance (efficiency) periodically"}]
[]
[]
[]
[]
[]
[null,{"$f":"'Translation '!A172","v":"Steam Generation Equipment"},{"$f":"'Translation '!A302","v":"1)Implement a Best Practices based leak management program\n\n2)Improve boiler efficiency by proper air/fuel control\n\n3)Improve boiler efficiency by proper blowdown management\n\n4)Improve condensate recovery\n\n5)Improve thermal insulation of the overall steam system\n\n6)Perform a detailed Steam Energy System Assessment at your site.\n\n7)Use the DOE Steam Best Practices Tools to identify and quantify energy saving opportunities.\n\n8)Implement a Best Practices based steam trap maintenance program"},null,null,null,{"$f":"'Translation '!A303","v":"1)Implement the recommendations of the Steam Energy System Assessment at your site\n\n2)Improve boiler efficiency by proper air/fuel control, blowdown management, etc.\n\n3)Use the DOE Steam Best Practices Tools to re-verify energy saving opportunities & prioritize\n\n4)Implement a Best Practices based steam trap maintenance program\n\n5)Install instrumentation to measure and trend steam cost indicators ($/Mlb)\n\n"},null,null,null,{"$f":"'Translation '!A304","v":"1)Evaluate the use of back pressure steam turbines in lieu of pressure reducing stations\n\n2)Implement heat recovery opportunities viz. economizers, combustion air preheaters, etc.\n\n3)Install instrumentation to measure and trend steam cost indicators ($/Mlb)\n\n4)Monitor performance and document energy and cost savings on recently completed projects.\n\n"}]
[]
[]
[]
[]
[]
[]
[]
[]
[null,"Total Energy ",{"$f":"Results!E22","v":0},{"$f":"J86","v":0},{"$f":"C204*VLOOKUP(D204,Conversions!$D$3:$G$16,4,FALSE)","v":{"$error":"#N/A"}},"MMBTU"]
[null,"Energy Saved ",{"$f":"G146","v":0},{"$f":"J86","v":0},{"$f":"C205*VLOOKUP(D205,Conversions!$D$3:$G$16,4,FALSE)","v":{"$error":"#N/A"}},"MMBTU"]
[null,"Potential Annual CO2 Emissions Savings"]
[null,"Fuel Type","% Energy Source by Fuel Type","% Energy Source Energy Savings by Fuel Type","Total Energy by Fuel Type (MMBTU)","Energy Saved by fuel type (MMBTU)","Avoided CO2 Emissions Factor \n(Metric Ton CO2/MMBtu)","Total Metric Ton CO2","Metric Ton Saved CO2"]
[null,"Natural Gas",{"$f":"IFERROR(Results!E19/Results!E22,\"\")","v":""},{"$f":"IFERROR(SUM(Z88:Z99)/C205,\"\")","v":""},{"$f":"IFERROR($E$204*C208,\"\")","v":""},{"$f":"IFERROR($E$205*D208,\"\")","v":""},5.3060000000000003E-2,{"$f":"IFERROR(G208*E208,\"\")","v":""},{"$f":"IFERROR(F208*G208,\"\")","v":""}]
[null,"Electricity",{"$f":"IFERROR(Results!E18/Results!E22,\"\")","v":""},{"$f":"IFERROR(SUM(Y88:Y99)/C205,\"\")","v":""},{"$f":"IFERROR($E$204*C209,\"\")","v":""},{"$f":"IFERROR($E$205*D209,\"\")","v":""},5.315233231045121E-2,{"$f":"IFERROR(G209*E209,\"\")","v":""},{"$f":"IFERROR(F209*G209,\"\")","v":""}]
[null,"Coal",{"$f":"IF('Energy & Production '!$F$10='Translation '!$A$858,Results!E21/Results!E22,\"0\")","v":"0"},{"$f":"IFERROR(IF('Energy & Production '!$F$10='Translation '!$A$858,SUM(AB88:AB99)/C205,\"0\"),\"\")","v":"0"},{"$f":"IFERROR($E$204*C210,\"\")","v":""},{"$f":"IFERROR($E$205*D210,\"\")","v":""},9.3980000000000008E-2,{"$f":"IFERROR(G210*E210,\"\")","v":""},{"$f":"IFERROR(F210*G210,\"\")","v":""}]
[]
[]
[null,"Energy Consumption Vs Production"]
[null,"Monthly Production","Energy Consumption"]
[null,{"$f":"'Energy & Production '!J20+'Energy & Production '!K20+'Energy & Production '!L20","v":0},{"$f":"IFERROR((('Energy & Production '!B20*'NAICS Data-Base'!$G$64)+('Energy & Production '!D20*'NAICS Data-Base'!$G$65)+('Energy & Production '!F20*'NAICS Data-Base'!$G$66)+('Energy & Production '!H20*'NAICS Data-Base'!$G$67)),\"\")","v":0}]
[null,{"$f":"'Energy & Production '!J21+'Energy & Production '!K21+'Energy & Production '!L21","v":0},{"$f":"IFERROR((('Energy & Production '!B21*'NAICS Data-Base'!$G$64)+('Energy & Production '!D21*'NAICS Data-Base'!$G$65)+('Energy & Production '!F21*'NAICS Data-Base'!$G$66)+('Energy & Production '!H21*'NAICS Data-Base'!$G$67)),\"\")","v":0}]
[null,{"$f":"'Energy & Production '!J22+'Energy & Production '!K22+'Energy & Production '!L22","v":0},{"$f":"IFERROR((('Energy & Production '!B22*'NAICS Data-Base'!$G$64)+('Energy & Production '!D22*'NAICS Data-Base'!$G$65)+('Energy & Production '!F22*'NAICS Data-Base'!$G$66)+('Energy & Production '!H22*'NAICS Data-Base'!$G$67)),\"\")","v":0}]
[null,{"$f":"'Energy & Production '!J23+'Energy & Production '!K23+'Energy & Production '!L23","v":0},{"$f":"IFERROR((('Energy & Production '!B23*'NAICS Data-Base'!$G$64)+('Energy & Production '!D23*'NAICS Data-Base'!$G$65)+('Energy & Production '!F23*'NAICS Data-Base'!$G$66)+('Energy & Production '!H23*'NAICS Data-Base'!$G$67)),\"\")","v":0}]
[null,{"$f":"'Energy & Production '!J24+'Energy & Production '!K24+'Energy & Production '!L24","v":0},{"$f":"IFERROR((('Energy & Production '!B24*'NAICS Data-Base'!$G$64)+('Energy & Production '!D24*'NAICS Data-Base'!$G$65)+('Energy & Production '!F24*'NAICS Data-Base'!$G$66)+('Energy & Production '!H24*'NAICS Data-Base'!$G$67)),\"\")","v":0}]
[null,{"$f":"'Energy & Production '!J25+'Energy & Production '!K25+'Energy & Production '!L25","v":0},{"$f":"IFERROR((('Energy & Production '!B25*'NAICS Data-Base'!$G$64)+('Energy & Production '!D25*'NAICS Data-Base'!$G$65)+('Energy & Production '!F25*'NAICS Data-Base'!$G$66)+('Energy & Production '!H25*'NAICS Data-Base'!$G$67)),\"\")","v":0}]
[null,{"$f":"'Energy & Production '!J26+'Energy & Production '!K26+'Energy & Production '!L26","v":0},{"$f":"IFERROR((('Energy & Production '!B26*'NAICS Data-Base'!$G$64)+('Energy & Production '!D26*'NAICS Data-Base'!$G$65)+('Energy & Production '!F26*'NAICS Data-Base'!$G$66)+('Energy & Production '!H26*'NAICS Data-Base'!$G$67)),\"\")","v":0}]
[null,{"$f":"'Energy & Production '!J27+'Energy & Production '!K27+'Energy & Production '!L27","v":0},{"$f":"IFERROR((('Energy & Production '!B27*'NAICS Data-Base'!$G$64)+('Energy & Production '!D27*'NAICS Data-Base'!$G$65)+('Energy & Production '!F27*'NAICS Data-Base'!$G$66)+('Energy & Production '!H27*'NAICS Data-Base'!$G$67)),\"\")","v":0}]
[null,{"$f":"'Energy & Production '!J28+'Energy & Production '!K28+'Energy & Production '!L28","v":0},{"$f":"IFERROR((('Energy & Production '!B28*'NAICS Data-Base'!$G$64)+('Energy & Production '!D28*'NAICS Data-Base'!$G$65)+('Energy & Production '!F28*'NAICS Data-Base'!$G$66)+('Energy & Production '!H28*'NAICS Data-Base'!$G$67)),\"\")","v":0}]
[null,{"$f":"'Energy & Production '!J29+'Energy & Production '!K29+'Energy & Production '!L29","v":0},{"$f":"IFERROR((('Energy & Production '!B29*'NAICS Data-Base'!$G$64)+('Energy & Production '!D29*'NAICS Data-Base'!$G$65)+('Energy & Production '!F29*'NAICS Data-Base'!$G$66)+('Energy & Production '!H29*'NAICS Data-Base'!$G$67)),\"\")","v":0}]
[null,{"$f":"'Energy & Production '!J30+'Energy & Production '!K30+'Energy & Production '!L30","v":0},{"$f":"IFERROR((('Energy & Production '!B30*'NAICS Data-Base'!$G$64)+('Energy & Production '!D30*'NAICS Data-Base'!$G$65)+('Energy & Production '!F30*'NAICS Data-Base'!$G$66)+('Energy & Production '!H30*'NAICS Data-Base'!$G$67)),\"\")","v":0}]
[null,{"$f":"'Energy & Production '!J31+'Energy & Production '!K31+'Energy & Production '!L31","v":0},{"$f":"IFERROR((('Energy & Production '!B31*'NAICS Data-Base'!$G$64)+('Energy & Production '!D31*'NAICS Data-Base'!$G$65)+('Energy & Production '!F31*'NAICS Data-Base'!$G$66)+('Energy & Production '!H31*'NAICS Data-Base'!$G$67)),\"\")","v":0}]
[]
[]
[]
[]
[]
[]
[]
[]
[]
[]
[]
[]
[]
[null,"Dynamic Charts"]
[null,{"$f":"$B$88","v":"Combined Heat and Power (Cogeneration)"},{"$f":"$B$88","v":"Combined Heat and Power (Cogeneration)"}]
[null,{"$f":"$B$89","v":"Compressed Air"},{"$f":"$B$89","v":"Compressed Air"}]
[null,{"$f":"$B$90","v":"Electrochemical Processes"},{"$f":"$B$90","v":"Electrochemical Processes"},null,null,"# of systems"]
[null,{"$f":"$B$91","v":"Fans and Blowers"},{"$f":"$B$91","v":"Fans and Blowers"},null,"Electricity",{"$f":"IF(ROW('NAICS Data-Base'!$B$253)-ROW('NAICS Data-Base'!$B$240)-COUNTIF('NAICS Data-Base'!C255:C267,\"=0\")=0,2,ROW('NAICS Data-Base'!$B$253)-ROW('NAICS Data-Base'!$B$240)-COUNTIF('NAICS Data-Base'!C255:C267,\"=0\"))","v":2}]
[null,{"$f":"$B$92","v":"Industrial Facilities (Lighting)"},{"$f":"$B$92","v":"Industrial Facilities (Lighting)"},null,"NG",{"$f":"IF(ROW('NAICS Data-Base'!$B$253)-ROW('NAICS Data-Base'!$B$240)-COUNTIF('NAICS Data-Base'!C269:C281,\"=0\")=0,2,ROW('NAICS Data-Base'!$B$253)-ROW('NAICS Data-Base'!$B$240)-COUNTIF('NAICS Data-Base'!C269:C281,\"=0\"))","v":2}]
[null,{"$f":"$B$93","v":"Industrial Facilities (HVAC)"},{"$f":"$B$93","v":"Industrial Facilities (HVAC)"},null,"Steam",{"$f":"IF(ROW('NAICS Data-Base'!$B$253)-ROW('NAICS Data-Base'!$B$240)-COUNTIF('NAICS Data-Base'!C283:C295,\"=0\")=0,2,ROW('NAICS Data-Base'!$B$253)-ROW('NAICS Data-Base'!$B$240)-COUNTIF('NAICS Data-Base'!C283:C295,\"=0\"))","v":2}]
[null,{"$f":"$B$94","v":"Material Handling"},{"$f":"$B$94","v":"Material Handling"},null,"Other Fuel",{"$f":"IF(ROW('NAICS Data-Base'!$B$253)-ROW('NAICS Data-Base'!$B$240)-COUNTIF('NAICS Data-Base'!C297:C309,\"=0\")=0,2,ROW('NAICS Data-Base'!$B$253)-ROW('NAICS Data-Base'!$B$240)-COUNTIF('NAICS Data-Base'!C297:C309,\"=0\"))","v":2}]
[null,{"$f":"$B$95","v":"Material Processing"},{"$f":"$B$95","v":"Material Processing"}]
[null,{"$f":"$B$96","v":"Process Cooling and Refrigeration"},{"$f":"$B$96","v":"Process Cooling and Refrigeration"},null,"Electricity"]
[null,{"$f":"$B$97","v":"Process Heating"},{"$f":"$B$97","v":"Process Heating"},null,"Natural Gas"]
[null,{"$f":"$B$98","v":"Pumps"},{"$f":"$B$98","v":"Pumps"},null,"Steam"]
[null,{"$f":"$B$99","v":"Steam Generation Equipment"},{"$f":"$B$99","v":"Steam Generation Equipment"},null,{"$f":"'Energy & Production '!F10","v":0}]
[null,{"$f":"$B$100","v":"Oth"},"Other Use"]
[null,"Electricity","Sorted by System","Renamed","Usage in Original Units","Potential Savings in Original units"]
[null,{"$f":"IF('NAICS Data-Base'!T88>0,$B241,\"0\")","v":"0"},{"$f":"INDEX($B$255:$B$267,MATCH(D311,$B$311:$B$323,0))","v":"0"},{"$f":"IFERROR(VLOOKUP(C255,$B$241:$C$253,2,FALSE),\"\")","v":""},{"$f":"IFERROR(VLOOKUP(C255,$B$88:$AL$100,29,FALSE),\"\")","v":""},{"$f":"IFERROR(VLOOKUP(C255,$B$88:$AL$100,34,FALSE),\"\")","v":""}]
[null,{"$f":"IF('NAICS Data-Base'!T89>0,$B242,\"0\")","v":"0"},{"$f":"INDEX($B$255:$B$267,MATCH(D312,$B$311:$B$323,0))","v":"0"},{"$f":"IFERROR(VLOOKUP(C256,$B$241:$C$253,2,FALSE),\"\")","v":""},{"$f":"IFERROR(VLOOKUP(C256,$B$88:$AL$100,29,FALSE),\"\")","v":""},{"$f":"IFERROR(VLOOKUP(C256,$B$88:$AL$100,34,FALSE),\"\")","v":""}]
[null,{"$f":"IF('NAICS Data-Base'!T90>0,$B243,\"0\")","v":"0"},"0","","",""]
[null,{"$f":"IF('NAICS Data-Base'!T91>0,$B244,\"0\")","v":"0"},"0","","",""]
[null,{"$f":"IF('NAICS Data-Base'!T92>0,$B245,\"0\")","v":"0"},"0","","",""]
[null,{"$f":"IF('NAICS Data-Base'!T93>0,$B246,\"0\")","v":"0"},"0","","",""]
[null,{"$f":"IF('NAICS Data-Base'!T94>0,$B247,\"0\")","v":"0"},"0","","",""]
[null,{"$f":"IF('NAICS Data-Base'!T95>0,$B248,\"0\")","v":"0"},"0","","",""]
[null,{"$f":"IF('NAICS Data-Base'!T96>0,$B249,\"0\")","v":"0"},"0","","",""]
[null,{"$f":"IF('NAICS Data-Base'!T97>0,$B250,\"0\")","v":"0"},"0","","",""]
[null,{"$f":"IF('NAICS Data-Base'!T98>0,$B251,\"0\")","v":"0"},"0","","",{"$f":"IFERROR(VLOOKUP(C265,$B$88:$AL$100,34,FALSE),\"\")","v":""}]
[null,{"$f":"IF('NAICS Data-Base'!T99>0,$B252,\"0\")","v":"0"},"0","","",""]
[null,{"$f":"IF('NAICS Data-Base'!T100>0,$B253,\"0\")","v":"0"},"0","","",""]
[null,"NG","Sorted by System","Renamed","Usage in Original Units","Potential Savings in Original units"]
[null,{"$f":"IF('NAICS Data-Base'!U88>0,$B241,0)","v":0},{"$f":"INDEX($B$269:$B$281,MATCH(D325,$B$325:$B$337,0))","v":0},{"$f":"IFERROR(VLOOKUP(C269,$B$241:$C$253,2,FALSE),\"\")","v":""},{"$f":"IFERROR(VLOOKUP(C269,$B$88:$AL$100,30,FALSE),\"\")","v":""},{"$f":"IFERROR(VLOOKUP(C269,$B$88:$AL$100,35,FALSE),\"\")","v":""}]
[null,{"$f":"IF('NAICS Data-Base'!U89>0,$B242,0)","v":0},{"$f":"INDEX($B$269:$B$281,MATCH(D326,$B$325:$B$337,0))","v":0},{"$f":"IFERROR(VLOOKUP(C270,$B$241:$C$253,2,FALSE),\"\")","v":""},{"$f":"IFERROR(VLOOKUP(C270,$B$88:$AL$100,30,FALSE),\"\")","v":""},{"$f":"IFERROR(VLOOKUP(C270,$B$88:$AL$100,35,FALSE),\"\")","v":""}]
[null,{"$f":"IF('NAICS Data-Base'!U90>0,$B243,0)","v":0},0,"","",""]
[null,{"$f":"IF('NAICS Data-Base'!U91>0,$B244,0)","v":0},0,"","",""]
[null,{"$f":"IF('NAICS Data-Base'!U92>0,$B245,0)","v":0},0,"","",""]
[null,{"$f":"IF('NAICS Data-Base'!U93>0,$B246,0)","v":0},0,"","",""]
[null,{"$f":"IF('NAICS Data-Base'!U94>0,$B247,0)","v":0},0,"","",""]
[null,{"$f":"IF('NAICS Data-Base'!U95>0,$B248,0)","v":0},0,"","",""]
[null,{"$f":"IF('NAICS Data-Base'!U96>0,$B249,0)","v":0},0,"","",""]
[null,{"$f":"IF('NAICS Data-Base'!U97>0,$B250,0)","v":0},0,"","",""]
[null,{"$f":"IF('NAICS Data-Base'!U98>0,$B251,0)","v":0},0,"","",""]
[null,{"$f":"IF('NAICS Data-Base'!U99>0,$B252,0)","v":0},0,"","",""]
[null,{"$f":"IF('NAICS Data-Base'!U100>0,$B253,0)","v":0},0,"","",""]
[null,"Steam","Sorted by System","Renamed","Usage in Original Units","Potential Savings in Original units"]
[null,{"$f":"IF('NAICS Data-Base'!V88>0,$B241,0)","v":0},{"$f":"INDEX($B$283:$B$295,MATCH(D339,$B$339:$B$351,0))","v":0},{"$f":"IFERROR(VLOOKUP(C283,$B$241:$C$253,2,FALSE),\"\")","v":""},{"$f":"IFERROR(VLOOKUP(C283,$B$88:$AL$100,31,FALSE),\"\")","v":""},{"$f":"IFERROR(VLOOKUP(C283,$B$88:$AL$100,36,FALSE),\"\")","v":""}]
[null,{"$f":"IF('NAICS Data-Base'!V89>0,$B242,0)","v":0},{"$f":"INDEX($B$283:$B$295,MATCH(D340,$B$339:$B$351,0))","v":0},{"$f":"IFERROR(VLOOKUP(C284,$B$241:$C$253,2,FALSE),\"\")","v":""},{"$f":"IFERROR(VLOOKUP(C284,$B$88:$AL$100,31,FALSE),\"\")","v":""},{"$f":"IFERROR(VLOOKUP(C284,$B$88:$AL$100,36,FALSE),\"\")","v":""}]
[null,{"$f":"IF('NAICS Data-Base'!V90>0,$B243,0)","v":0},0,"","",""]
[null,{"$f":"IF('NAICS Data-Base'!V91>0,$B244,0)","v":0},0,"","",""]
[null,{"$f":"IF('NAICS Data-Base'!V92>0,$B245,0)","v":0},0,"","",""]
[null,{"$f":"IF('NAICS Data-Base'!V93>0,$B246,0)","v":0},0,"","",""]
[null,{"$f":"IF('NAICS Data-Base'!V94>0,$B247,0)","v":0},0,"","",""]
[null,{"$f":"IF('NAICS Data-Base'!V95>0,$B248,0)","v":0},0,"","",""]
[null,{"$f":"IF('NAICS Data-Base'!V96>0,$B249,0)","v":0},0,"","",""]
[null,{"$f":"IF('NAICS Data-Base'!V97>0,$B250,0)","v":0},0,"","",""]
[null,{"$f":"IF('NAICS Data-Base'!V98>0,$B251,0)","v":0},0,"","",""]
[null,{"$f":"IF('NAICS Data-Base'!V99>0,$B252,0)","v":0},0,"","",""]
[null,{"$f":"IF('NAICS Data-Base'!V100>0,$B253,0)","v":0},0,"","",""]
[null,"Other Fuel","Sorted by System","Renamed","Usage in Original Units","Potential Savings in Original units"]
[null,{"$f":"IF('NAICS Data-Base'!W88>0,$B241,0)","v":0},{"$f":"INDEX($B$297:$B$309,MATCH(D353,$B$353:$B$365,0))","v":0},{"$f":"IFERROR(VLOOKUP(C297,$B$241:$C$253,2,FALSE),\"\")","v":""},{"$f":"IFERROR(VLOOKUP(C297,$B$88:$AL$100,32,FALSE),\"\")","v":""},{"$f":"IFERROR(VLOOKUP(C297,$B$88:$AL$100,37,FALSE),\"\")","v":""}]
[null,{"$f":"IF('NAICS Data-Base'!W89>0,$B242,0)","v":0},{"$f":"INDEX($B$297:$B$309,MATCH(D354,$B$353:$B$365,0))","v":0},{"$f":"IFERROR(VLOOKUP(C298,$B$241:$C$253,2,FALSE),\"\")","v":""},{"$f":"IFERROR(VLOOKUP(C298,$B$88:$AL$100,32,FALSE),\"\")","v":""},{"$f":"IFERROR(VLOOKUP(C298,$B$88:$AL$100,37,FALSE),\"\")","v":""}]
[null,{"$f":"IF('NAICS Data-Base'!W90>0,$B243,0)","v":0},0,"","",""]
[null,{"$f":"IF('NAICS Data-Base'!W91>0,$B244,0)","v":0},0,"","",""]
[null,{"$f":"IF('NAICS Data-Base'!W92>0,$B245,0)","v":0},0,"","",""]
[null,{"$f":"IF('NAICS Data-Base'!W93>0,$B246,0)","v":0},0,"","",""]
[null,{"$f":"IF('NAICS Data-Base'!W94>0,$B247,0)","v":0},0,"","",""]
[null,{"$f":"IF('NAICS Data-Base'!W95>0,$B248,0)","v":0},0,"","",""]
[null,{"$f":"IF('NAICS Data-Base'!W96>0,$B249,0)","v":0},0,"","",""]
[null,{"$f":"IF('NAICS Data-Base'!W97>0,$B250,0)","v":0},0,"","",""]
[null,{"$f":"IF('NAICS Data-Base'!W98>0,$B251,0)","v":0},0,"","",""]
[null,{"$f":"IF('NAICS Data-Base'!W99>0,$B252,0)","v":0},0,"","",""]
[null,{"$f":"IF('NAICS Data-Base'!W100>0,$B253,0)","v":0},0,"","",""]
[]
[null,{"$f":"LEN(B255)","v":1},1,{"$f":"LARGE($B$311:$B$323,C311)","v":1}]
[null,1,2,{"$f":"LARGE($B$311:$B$323,C312)","v":1}]
[null,1,3,1]
[null,1,4,1]
[null,1,5,1]
[null,1,6,1]
[null,1,7,1]
[null,1,8,1]
[null,1,9,1]
[null,1,10,1]
[null,1,11,1]
[null,1,12,1]
[null,1,13,1]
[]
[null,{"$f":"LEN(B269)","v":1},1,{"$f":"LARGE($B$325:$B$337,C325)","v":1}]
[null,1,2,{"$f":"LARGE($B$325:$B$337,C326)","v":1}]
[null,1,3,1]
[null,1,4,1]
[null,1,5,1]
[null,1,6,1]
[null,1,7,1]
[null,1,8,1]
[null,1,9,1]
[null,1,10,1]
[null,1,11,1]
[null,1,12,1]
[null,1,13,1]
[]
[null,{"$f":"LEN(B283)","v":1},1,{"$f":"LARGE($B$339:$B$351,C339)","v":1}]
[null,1,2,{"$f":"LARGE($B$339:$B$351,C340)","v":1}]
[null,1,3,1]
[null,1,4,1]
[null,1,5,1]
[null,1,6,1]
[null,1,7,1]
[null,1,8,1]
[null,1,9,1]
[null,1,10,1]
[null,1,11,1]
[null,1,12,1]
[null,1,13,1]
[]
[null,{"$f":"LEN(B297)","v":1},1,{"$f":"LARGE($B$353:$B$365,C353)","v":1}]
[null,1,2,{"$f":"LARGE($B$353:$B$365,C354)","v":1}]
[null,1,3,1]
[null,1,4,1]
[null,1,5,1]
[null,1,6,1]
[null,1,7,1]
[null,1,8,1]
[null,1,9,1]
[null,1,10,1]
[null,1,11,1]
[null,1,12,1]
[null,1,13,1]
[null,null,null,null,"English",0]
[null,"Number of fuels",{"$f":"IF(COUNTIF(Results!E18:E21,\">0\")>2,COUNTIF(Results!E18:E21,\">0\"),2)","v":2},null,"Russian",1]
[null,"Language",{"$f":"VLOOKUP(Disclaimer!C2,E366:F368,2,FALSE)","v":0},null,"Ukrainian",2]
[]
[null,"English",{"$f":"E367","v":"Russian"},{"$f":"E368","v":"Ukrainian"},"Energy Usage","Savings","Cost"]
[null,{"$f":"IF(E376=B384,\"Electricity\",IF(E376=C384,\"Natural Gas\",IF(E376=D384,\"Steam\",B379)))","v":"Electricity"},{"$f":"VLOOKUP(B371,'Translation '!$B$844:$D$860,2,FALSE)","v":"Electricity"},{"$f":"VLOOKUP(B371,'Translation '!$B$844:$D$860,2,FALSE)","v":"Electricity"},{"$f":"IFERROR(VLOOKUP(B371,$T$76:$X$79,2,FALSE),\"\")","v":false},{"$f":"IFERROR(VLOOKUP(B371,$T$76:$X$79,3,FALSE),\"\")","v":0},{"$f":"IFERROR(VLOOKUP(B371,Results!$B$18:$G$21,6,FALSE),\"\")","v":""}]
[null,{"$f":"IF(E377=C384,\"Natural Gas\",IF(E377=D384,\"Steam\",B379))","v":"Natural Gas"},{"$f":"VLOOKUP(B372,'Translation '!$B$844:$D$860,2,FALSE)","v":"Натуральный газ"},{"$f":"VLOOKUP(B372,'Translation '!$B$844:$D$860,2,FALSE)","v":"Натуральный газ"},{"$f":"IFERROR(VLOOKUP(B372,$T$76:$X$79,2,FALSE),\"\")","v":false},{"$f":"IFERROR(VLOOKUP(B372,$T$76:$X$79,3,FALSE),\"\")","v":0},{"$f":"IFERROR(VLOOKUP(B372,Results!$B$18:$G$21,6,FALSE),\"\")","v":""}]
[null,{"$f":"IF(E378=D384,\"Steam\",B379)","v":"Steam"},{"$f":"VLOOKUP(B373,'Translation '!$B$844:$D$860,2,FALSE)","v":"Steam"},{"$f":"VLOOKUP(B373,'Translation '!$B$844:$D$860,2,FALSE)","v":"Steam"},false,"",{"$f":"IFERROR(VLOOKUP(B373,Results!$B$18:$G$21,6,FALSE),\"\")","v":""}]
[{"$f":"'Energy & Production '!F10","v":0},{"$f":"IF(E379=1,\"\",B379)","v":""},{"$f":"IFERROR(VLOOKUP(B374,'Translation '!$B$844:$D$860,2,FALSE),\"\")","v":""},{"$f":"IFERROR(VLOOKUP(B374,'Translation '!$B$844:$D$860,2,FALSE),\"\")","v":""},"","",{"$f":"IFERROR(VLOOKUP(B374,Results!$B$18:$G$21,6,FALSE),\"\")","v":""}]
[]
[null,{"$f":"IF(Results!E18>0,B382,0)","v":"Electricity_makingitthelargeststring"},{"$f":"LEN(B376)","v":36},1,{"$f":"LARGE($C$376:$C$379,D376)","v":36}]
[null,{"$f":"IF(Results!E19>0,C382,0)","v":"Natural Gas_secondlargeststring"},{"$f":"LEN(B377)","v":31},2,{"$f":"LARGE($C$376:$C$379,D377)","v":31}]
[null,{"$f":"IF(Results!E20>0,D382,0)","v":"steam_thirdlargeststring"},{"$f":"LEN(B378)","v":24},3,{"$f":"LARGE($C$376:$C$379,D378)","v":24}]
[null,{"$f":"IF(A374=0,\"\",A374)","v":""},{"$f":"LEN(B379)","v":0},4,{"$f":"LARGE($C$376:$C$379,D379)","v":0}]
[]
[null,"Largest names Other fuel",{"$f":"LEN(Conversions!K68)","v":22}]
[null,"Electricity_makingitthelargeststring","Natural Gas_secondlargeststring","steam_thirdlargeststring"]
[]
[null,{"$f":"LEN(B382)","v":36},{"$f":"LEN(C382)","v":31},{"$f":"LEN(D382)","v":24}]

{"sheet":"Conversions","index":19,"n_rows":97,"n_cols":23,"rows_kept":97,"cut":false,"hidden":true,"merged":[]}
[]
[null,null,null,"Input Units\\ Output Units",null,"MBTU","MMBTU","kWh","MWh","GWh","kJ","MJ","GJ","TJ","Therms","DTh","kCal","Gcal ","Tonne of Oil Equivalent",null,"Default Heating Values"]
[null,"Energy Unit",null,"MBTU",{"$f":"CONCATENATE(B3,C3,D3)","v":"Energy UnitMBTU"},{"$f":"G3*1/$G$3","v":1},{"$f":"G4/1000","v":1E-3},{"$f":"G3*1/$G$5","v":0.29307103866134526},{"$f":"$G3*1/$G$6","v":2.9307103866134528E-4},{"$f":"$G3*1/$G$7","v":2.930710386613453E-7},{"$f":"$G3*1/$G$8","v":1055.0558752316244},{"$f":"$G3*1/$G$9","v":1.0550558752316244},{"$f":"$G3*1/$G$10","v":1.0550558752316244E-3},{"$f":"$G3*1/$G$11","v":1.0550558752316243E-6},{"$f":"$G3*1/$G$12","v":0.01},{"$f":"$G3*1/$G$13","v":1E-3},{"$f":"$G3*1/$G$14","v":251.99574328790442},{"$f":"$G3*1/$G$15","v":2.519957432879044E-4},{"$f":"$G3*1/$G$16","v":2.5193549443600461E-5},null,"MMBTU/Gallon"]
[null,"Energy Unit",null,"MMBTU",{"$f":"CONCATENATE(B4,C4,D4)","v":"Energy UnitMMBTU"},{"$f":"G4*1/$G$3","v":1000},1,{"$f":"G4*1/$G$5","v":293.07103866134526},0.29307103866134532,2.9307103866134528E-4,1055055.8752316243,1055.0558752316244,1.0550558752316244,1.0550558752316244E-3,10,1,251995.74328790439,0.25199574328790436,2.5193549443600458E-2,null,"LNG",8.5999999999999993E-2]
[null,"Energy Unit",null,"kWh","Energy UnitkWh",3.4121419999999998,{"$f":"G6/1000","v":3.412142E-3},{"$f":"G5*1/$G$5","v":1},1E-3,9.9999999999999995E-7,3600.0004642245854,3.6000004642245855,3.6000004642245853E-3,3.6000004642245851E-6,3.412142E-2,3.412142E-3,859.84525949387671,8.5984525949387661E-4,8.5963968185585757E-5,null,"Propane ",9.1689999999999994E-2]
[null,"Energy Unit",null,"MWh","Energy UnitMWh",3412.1419999999998,3.4121419999999998,{"$f":"G6*1/$G$5","v":1000},{"$f":"$G6*1/$G$6","v":1},1E-3,3600000.4642245853,3600.0004642245854,3.6000004642245851,3.6000004642245849E-3,34.121419999999993,3.4121419999999998,859845.2594938766,0.85984525949387658,8.5963968185585757E-2,null,"Butane",0.102032]
[null,"Energy Unit",null,"GWh","Energy UnitGWh",3412141.9999999995,{"$f":"G6*1000","v":3412.1419999999998},1000000,1000,{"$f":"$G7*1/$G$7","v":1},3600000464.2245851,3600000.4642245853,3600.0004642245849,3.6000004642245851,34121.42,3412.1419999999998,859845259.4938767,859.8452594938766,85.963968185585756,null,"#1 Fuel Oil",0.13739999999999999]
[null,"Energy Unit",null,"kJ","Energy UnitkJ",9.4781709999999992E-4,{"$f":"G9/1000","v":9.4781709999999994E-7},2.7777774195798414E-4,2.7777774195798415E-7,2.7777774195798413E-10,{"$f":"$G8*1/$G$8","v":1},1E-3,9.9999999999999995E-7,9.9999999999999986E-10,9.4781709999999991E-6,9.4781709999999994E-7,0.23884587461548601,2.3884587461548597E-7,2.3878876972339999E-8,null,"#2 Fuel Oil",0.1396]
[null,"Energy Unit",null,"MJ","Energy UnitMJ",0.94781709999999986,{"$f":"G10/1000","v":9.4781709999999992E-4},0.27777774195798416,2.7777774195798414E-4,2.7777774195798415E-7,1000,{"$f":"$G9*1/$G$9","v":1},1E-3,9.9999999999999995E-7,9.4781709999999988E-3,9.4781709999999992E-4,238.845874615486,2.3884587461548597E-4,2.387887697234E-5,null,"#4 Fuel Oil",0.14510000000000001]
[null,"Energy Unit",null,"GJ","Energy UnitGJ",947.81709999999998,{"$f":"G11/1000","v":0.94781709999999997},277.77774195798418,0.27777774195798416,2.7777774195798419E-4,1000000,1000,{"$f":"$G10*1/$G$10","v":1},1E-3,9.4781709999999997,0.94781709999999997,238845.87461548601,0.23884587461548598,2.387887697234E-2,null,"#5 Fuel Oil",0.14879999999999999]
[null,"Energy Unit",null,"TJ","Energy UnitTJ",947817.1,947.81709999999998,277777.74195798417,277.77774195798418,0.27777774195798416,1000000000,1000000.0000000001,1000,{"$f":"$G11*1/$G$11","v":1},9478.1709999999985,947.81709999999998,238845874.615486,238.845874615486,23.878876972339999,null,"#6 Fuel Oil (Low Sulfur)",0.15240000000000001]
[null,"Energy Unit",null,"Therms","Energy UnitTherms",100,0.1,29.307103866134529,2.930710386613453E-2,2.930710386613453E-5,105505.58752316245,105.50558752316245,0.10550558752316244,1.0550558752316245E-4,{"$f":"$G12*1/$G$12","v":1},0.1,25199.574328790441,2.5199574328790438E-2,2.519354944360046E-3,null,"#6 Fuel Oil (High Sulfur)",0.14899999999999999]
[null,"Energy Unit",null,"DTh","Energy UnitDTh",1000,1,293.07103866134526,0.29307103866134532,2.9307103866134528E-4,1055055.8752316243,1055.0558752316244,1.0550558752316244,1.0550558752316244E-3,10,{"$f":"$G13*1/$G$13","v":1},251995.74328790439,0.25199574328790436,2.5193549443600458E-2,null,"Gasoline ",0.12759999999999999]
[null,"Energy Unit",null,"kCal","Energy UnitkCal",3.9683209999999995E-3,{"$f":"G15/10^6","v":3.9683209999999997E-6},1.1629999572116284E-3,1.1629999572116283E-6,1.1629999572116284E-9,4.1868003858550349,4.1868003858550346E-3,4.1868003858550343E-6,4.1868003858550343E-9,3.9683209999999994E-5,3.9683209999999997E-6,{"$f":"$G14*1/$G$14","v":1},9.9999999999999995E-7,9.9976091321578011E-8,null,"Kerosene",0.1351]
[null,"Energy Unit",null,"Gcal ","Energy UnitGcal ",3968.3209999999999,3.968321,1162.9999572116283,1.1629999572116285,1.1629999572116284E-3,4186800.3858550349,4186.8003858550346,4.1868003858550349,4.1868003858550346E-3,39.683209999999995,3.968321,1000000.0000000001,{"$f":"$G15*1/$G$15","v":1},9.9976091321578017E-2]
[null,"Energy Unit",null,"Tonne of Oil Equivalent","Energy UnitTonne of Oil Equivalent",39692.700000000004,39.692700000000002,11632.78081627318,11.632780816273181,1.1632780816273182E-2,41878016.338806301,41878.016338806301,41.878016338806297,4.18780163388063E-2,396.92700000000002,39.692700000000002,10002391.439603804,{"$f":"$G16*1/$G$15","v":10.002391439603803},{"$f":"$G16*1/$G$16","v":1},null,"MMBTU/Short Ton"]
[null,"Volumetric Unit","Natural Gas","SCF","Volumetric UnitNatural GasSCF",1.0269999999999999,1.0269999999999999E-3,0.30098395670520156,{"$f":"$G17*1/$G$6","v":3.0098395670520161E-4},{"$f":"$G17*1/$G$7","v":3.0098395670520161E-7},{"$f":"$G17*1/$G$8","v":1083.5423838628781},{"$f":"$G17*1/$G$9","v":1.0835423838628782},{"$f":"$G17*1/$G$10","v":1.0835423838628782E-3},{"$f":"$G17*1/$G$11","v":1.0835423838628782E-6},{"$f":"$G17*1/$G$12","v":1.0269999999999998E-2},{"$f":"$G17*1/$G$13","v":1.0269999999999999E-3},{"$f":"$G17*1/$G$14","v":258.79962835667777},{"$f":"$G17*1/$G$15","v":2.5879962835667777E-4},2.5873775278577669E-5,null,"Coke ",26]
[null,"Volumetric Unit","Natural Gas","CCF","Volumetric UnitNatural GasCCF",102.7,0.1027,30.098395670520162,{"$f":"$G18*1/$G$6","v":3.009839567052016E-2},{"$f":"$G18*1/$G$7","v":3.0098395670520161E-5},{"$f":"$G18*1/$G$8","v":108354.23838628782},{"$f":"$G18*1/$G$9","v":108.35423838628783},{"$f":"$G18*1/$G$10","v":0.10835423838628783},{"$f":"$G18*1/$G$11","v":1.0835423838628781E-4},{"$f":"$G18*1/$G$12","v":1.0269999999999999},{"$f":"$G18*1/$G$13","v":0.1027},{"$f":"$G18*1/$G$14","v":25879.962835667782},{"$f":"$G18*1/$G$15","v":2.5879962835667781E-2},2.5873775278577671E-3,null,"Wood",16]
[null,"Volumetric Unit","Natural Gas","MCF","Volumetric UnitNatural GasMCF",1027,1.0269999999999999,300.98395670520159,0.30098395670520162,3.0098395670520161E-4,1083542.3838628782,1083.5423838628783,1.0835423838628782,1.0835423838628782E-3,10.269999999999998,1.0269999999999999,258799.6283566778,0.2587996283566778,2.587377527857767E-2]
[null,"Volumetric Unit","Natural Gas","M^3","Volumetric UnitNatural GasM^3",362.6816609,0.36268166089999998,106.29149106338481,0.10629149106338481,1.0629149106338482E-4,382649.41717130871,382.6494171713087,0.38264941717130868,3.8264941717130866E-4,3.6268166089999996,0.36268166089999998,91394.234715387196,9.1394234715387185E-2,9.1372383561712841E-3,null,"Conversation Factors"]
[null,"Volumetric Unit","Propane","SCF","Volumetric UnitPropaneSCF",2.516,2.516E-3,0.73736673327194469,7.3736673327194472E-4,7.3736673327194474E-7,2654.5205820827669,2.6545205820827671,2.654520582082767E-3,2.6545205820827671E-6,2.5159999999999998E-2,2.516E-3,634.02129011236752,6.3402129011236742E-4,6.3386970400098756E-5,null,"1 BBL",42,"gallon"]
[null,"Volumetric Unit","Propane","CCF","Volumetric UnitPropaneCCF",251.60000000000005,{"$f":"G18/G17*G21","v":0.25160000000000005},73.736673327194481,7.3736673327194496E-2,7.3736673327194483E-5,265452.05820827675,265.45205820827675,0.26545205820827672,2.6545205820827675E-4,2.5160000000000005,0.25160000000000005,63402.129011236757,6.3402129011236749E-2,6.3386970400098764E-3,null,"1 lbs",{"$f":"1/2000","v":5.0000000000000001E-4},"Short ton"]
[null,"Volumetric Unit","Propane","MCF","Volumetric UnitPropaneMCF",2516,{"$f":"G19/G17*G21","v":2.516},737.36673327194478,0.7373667332719448,7.3736673327194472E-4,2654520.582082767,2654.5205820827669,2.6545205820827671,2.654520582082767E-3,25.16,2.516,634021.29011236748,0.63402129011236741,6.338697040009876E-2,null,"1 kg",{"$f":"1/907.18474","v":1.1023113109243879E-3},"Short ton"]
[null,"Volumetric Unit","Propane","M^3","Volumetric UnitPropaneM^3",888.51709720000008,{"$f":"G20/G17*G21","v":0.88851709720000005},260.39862854476752,0.26039862854476753,2.6039862854476751E-4,937435.18364460836,937.4351836446084,0.93743518364460832,9.3743518364460834E-4,8.8851709719999992,0.88851709720000005,223902.52633292522,0.22390252633292521,2.2384899419792558E-2,null,"1 long Ton",{"$f":"1/0.892857","v":1.1200001792000287},"Short ton"]
[null,"Volumetric Unit",{"$f":"D68","v":"Butane"},"SCF","Volumetric UnitButaneSCF",3.28,3.2799999999999999E-3,0.96127300680921246,9.612730068092126E-4,9.6127300680921264E-7,3460.5832707597278,3.4605832707597282,3.4605832707597277E-3,3.4605832707597276E-6,3.2799999999999996E-2,3.2799999999999999E-3,826.5460379843264,8.2654603798432635E-4,8.2634842175009508E-5,null,"1 metric Ton",{"$f":"1/V23/1000","v":0.90718474000000004},"Short ton"]
[null,"Volumetric Unit",{"$f":"D68","v":"Butane"},"CCF","Volumetric UnitButaneCCF",328,{"$f":"G22/G21*G25","v":0.32800000000000001},96.127300680921252,9.6127300680921263E-2,9.6127300680921265E-5,346058.3270759728,346.05832707597284,0.34605832707597278,3.460583270759728E-4,3.28,0.32800000000000001,82654.603798432639,8.2654603798432646E-2,8.263484217500951E-3]
[null,"Volumetric Unit",{"$f":"D68","v":"Butane"},"MCF","Volumetric UnitButaneMCF",3279.9999999999995,{"$f":"G23/G21*G25","v":3.28},961.27300680921246,0.96127300680921246,9.6127300680921249E-4,3460583.2707597278,3460.5832707597278,3.4605832707597277,3.4605832707597277E-3,32.799999999999997,3.28,826546.03798432637,0.82654603798432635,8.2634842175009507E-2]
[null,"Volumetric Unit",{"$f":"D68","v":"Butane"},"M^3","Volumetric UnitButaneM^3",1158.3211760000002,{"$f":"G24/G21*G25","v":1.1583211760000001},339.47039015375094,0.33947039015375097,3.3947039015375097E-4,1222093.5621440045,1222.0935621440046,1.2220935621440046,1.2220935621440044E-3,11.583211759999999,1.1583211760000001,291892.00571223954,0.2918920057122395,2.9182221819125432E-2]
[null,"Volumetric Unit","LNG","Gallon","Volumetric UnitLNGGallon",85.999999999999986,8.5999999999999993E-2,25.204109324875692,2.5204109324875695E-2,2.5204109324875692E-5,90734.805269919685,90.73480526991969,9.0734805269919686E-2,9.0734805269919691E-5,0.85999999999999988,8.5999999999999993E-2,21671.633922759778,2.1671633922759774E-2,2.1666452521496393E-3,null,"MBTU","Energy Unit"]
[null,"Volumetric Unit","LNG","BBL","Volumetric UnitLNGBBL",3611.9999999999995,{"$f":"G29*$V$21","v":3.6119999999999997},1058.5725916447791,1.058572591644779,1.0585725916447792E-3,3810861.821336627,3810.8618213366271,3.8108618213366268,3.8108618213366268E-3,36.119999999999997,3.6119999999999997,910208.6247559106,0.91020862475591058,9.0999100590284848E-2,null,"MMBTU","Energy Unit"]
[null,"Volumetric Unit","Propane","Gallon","Volumetric UnitPropaneGallon",91.69,9.1689999999999994E-2,26.871683534858747,2.6871683534858748E-2,2.6871683534858747E-5,96738.07319998763,96.738073199987639,9.6738073199987631E-2,9.6738073199987624E-5,0.91689999999999994,9.1689999999999994E-2,23105.489702067953,2.3105489702067952E-2,2.3099965484837258E-3,null,"kWh","Energy Unit"]
[null,"Volumetric Unit","Propane","BBL","Volumetric UnitPropaneBBL",3850.9799999999996,{"$f":"G31*$V$21","v":3.8509799999999998},1128.6107084640673,1.1286107084640675,1.1286107084640675E-3,4062999.0743994806,4062.9990743994808,4.0629990743994808,4.0629990743994808E-3,38.509799999999998,3.8509799999999998,970430.56748685404,0.97043056748685397,9.7019855036316494E-2,null,"MWh","Energy Unit"]
[null,"Volumetric Unit",{"$f":"D68","v":"Butane"},"Gallon","Volumetric UnitButaneGallon",102.032,0.102032,29.902624216694381,2.9902624216694384E-2,2.9902624216694382E-5,107649.4610616331,107.6494610616331,0.10764946106163309,1.076494610616331E-4,1.0203199999999999,0.102032,25711.629679151461,2.571162967915146E-2,2.5705482368294421E-3,null,"GWh","Energy Unit"]
[null,"Volumetric Unit",{"$f":"D68","v":"Butane"},"BBL","Volumetric UnitButaneBBL",4285.3440000000001,{"$f":"G33*$V$21","v":4.2853440000000003},1255.9102171011641,1.2559102171011642,1.2559102171011641E-3,4521277.3645885903,4521.2773645885909,4.52127736458859,4.52127736458859E-3,42.853439999999999,4.2853440000000003,1079888.4465243614,1.0798884465243614,0.10796302594683657,null,"kJ","Energy Unit"]
[null,"Volumetric Unit","Fuel_Oil_1","Gallon","Volumetric UnitFuel_Oil_1Gallon",137.4,0.13739999999999999,40.267960712068842,4.026796071206884E-2,4.0267960712068844E-5,144964.67725682518,144.96467725682518,0.14496467725682519,1.4496467725682517E-4,1.3739999999999999,0.13739999999999999,34624.215127758063,3.4624215127758061E-2,3.4615936935507028E-3,null,"MJ","Energy Unit"]
[null,"Volumetric Unit","Fuel_Oil_1","BBL","Volumetric UnitFuel_Oil_1BBL",5770.7999999999993,{"$f":"G35*$V$21","v":5.7707999999999995},1691.2543499068911,1.6912543499068913,1.6912543499068913E-3,6088516.4447866576,6088.5164447866573,6.0885164447866575,6.0885164447866576E-3,57.707999999999991,5.7707999999999995,1454217.0353658386,1.4542170353658386,0.14538693512912951,null,"GJ","Energy Unit"]
[null,"Volumetric Unit","Fuel_Oil_2","Gallon","Volumetric UnitFuel_Oil_2Gallon",139.6,0.1396,40.912716997123802,4.0912716997123802E-2,4.0912716997123807E-5,147285.80018233476,147.28580018233478,0.14728580018233475,1.4728580018233476E-4,1.3959999999999999,0.1396,35178.605762991458,3.5178605762991449E-2,3.517019502326624E-3,null,"TJ","Energy Unit"]
[null,"Volumetric Unit","Fuel_Oil_2","BBL","Volumetric UnitFuel_Oil_2BBL",5863.2,{"$f":"G37*$V$21","v":5.8632},1718.3341138791995,1.7183341138791997,1.7183341138791997E-3,6186003.6076580603,6186.00360765806,6.1860036076580602,6.18600360765806E-3,58.631999999999998,5.8632,1477501.4420456411,1.4775014420456409,0.14771481909771822,null,"Therms","Energy Unit"]
[null,"Volumetric Unit","Fuel_Oil_4","Gallon","Volumetric UnitFuel_Oil_4Gallon",145.1,0.14510000000000001,42.524607709761206,4.2524607709761207E-2,4.2524607709761204E-5,153088.60749610871,153.08860749610872,0.1530886074961087,1.5308860749610871E-4,1.4510000000000001,0.14510000000000001,36564.582351074932,3.6564582351074924E-2,3.6555840242664269E-3,null,"DTh","Energy Unit"]
[null,"Volumetric Unit","Fuel_Oil_4","BBL","Volumetric UnitFuel_Oil_4BBL",6094.2000000000007,{"$f":"G39*$V$21","v":6.0942000000000007},1786.0335238099706,1.7860335238099707,1.7860335238099707E-3,6429721.5148365665,6429.7215148365667,6.4297215148365661,6.429721514836566E-3,60.942000000000007,6.0942000000000007,1535712.4587451471,1.5357124587451472,0.15353452901918993,null,"kCal","Energy Unit"]
[null,"Volumetric Unit","Fuel_Oil_5","Gallon","Volumetric UnitFuel_Oil_5Gallon",148.79999999999998,0.14879999999999999,43.608970552808174,4.3608970552808178E-2,4.3608970552808179E-5,156992.31423446571,156.99231423446571,0.15699231423446569,1.5699231423446568E-4,1.4879999999999998,0.14879999999999999,37496.966601240172,3.7496966601240168E-2,3.7488001572077482E-3,null,"Gcal ","Energy Unit"]
[null,"Volumetric Unit","Fuel_Oil_5","BBL","Volumetric UnitFuel_Oil_5BBL",6249.5999999999995,{"$f":"G41*$V$21","v":6.2495999999999992},1831.5767632179432,1.8315767632179434,1.8315767632179434E-3,6593677.1978475591,6593.677197847559,6.5936771978475583,6.5936771978475587E-3,62.495999999999988,6.2495999999999992,1574872.5972520872,1.5748725972520869,0.15744960660272542,null,"Tonne of Oil Equivalent","Energy Unit"]
[null,"Volumetric Unit","Fuel_Oil_6_low_sulfer","Gallon","Volumetric UnitFuel_Oil_6_low_sulferGallon",152.4,0.15240000000000001,44.664026291989025,4.4664026291989026E-2,4.4664026291989024E-5,160790.51538529957,160.79051538529956,0.16079051538529956,1.6079051538529955E-4,1.524,0.15240000000000001,38404.151277076635,3.840415127707663E-2,3.8394969352047101E-3,null,"SCF","Volumetric Unit"]
[null,"Volumetric Unit","Fuel_Oil_6_low_sulfer","BBL","Volumetric UnitFuel_Oil_6_low_sulferBBL",6400.8,{"$f":"G43*$V$21","v":6.4008000000000003},1875.8891042635389,1.8758891042635391,1.8758891042635389E-3,6753201.6461825818,6753.2016461825815,6.7532016461825819,6.7532016461825817E-3,64.007999999999996,6.4008000000000003,1612974.3536372185,1.6129743536372185,0.16125887127859784,null,"CCF","Volumetric Unit"]
[null,"Volumetric Unit","Fuel_Oil_6_high_sulfer","Gallon","Volumetric UnitFuel_Oil_6_high_sulferGallon",149,0.14899999999999999,43.667584760540443,4.3667584760540445E-2,4.3667584760540446E-5,157203.32540951204,157.20332540951202,0.15720332540951201,1.5720332540951202E-4,1.4899999999999998,0.14899999999999999,37547.365749897755,3.7547365749897754E-2,3.7538388670964682E-3,null,"MCF","Volumetric Unit"]
[null,"Volumetric Unit","Fuel_Oil_6_high_sulfer","BBL","Volumetric UnitFuel_Oil_6_high_sulferBBL",6258,{"$f":"G45*$V$21","v":6.258},1834.0385599426988,1.8340385599426989,1.8340385599426988E-3,6602539.6671995055,6602.5396671995059,6.6025396671995056,6.602539667199505E-3,62.58,6.258,1576989.3614957058,1.5769893614957056,0.15766123241805166,null,"M^3","Volumetric Unit"]
[null,"Volumetric Unit",{"$f":"L68","v":"Gasoline"},"Gallon","Volumetric UnitGasolineGallon",127.6,0.12759999999999999,37.395864533187655,3.7395864533187655E-2,3.7395864533187657E-5,134625.12967955528,134.62512967955527,0.13462512967955526,1.3462512967955527E-4,1.2759999999999998,0.12759999999999999,32154.656843536599,3.2154656843536598E-2,3.2146969090034185E-3,null,"BBL","Volumetric Unit"]
[null,"Volumetric Unit",{"$f":"L68","v":"Gasoline"},"BBL","Volumetric UnitGasolineBBL",5359.2,{"$f":"G47*$V$21","v":5.3591999999999995},1570.6263103938816,1.5706263103938816,1.5706263103938815E-3,5654255.4465413205,5654.2554465413214,5.6542554465413204,5.6542554465413208E-3,53.591999999999992,5.3591999999999995,1350495.5874285372,1.3504955874285371,0.13501727017814358,null,"Gallon","Volumetric Unit"]
[null,"Volumetric Unit","Kerosene","Gallon","Volumetric UnitKeroseneGallon",135.1,0.1351,39.59389732314775,3.9593897323147748E-2,3.9593897323147751E-5,142538.04874379246,142.53804874379244,0.14253804874379244,1.4253804874379245E-4,1.351,0.1351,34044.624918195885,3.4044624918195883E-2,3.4036485298304222E-3,null,"Lb","Volumetric Unit"]
[null,"Volumetric Unit","Kerosene","BBL","Volumetric UnitKeroseneBBL",5674.2,{"$f":"G49*$V$21","v":5.6741999999999999},1662.9436875722054,1.6629436875722055,1.6629436875722054E-3,5986598.0472392831,5986.598047239283,5.9865980472392826,5.9865980472392829E-3,56.741999999999997,5.6741999999999999,1429874.2465642272,1.4298742465642271,0.14295323825287773,null,"Short Ton","Volumetric Unit"]
[null,"Volumetric Unit","Coal","Lb","Volumetric UnitCoalLb",14,{"$f":"G52*$V$22","v":1.4E-2},4.102994541258834,4.1029945412588342E-3,4.1029945412588346E-6,14770.782253242742,14.770782253242743,1.4770782253242741E-2,1.4770782253242741E-5,0.13999999999999999,1.4E-2,3527.9404060306615,3.5279404060306616E-3,3.5270969221040644E-4,null,"Long Ton","Volumetric Unit"]
[null,"Volumetric Unit","Coal","Short Ton","Volumetric UnitCoalShort Ton",28000,28,8205.9890825176681,8.205989082517668,8.2059890825176684E-3,29541564.506485485,29541.564506485483,29.541564506485482,2.9541564506485481E-2,280,28,7055880.8120613229,7.0558808120613223,0.70541938442081287,null,"kg","Volumetric Unit"]
[null,"Volumetric Unit","Coal","Long Ton","Volumetric UnitCoalLong Ton",31360.005017600804,{"$f":"G52*$V$24","v":31.360005017600805},9190.7092429332679,9.1907092429332682,9.1907092429332673E-3,33086557.541112952,33086.557541112954,33.086557541112953,3.3086557541112949E-2,313.60005017600804,31.360005017600805,7902587.7739227265,7.9025877739227255,0.79006983696248434,null,"Metric Ton","Volumetric Unit"]
[null,"Volumetric Unit","Coal","kg","Volumetric UnitCoalkg",30.864716705882863,{"$f":"G52*$V$23","v":3.0864716705882863E-2},9.045554582981266,9.0455545829812665E-3,9.0455545829812657E-6,32564.000697901381,32.564000697901385,3.2564000697901385E-2,3.2564000697901381E-5,0.30864716705882861,3.0864716705882863E-2,7777.7772276695523,7.7777772276695521E-3,7.7759176639238098E-4]
[null,"Volumetric Unit","Coal","Metric Ton","Volumetric UnitCoalMetric Ton",25401.172720000002,{"$f":"G52*$V$25","v":25.401172720000002},7444.34807226663,7.4443480722666298,7.4443480722666301E-3,26799656.516009264,26799.656516009265,26.799656516009261,2.6799656516009261E-2,254.0117272,25.401172720000002,6400987.3999608411,6.4009873999608402,0.63994570084675517]
[null,"Volumetric Unit","Coke","Lb","Volumetric UnitCokeLb",13,{"$f":"G57*$V$22","v":1.3000000000000001E-2},3.8099235025974889,3.809923502597489E-3,3.8099235025974891E-6,13715.726378011119,13.715726378011119,1.3715726378011118E-2,1.3715726378011119E-5,0.13,1.3000000000000001E-2,3275.9446627427574,3.2759446627427572E-3,3.27516142766806E-4,null,"Propane (vapor/gas)"]
[null,"Volumetric Unit","Coke","Short Ton","Volumetric UnitCokeShort Ton",26000,26,7619.8470051949771,7.6198470051949778,7.619847005194978E-3,27431452.756022234,27431.452756022234,27.431452756022235,2.7431452756022233E-2,260,26,6551889.3254855145,6.5518893254855142,0.65503228553361192,null,"Butane (vapor/gas)"]
[null,"Volumetric Unit","Coke","Long Ton","Volumetric UnitCokeLong Ton",29120.004659200746,{"$f":"G57*$V$24","v":29.120004659200745},8534.2300112951762,8.5342300112951772,8.5342300112951769E-3,30723232.002462022,30723.232002462024,30.723232002462023,3.072323200246202E-2,291.20004659200742,29.120004659200745,7338117.218642531,7.3381172186425303,0.73363627717944968,null,"LNG"]
[null,"Volumetric Unit","Coke","kg","Volumetric UnitCokekg",28.660094084034085,{"$f":"G57*$V$23","v":2.8660094084034086E-2},8.3994435413397461,8.3994435413397468E-3,8.3994435413397465E-6,30238.000648051282,30.238000648051283,3.023800064805128E-2,3.0238000648051282E-5,0.28660094084034082,2.8660094084034086E-2,7222.221711407441,7.2222217114074408E-3,7.220494973643538E-4,null,"Propane (Liquid)"]
[null,"Volumetric Unit","Coke","Metric Ton","Volumetric UnitCokeMetric Ton",23586.803240000001,{"$f":"G57*$V$25","v":23.586803240000002},6912.6089242475846,6.9126089242475848,6.9126089242475854E-3,24885395.336294316,24885.395336294318,24.885395336294316,2.4885395336294316E-2,235.8680324,23.586803240000002,5943774.0142493518,5.9437740142493514,0.59423529364341554,null,"Butane (Liquid)"]
[null,"Volumetric Unit","Wood","Lb","Volumetric UnitWoodLb",8,{"$f":"G62*$V$22","v":8.0000000000000002E-3},2.3445683092907621,2.3445683092907623E-3,2.3445683092907624E-6,8440.4470018529955,8.4404470018529949,8.4404470018529954E-3,8.4404470018529946E-6,0.08,8.0000000000000002E-3,2015.9659463032353,2.0159659463032352E-3,2.0154839554880369E-4,null,"#1 Fuel Oil"]
[null,"Volumetric Unit","Wood","Short Ton","Volumetric UnitWoodShort Ton",16000,16,4689.1366185815241,4.6891366185815251,4.6891366185815245E-3,16880894.00370599,16880.894003705991,16.88089400370599,1.6880894003705991E-2,160,16,4031931.8926064703,4.0319318926064698,0.40309679109760732,null,"#2 Fuel Oil"]
[null,"Volumetric Unit","Wood","Long Ton","Volumetric UnitWoodLong Ton",17920.002867200459,{"$f":"G62*$V$24","v":17.920002867200459},5251.8338531047239,5.2518338531047242,5.251833853104724E-3,18906604.309207398,18906.6043092074,18.906604309207399,1.89066043092074E-2,179.20002867200458,17.920002867200459,4515764.4422415579,4.515764442241557,0.45146847826427677,null,"#4 Fuel Oil"]
[null,"Volumetric Unit","Wood","kg","Volumetric UnitWoodkg",17.636980974790205,{"$f":"G62*$V$23","v":1.7636980974790207E-2},5.168888333132152,5.168888333132152E-3,5.1688883331321521E-6,18608.000398800788,18.60800039880079,1.8608000398800791E-2,1.860800039880079E-5,0.17636980974790206,1.7636980974790207E-2,4444.4441300968865,4.4444441300968869E-3,4.4433815222421773E-4,null,"#5 Fuel Oil"]
[null,"Volumetric Unit","Wood","Metric Ton","Volumetric UnitWoodMetric Ton",14514.955840000001,{"$f":"G62*$V$25","v":14.514955840000001},4253.9131841523595,4.2539131841523599,4.2539131841523598E-3,15314089.437719578,15314.089437719578,15.314089437719579,1.5314089437719579E-2,145.14955839999999,14.514955840000001,3657707.0856919088,3.6577070856919085,0.36568325762671727,null,"#6 Fuel Oil (Low Sulfur)"]
[null,null,null,null,null,null,null,null,null,null,null,null,null,null,null,null,null,null,null,null,"#6 Fuel Oil (High Sulfur)"]
[null,null,null,null,null,null,null,null,null,null,null,null,null,null,null,null,null,null,null,null,"Gasoline "]
[null,{"$f":"'Translation '!A846","v":"Natural Gas"},{"$f":"'Translation '!A847","v":"Propane"},{"$f":"'Translation '!A848","v":"Butane"},{"$f":"'Translation '!A849","v":"LNG"},{"$f":"'Translation '!A850","v":"Fuel_Oil_1"},{"$f":"'Translation '!A851","v":"Fuel_Oil_2"},{"$f":"'Translation '!A852","v":"Fuel_Oil_4"},{"$f":"'Translation '!A853","v":"Fuel_Oil_5"},{"$f":"'Translation '!A854","v":"Fuel_Oil_6_low_sulfer"},{"$f":"'Translation '!A855","v":"Fuel_Oil_6_high_sulfer"},{"$f":"'Translation '!A856","v":"Gasoline"},{"$f":"'Translation '!A857","v":"Kerosene"},{"$f":"'Translation '!A858","v":"Coal"},{"$f":"'Translation '!A859","v":"Coke"},{"$f":"'Translation '!A860","v":"Wood"},"Steam",null,null,null,"Kerosene"]
[null,"SCF","SCF","SCF","Gallon","Gallon","Gallon","Gallon","Gallon","Gallon","Gallon","Gallon","Gallon","Lb","Lb","Lb","MBTU",null,null,null,"Coal"]
[null,"CCF","CCF","CCF","BBL","BBL","BBL","BBL","BBL","BBL","BBL","BBL","BBL","Short Ton","Short Ton","Short Ton","MMBTU",null,null,null,"Coke "]
[null,"MCF","M^3","MCF","MBTU","MBTU","MBTU","MBTU","MBTU","MBTU","MBTU","MBTU","MBTU","Long Ton","Long Ton","Long Ton","kJ",null,null,null,"Wood"]
[null,"M^3","MCF","M^3","MMBTU","MMBTU","MMBTU","MMBTU","MMBTU","MMBTU","MMBTU","MMBTU","MMBTU","kg","kg","kg","MJ"]
[null,"MBTU","Gallon","Gallon","kJ","kJ","kJ","kJ","kJ","kJ","kJ","kJ","kJ","Metric Ton","Metric Ton","Metric Ton","GJ"]
[null,"MMBTU","BBL","BBL","MJ","MJ","MJ","MJ","MJ","MJ","MJ","MJ","MJ","MBTU","MBTU","MBTU","TJ"]
[null,"kJ","MBTU","MBTU","GJ","GJ","GJ","GJ","GJ","GJ","GJ","GJ","GJ","MMBTU","MMBTU","MMBTU","Therms"]
[null,"MJ","MMBTU","MMBTU","TJ","TJ","TJ","TJ","TJ","TJ","TJ","TJ","TJ","kJ","kJ","kJ","DTh"]
[null,"GJ","kJ","kJ","Therms","Therms","Therms","Therms","Therms","Therms","Therms","Therms","Therms","MJ","MJ","MJ","kCal"]
[null,"TJ","MJ","MJ","DTh","DTh","DTh","DTh","DTh","DTh","DTh","DTh","DTh","GJ","GJ","GJ","Gcal "]
[null,"Therms","GJ","GJ","kCal","kCal","kCal","kCal","kCal","kCal","kCal","kCal","kCal","TJ","TJ","TJ","Tonne of Oil Equivalent"]
[null,"DTh","TJ","TJ","Gcal ","Gcal ","Gcal ","Gcal ","Gcal ","Gcal ","Gcal ","Gcal ","Gcal ","Therms","Therms","Therms","N/A"]
[null,"kCal","Therms","Therms","Tonne of Oil Equivalent","Tonne of Oil Equivalent","Tonne of Oil Equivalent","Tonne of Oil Equivalent","Tonne of Oil Equivalent","Tonne of Oil Equivalent","Tonne of Oil Equivalent","Tonne of Oil Equivalent","Tonne of Oil Equivalent","DTh","DTh","DTh"]
[null,"Gcal ","DTh","DTh","N/A","N/A","N/A","N/A","N/A","N/A","N/A","N/A","N/A","kCal","kCal","kCal"]
[null,"Tonne of Oil Equivalent","kCal","kCal",null,null,null,null,null,null,null,null,null,"Gcal ","Gcal ","Gcal "]
[null,"N/A","Gcal ","Gcal ",null,null,null,null,null,null,null,null,null,"Tonne of Oil Equivalent","Tonne of Oil Equivalent","Tonne of Oil Equivalent"]
[null,null,"Tonne of Oil Equivalent","Tonne of Oil Equivalent",null,null,null,null,null,null,null,null,null,"N/A","N/A","N/A"]
[null,null,"N/A","N/A"]
[]
[null,"Electricity","Natural Gas","Steam "]
[null,"kWh",{"$f":"B79","v":"Therms"},{"$f":"Q75","v":"Therms"}]
[null,"MWh",{"$f":"B74","v":"MMBTU"},{"$f":"Q70","v":"MMBTU"}]
[null,"kJ",{"$f":"B73","v":"MBTU"},{"$f":"Q69","v":"MBTU"}]
[null,"MJ",{"$f":"B69","v":"SCF"},{"$f":"Q72","v":"MJ"}]
[null,"MMBTU",{"$f":"B70","v":"CCF"},{"$f":"Q76","v":"DTh"}]
[null,null,"MCF",{"$f":"Q79","v":"Tonne of Oil Equivalent"}]
[null,null,"M^3"]
[null,null,{"$f":"C78","v":"MJ"}]
[null,null,{"$f":"C85","v":"Tonne of Oil Equivalent"}]

{"sheet":"Translation ","index":20,"n_rows":883,"n_cols":4,"rows_kept":883,"cut":false,"hidden":true,"merged":[]}
["Translation","English","Russian","Ukrainian"]
[{"$f":"IF(Disclaimer!$C$2=\"English\",B2,IF(Disclaimer!$C$2=\"Russian\",C2,D2))","v":"Plant Energy Profiler Tool - Instructions"},"Plant Energy Profiler Tool - Instructions","Инструкции по применению инструмента определения энергетического профиля установки","Інструкції із застосування інструменту визначення енергетичного профілю установки"]
[{"$f":"IF(Disclaimer!$C$2=\"English\",B3,IF(Disclaimer!$C$2=\"Russian\",C3,D3))","v":"Color Scheme"},"Color Scheme","Цветовой код","Код кольору"]
[{"$f":"IF(Disclaimer!$C$2=\"English\",B4,IF(Disclaimer!$C$2=\"Russian\",C4,D4))","v":"Green"},"Green","Серый","Сірий"]
[{"$f":"IF(Disclaimer!$C$2=\"English\",B5,IF(Disclaimer!$C$2=\"Russian\",C5,D5))","v":"Pink"},"Pink","Фиолетовый","Фіолетовий"]
[{"$f":"IF(Disclaimer!$C$2=\"English\",B6,IF(Disclaimer!$C$2=\"Russian\",C6,D6))","v":"Yellow"},"Yellow","Желтый","Жовтий"]
[{"$f":"IF(Disclaimer!$C$2=\"English\",B7,IF(Disclaimer!$C$2=\"Russian\",C7,D7))","v":"User input"},"User input","Данные пользователя","Дані користувача"]
[{"$f":"IF(Disclaimer!$C$2=\"English\",B8,IF(Disclaimer!$C$2=\"Russian\",C8,D8))","v":"NO User Input"},"NO User Input","Данные пользов. отсутств.","Нема даних корист."]
[{"$f":"IF(Disclaimer!$C$2=\"English\",B9,IF(Disclaimer!$C$2=\"Russian\",C9,D9))","v":"User input required"},"User input required","Требуются Данные пользователя","Потрібні Дані користувача"]
[{"$f":"IF(Disclaimer!$C$2=\"English\",B10,IF(Disclaimer!$C$2=\"Russian\",C10,D10))","v":"Drop down list"},"Drop down list","Всплывающий список","Контекстний список"]
[{"$f":"IF(Disclaimer!$C$2=\"English\",B11,IF(Disclaimer!$C$2=\"Russian\",C11,D11))","v":"Formula inserted"},"Formula inserted","Вставлена формула","Вставлена формула"]
[{"$f":"IF(Disclaimer!$C$2=\"English\",B12,IF(Disclaimer!$C$2=\"Russian\",C12,D12))","v":"Content "},"Content ","Содержание","Зміст"]
[{"$f":"IF(Disclaimer!$C$2=\"English\",B13,IF(Disclaimer!$C$2=\"Russian\",C13,D13))","v":"Tab Title"},"Tab Title","Название закладки","Назва закладки"]
[{"$f":"IF(Disclaimer!$C$2=\"English\",B14,IF(Disclaimer!$C$2=\"Russian\",C14,D14))","v":"User Information "},"User Information ","Данные пользователя","Дані користувача"]
[{"$f":"IF(Disclaimer!$C$2=\"English\",B15,IF(Disclaimer!$C$2=\"Russian\",C15,D15))","v":"Contains Instruction on how to fill the data collection sheet"},"Contains Instruction on how to fill the data collection sheet","Данные пользователя","Містить інструкцію про заповнення формуляра даних"]
[{"$f":"IF(Disclaimer!$C$2=\"English\",B16,IF(Disclaimer!$C$2=\"Russian\",C16,D16))","v":"Basic Info\n(Mandatory Data)"},"Basic Info\n(Mandatory Data)","Основные данные (Обязательные)","Основні відомості(Обов'язкові дані)"]
[{"$f":"IF(Disclaimer!$C$2=\"English\",B17,IF(Disclaimer!$C$2=\"Russian\",C17,D17))","v":"Energy & Production\n(Mandatory Data)"},"Energy & Production\n(Mandatory Data)","Энергия и производство (Обязательные)","Енергія та виробництво(Обов'язкові дані)"]
[{"$f":"IF(Disclaimer!$C$2=\"English\",B18,IF(Disclaimer!$C$2=\"Russian\",C18,D18))","v":"Energy Use System\n(Mandatory Data)"},"Energy Use System\n(Mandatory Data)","Потребляющие энергию системы (Обязательные)","Система енерговикористання(Обов'язкові дані)"]
[{"$f":"IF(Disclaimer!$C$2=\"English\",B19,IF(Disclaimer!$C$2=\"Russian\",C19,D19))","v":"Energy Saving Opportunities (Mandatory Data)"},"Energy Saving Opportunities (Mandatory Data)","Возможности энергосбережения (Обязательные)","Можливості енергозаощадження (Обов'язкові дані)"]
[{"$f":"IF(Disclaimer!$C$2=\"English\",B20,IF(Disclaimer!$C$2=\"Russian\",C20,D20))","v":"CHP (Scorecard)"},"CHP (Scorecard)","КТЭ (Карточка оценок)","КТЕ (Карта оцінок)"]
[{"$f":"IF(Disclaimer!$C$2=\"English\",B21,IF(Disclaimer!$C$2=\"Russian\",C21,D21))","v":"Compressed Air (Scorecard)"},"Compressed Air (Scorecard)","Сжатый воздух (Карточка оценок)","Стиснуте повітря (Карта оцінок)"]
[{"$f":"IF(Disclaimer!$C$2=\"English\",B22,IF(Disclaimer!$C$2=\"Russian\",C22,D22))","v":"Process Cooling and Refrigeration (Scorecard)"},"Process Cooling and Refrigeration (Scorecard)","Технологическое охлаждение и замораживание (Карточка оценок)","Технологічне охолодження та заморожування (Карта оцінок)"]
[{"$f":"IF(Disclaimer!$C$2=\"English\",B23,IF(Disclaimer!$C$2=\"Russian\",C23,D23))","v":"Process Heating (Scorecard)"},"Process Heating (Scorecard)","Технологическое тепло (Карточка оценок)","Технологічне тепло (Карта оцінок)"]
[{"$f":"IF(Disclaimer!$C$2=\"English\",B24,IF(Disclaimer!$C$2=\"Russian\",C24,D24))","v":"Pumps (Scorecard)"},"Pumps (Scorecard)","Насосы (Карточка оценок)","Насоси (Карта оцінок)"]
[{"$f":"IF(Disclaimer!$C$2=\"English\",B25,IF(Disclaimer!$C$2=\"Russian\",C25,D25))","v":"Steam Generation Equipment (Scorecard)"},"Steam Generation Equipment (Scorecard)","Оборудование паропроизводства (Карточка оценок)","Паровиробне обладнання (Карта оцінок)"]
[{"$f":"IF(Disclaimer!$C$2=\"English\",B26,IF(Disclaimer!$C$2=\"Russian\",C26,D26))","v":"Please give your best estimate if the exact data is not known."},"Please give your best estimate if the exact data is not known.","В случае отсутствия точных данных просим предоставить известные Вам приблизительные данные.","В разі відсутності точних даних просимо навести відомі вам приблизні."]
[{"$f":"IF(Disclaimer!$C$2=\"English\",B27,IF(Disclaimer!$C$2=\"Russian\",C27,D27))","v":"Please input information on:"},"Please input information on:","Просим указать следующие данные:","Просимо внести відомості про:"]
[{"$f":"IF(Disclaimer!$C$2=\"English\",B28,IF(Disclaimer!$C$2=\"Russian\",C28,D28))","v":"Industry Type"},"Industry Type","Отрасль промышленности","Галузь промисловості."]
[{"$f":"IF(Disclaimer!$C$2=\"English\",B29,IF(Disclaimer!$C$2=\"Russian\",C29,D29))","v":"Location and Contact info for the plant"},"Location and Contact info for the plant","Контактная информация Вашего объекта","Місце розташування та контактні дані для вашого об'єкту"]
[{"$f":"IF(Disclaimer!$C$2=\"English\",B30,IF(Disclaimer!$C$2=\"Russian\",C30,D30))","v":"Hours of operation"},"Hours of operation","Рабочие часы","Години роботи."]
[{"$f":"IF(Disclaimer!$C$2=\"English\",B31,IF(Disclaimer!$C$2=\"Russian\",C31,D31))","v":"General energy management questions"},"General energy management questions","Ответы на вопросы об общем управлении энергоснабжением","Запитання щодо загального управління енергопостачанням"]
[{"$f":"IF(Disclaimer!$C$2=\"English\",B32,IF(Disclaimer!$C$2=\"Russian\",C32,D32))","v":"Please input information on:"},"Please input information on:","Просим внести следующие данные:","Просимо внести відомості про:"]
[{"$f":"IF(Disclaimer!$C$2=\"English\",B33,IF(Disclaimer!$C$2=\"Russian\",C33,D33))","v":"Energy Consumption of plant for 2 consecutive years"},"Energy Consumption of plant for 2 consecutive years","Потребление энергии, производственные данные установки за 2 последующих года.","Споживання енергії, виробничі дані установки за 2 роки поспіль."]
[{"$f":"IF(Disclaimer!$C$2=\"English\",B34,IF(Disclaimer!$C$2=\"Russian\",C34,D34))","v":"Electricity and fuel prices"},"Electricity and fuel prices","Годовое потребление энергии, годичные затраты, производственные данные за год.","Річне споживання енергії, річні витрати, виробничі дані за рік."]
[{"$f":"IF(Disclaimer!$C$2=\"English\",B35,IF(Disclaimer!$C$2=\"Russian\",C35,D35))","v":"Energy source for major equipment"},"Energy source for major equipment","Цены за единицу энергии и топлива","Ціни за одиницю енергії та пального."]
[{"$f":"IF(Disclaimer!$C$2=\"English\",B36,IF(Disclaimer!$C$2=\"Russian\",C36,D36))","v":"Please input information on:"},"Please input information on:","Просим внести следующие данные:","Просимо внести відомості про:"]
[{"$f":"IF(Disclaimer!$C$2=\"English\",B37,IF(Disclaimer!$C$2=\"Russian\",C37,D37))","v":"Energy Systems present in a plant, their energy consumption, annual cost running the systems"},"Energy Systems present in a plant, their energy consumption, annual cost running the systems","Энергопотребляющие системы установки, доля энергии, потребляемой каждой их таких систем.","Наявні на установці енергетичні системи, частка енергії, що використовується кожною з таких систем."]
[{"$f":"IF(Disclaimer!$C$2=\"English\",B38,IF(Disclaimer!$C$2=\"Russian\",C38,D38))","v":"Rating of major Equipment and their Annual  Operating hours."},"Rating of major Equipment and their Annual  Operating hours.","Рейтинг основного оборудования с указанием часов его работы.","Рейтинг основного обладнання до кількість відпрацьованих годин на рік."]
[{"$f":"IF(Disclaimer!$C$2=\"English\",B39,IF(Disclaimer!$C$2=\"Russian\",C39,D39))","v":"Use this screen to characterize the potential energy savings opportunities for the various major systems in your plant. "},"Use this screen to characterize the potential energy savings opportunities for the various major systems in your plant. ","Опишите потенциальные возможности энергосбережения для разных основных систем вашей установки. ","Опишіть потенційні можливості енергозбереження для різних основних систем вашої установки. "]
[{"$f":"IF(Disclaimer!$C$2=\"English\",B40,IF(Disclaimer!$C$2=\"Russian\",C40,D40))","v":"Please answer the questions in this form if the CHP system is present in your plant  "},"Please answer the questions in this form if the CHP system is present in your plant  ","Просим ответить на вопросы этого формуляра в случае, если у вас есть система КТЭ","Просимо відповідати на запитання цього формуляру в разі, якщо у вас є система КТЕ"]
[{"$f":"IF(Disclaimer!$C$2=\"English\",B41,IF(Disclaimer!$C$2=\"Russian\",C41,D41))","v":"Please answer the questions in this form if the Compressed Air system is present in your plant  "},"Please answer the questions in this form if the Compressed Air system is present in your plant  ","Просим ответить на вопросы этого формуляра в случае, если у вас есть система сжатого воздуха  ","Просимо відповідати на запитання цього формуляру в разі, якщо у вас є система стиснутого повітря  "]
[{"$f":"IF(Disclaimer!$C$2=\"English\",B42,IF(Disclaimer!$C$2=\"Russian\",C42,D42))","v":"Please answer the questions in this form if the Process Cooling and Refrigeration system is present in your plant  "},"Please answer the questions in this form if the Process Cooling and Refrigeration system is present in your plant  ","Просим ответить на вопросы этого формуляра в случае, если у вас есть система технологического охлаждения и замораживания","Просимо відповідати на запитання цього формуляру в разі, якщо у вас є система технологічного охолодження та заморожування  "]
[{"$f":"IF(Disclaimer!$C$2=\"English\",B43,IF(Disclaimer!$C$2=\"Russian\",C43,D43))","v":"Please answer the questions in this form if the Process Heating system is present in your plant  "},"Please answer the questions in this form if the Process Heating system is present in your plant  ","Просим ответить на вопросы этого формуляра в случае, если у вас есть система технологического тепла","Просимо відповідати на запитання цього формуляру в разі, якщо у вас є система технологічного обігріву  "]
[{"$f":"IF(Disclaimer!$C$2=\"English\",B44,IF(Disclaimer!$C$2=\"Russian\",C44,D44))","v":"Please answer the questions in this form if the Pump system is present in your plant  "},"Please answer the questions in this form if the Pump system is present in your plant  ","Просим ответить на вопросы этого формуляра в случае, если на Вашей установке есть насосная система ","Просимо відповідати на запитання цього формуляру в разі, якщо на вашій установці є насосна система  "]
[{"$f":"IF(Disclaimer!$C$2=\"English\",B45,IF(Disclaimer!$C$2=\"Russian\",C45,D45))","v":"Please answer the questions in this form if the Steam Generation Equipment are present in your plant  "},"Please answer the questions in this form if the Steam Generation Equipment are present in your plant  ","Просим ответить на вопросы этого формуляра в случае, если у вас есть оборудование паропроизводства   ","Просимо відповідати на запитання цього формуляру в разі, якщо у вас є паровиробне обладнання  "]
[{"$f":"IF(Disclaimer!$C$2=\"English\",B46,IF(Disclaimer!$C$2=\"Russian\",C46,D46))","v":"Basic Plant Information"},"Basic Plant Information","Основные сведения об установке","Основні відомості про установку"]
[{"$f":"IF(Disclaimer!$C$2=\"English\",B47,IF(Disclaimer!$C$2=\"Russian\",C47,D47))","v":"Plant Contact Information:"},"Plant Contact Information:","Контактные данные:","Контактні дані:"]
[{"$f":"IF(Disclaimer!$C$2=\"English\",B48,IF(Disclaimer!$C$2=\"Russian\",C48,D48))","v":"Corporation Name:"},"Corporation Name:","Название компании:","Назва компанії:"]
[{"$f":"IF(Disclaimer!$C$2=\"English\",B49,IF(Disclaimer!$C$2=\"Russian\",C49,D49))","v":"Plant Name:"},"Plant Name:","Наименование установки:","Назва установки:"]
[{"$f":"IF(Disclaimer!$C$2=\"English\",B50,IF(Disclaimer!$C$2=\"Russian\",C50,D50))","v":"Primary Product:"},"Primary Product:","Основная продукция:","Основна продукція:"]
[{"$f":"IF(Disclaimer!$C$2=\"English\",B51,IF(Disclaimer!$C$2=\"Russian\",C51,D51))","v":"Industry Type:"},"Industry Type:","Отрасль","Галузь:"]
[{"$f":"IF(Disclaimer!$C$2=\"English\",B52,IF(Disclaimer!$C$2=\"Russian\",C52,D52))","v":"NAICS Code"},"NAICS Code","Код NAICS:","Код NAICS:"]
[{"$f":"IF(Disclaimer!$C$2=\"English\",B53,IF(Disclaimer!$C$2=\"Russian\",C53,D53))","v":"Specify if other:"},"Specify if other:","Другое:","Інше:"]
[{"$f":"IF(Disclaimer!$C$2=\"English\",B54,IF(Disclaimer!$C$2=\"Russian\",C54,D54))","v":"Plant's Safety Protocol:"},"Plant's Safety Protocol:","Протокол ТБ на установке:","Протокол ТБ на установці:"]
[{"$f":"IF(Disclaimer!$C$2=\"English\",B55,IF(Disclaimer!$C$2=\"Russian\",C55,D55))","v":"Specific Problems or Ideas of Interest related to Plant's Energy use:"},"Specific Problems or Ideas of Interest related to Plant's Energy use:","Конкретные проблемы или идеи относительно использования энергии установки:","Конкретні проблеми або ідеї щодо використання енергії установки:"]
[{"$f":"IF(Disclaimer!$C$2=\"English\",B56,IF(Disclaimer!$C$2=\"Russian\",C56,D56))","v":"Location:"},"Location:","Место расположения:","Місце розташування:"]
[{"$f":"IF(Disclaimer!$C$2=\"English\",B57,IF(Disclaimer!$C$2=\"Russian\",C57,D57))","v":"Primary Contact for Assessment:"},"Primary Contact for Assessment:","С кем связаться по вопросам оценки:","Контакти щодо оцінювання:"]
[{"$f":"IF(Disclaimer!$C$2=\"English\",B58,IF(Disclaimer!$C$2=\"Russian\",C58,D58))","v":"Address"},"Address","Адрес:","Адреса:"]
[{"$f":"IF(Disclaimer!$C$2=\"English\",B59,IF(Disclaimer!$C$2=\"Russian\",C59,D59))","v":"Phone:"},"Phone:","Телефон:","Телефон:"]
[{"$f":"IF(Disclaimer!$C$2=\"English\",B60,IF(Disclaimer!$C$2=\"Russian\",C60,D60))","v":"Fax-No:"},"Fax-No:","Факс:","Факс:"]
[{"$f":"IF(Disclaimer!$C$2=\"English\",B61,IF(Disclaimer!$C$2=\"Russian\",C61,D61))","v":"E-mail:"},"E-mail:","Эл. адрес","електронна пошта"]
[{"$f":"IF(Disclaimer!$C$2=\"English\",B62,IF(Disclaimer!$C$2=\"Russian\",C62,D62))","v":"Plant's Operating Schedule:"},"Plant's Operating Schedule:","График работы установки:","Графік роботи установки:"]
[{"$f":"IF(Disclaimer!$C$2=\"English\",B63,IF(Disclaimer!$C$2=\"Russian\",C63,D63))","v":"Shift No."},"Shift No.","Смена №","Зміна №"]
[{"$f":"IF(Disclaimer!$C$2=\"English\",B64,IF(Disclaimer!$C$2=\"Russian\",C64,D64))","v":"Hours of Operation/ Day"},"Hours of Operation/ Day","Рабочих часов в сутки","Робочих годин на добу"]
[{"$f":"IF(Disclaimer!$C$2=\"English\",B65,IF(Disclaimer!$C$2=\"Russian\",C65,D65))","v":"Days/Week"},"Days/Week","Дней в неделю","Днів на тиждень"]
[{"$f":"IF(Disclaimer!$C$2=\"English\",B66,IF(Disclaimer!$C$2=\"Russian\",C66,D66))","v":"Weeks/ Year"},"Weeks/ Year","Недель в год","Тижнів на рік"]
[{"$f":"IF(Disclaimer!$C$2=\"English\",B67,IF(Disclaimer!$C$2=\"Russian\",C67,D67))","v":1},1,1,1]
[{"$f":"IF(Disclaimer!$C$2=\"English\",B68,IF(Disclaimer!$C$2=\"Russian\",C68,D68))","v":2},2,2,2]
[{"$f":"IF(Disclaimer!$C$2=\"English\",B69,IF(Disclaimer!$C$2=\"Russian\",C69,D69))","v":3},3,3,3]
[{"$f":"IF(Disclaimer!$C$2=\"English\",B70,IF(Disclaimer!$C$2=\"Russian\",C70,D70))","v":"Office Hours"},"Office Hours","График работы администрации:","Графік роботи офісу:"]
[{"$f":"IF(Disclaimer!$C$2=\"English\",B71,IF(Disclaimer!$C$2=\"Russian\",C71,D71))","v":"Others"},"Others","Другое","Інше"]
[{"$f":"IF(Disclaimer!$C$2=\"English\",B72,IF(Disclaimer!$C$2=\"Russian\",C72,D72))","v":"Energy Management Questions:"},"Energy Management Questions:","Вопросы по контролю энергетики:","Запитання щодо управління енергетикою:"]
[{"$f":"IF(Disclaimer!$C$2=\"English\",B73,IF(Disclaimer!$C$2=\"Russian\",C73,D73))","v":"Please select the answers from the drop down list"},"Please select the answers from the drop down list","Выберите ответы из всплывающего списка","Виберіть відповіді з контекстного меню"]
[{"$f":"IF(Disclaimer!$C$2=\"English\",B74,IF(Disclaimer!$C$2=\"Russian\",C74,D74))","v":"Does your company have a formal written Energy Management Plan?"},"Does your company have a formal written Energy Management Plan?","Существует ли в Вашей компании официальный письменный план использования энергии?","Чи має ваша компанія офіційний письмовий план використання енергії?"]
[{"$f":"IF(Disclaimer!$C$2=\"English\",B75,IF(Disclaimer!$C$2=\"Russian\",C75,D75))","v":"Have you formed Energy Management Team at your plant?"},"Have you formed Energy Management Team at your plant?","Создана ли у Вас группа управления энергетикой установки?","Чи створили ви Групу управління енергетикою установки?"]
[{"$f":"IF(Disclaimer!$C$2=\"English\",B76,IF(Disclaimer!$C$2=\"Russian\",C76,D76))","v":"Does your company have a formal method of communication in place for employees?"},"Does your company have a formal method of communication in place for employees?","Есть ли у Вас в компании официальная процедура передачи сообщений и предложений от сотрудников на местах?","Чи має Ваша компанія формальні методи передання повідомлень з місць від працівників?"]
[{"$f":"IF(Disclaimer!$C$2=\"English\",B77,IF(Disclaimer!$C$2=\"Russian\",C77,D77))","v":"Does your company use life cycle cost analysis to evaluate the economics of Energy Efficient equipment when making new purchase of large system?"},"Does your company use life cycle cost analysis to evaluate the economics of Energy Efficient equipment when making new purchase of large system?","Использует ли Ваша компания анализ стоимости жизненного цикла для оценки экономических параметров  оборудования обеспечения энергоэффективности при закупке новых основных систем установки?","Чи використовує ваша компанія аналіз вартості життєвого циклу для оцінки економічних параметрів обладнання енергоефективності в разі закупівлі нових великих систем?"]
[{"$f":"IF(Disclaimer!$C$2=\"English\",B78,IF(Disclaimer!$C$2=\"Russian\",C78,D78))","v":"Does your company establish required payback periods for energy efficient improvement projects?"},"Does your company establish required payback periods for energy efficient improvement projects?","Определяются ли Вашей компанией обязательные сроки окупаемости для проектов повышения энергоэффективности?","Чи визначає ваша компанія обов'язкові періоди окупності для проектів підвищення енергоефективності?"]
[{"$f":"IF(Disclaimer!$C$2=\"English\",B79,IF(Disclaimer!$C$2=\"Russian\",C79,D79))","v":"Plant's Energy Consumption & Production Overview"},"Plant's Energy Consumption & Production Overview","Потребление энергии и обзор продукции установки","Споживання енергії та  огляд продукції установки"]
[{"$f":"IF(Disclaimer!$C$2=\"English\",B80,IF(Disclaimer!$C$2=\"Russian\",C80,D80))","v":"Instructions:"},"Instructions:","Инструкция:","Інструкції:"]
[{"$f":"IF(Disclaimer!$C$2=\"English\",B81,IF(Disclaimer!$C$2=\"Russian\",C81,D81))","v":"Please respond to the following questions on Plant's energy consumption and product overview."},"Please respond to the following questions on Plant's energy consumption and product overview."," Просим дать ответы на следующие вопросы по энергопотреблению и обзору продукции установки.","Просимо відповісти на наступні запитання щодо споживання енергії та огляду продукції установки."]
[{"$f":"IF(Disclaimer!$C$2=\"English\",B82,IF(Disclaimer!$C$2=\"Russian\",C82,D82))","v":"Please select the answer from the drop down list"},"Please select the answer from the drop down list"," Выберите ответ из всплывающего списка","Виберіть відповідь з контекстного списку"]
[{"$f":"IF(Disclaimer!$C$2=\"English\",B83,IF(Disclaimer!$C$2=\"Russian\",C83,D83))","v":"Input values in cells colored in green"},"Input values in cells colored in green"," Вставьте значения в клетки серого цвета","Просимо вставити значення в клітини, позначені сірим"]
[{"$f":"IF(Disclaimer!$C$2=\"English\",B84,IF(Disclaimer!$C$2=\"Russian\",C84,D84))","v":"Select from the drop down menu in the cells colored in pink"},"Select from the drop down menu in the cells colored in pink","В клетках оранжевого цвета выбирайте ответ из всплывающего списка","В позначених помаранчевим клітинах вибирайте з контекстного списку"]
[{"$f":"IF(Disclaimer!$C$2=\"English\",B85,IF(Disclaimer!$C$2=\"Russian\",C85,D85))","v":"Please DO NOT insert any value in cells colored in grey"},"Please DO NOT insert any value in cells colored in grey","НЕ ВВОДИТЕ никаких значений в клетки желтого цвета","Просимо НЕ ВНОСИТИ ніяких значень в клітини, позначені жовтим"]
[{"$f":"IF(Disclaimer!$C$2=\"English\",B86,IF(Disclaimer!$C$2=\"Russian\",C86,D86))","v":"Note:"},"Note:","Примечание:","Примітка:"]
[{"$f":"IF(Disclaimer!$C$2=\"English\",B87,IF(Disclaimer!$C$2=\"Russian\",C87,D87))","v":"Please provide either monthly or annual energy and production data. While most of the PEPEx results can be generated with just the annual data, some of them graphs/tables make use of monthly data.   "},"Please provide either monthly or annual energy and production data. While most of the PEPEx results can be generated with just the annual data, some of them graphs/tables make use of monthly data.   ","Приведите данные по месячному потреблению электроэнергии, природного газа, пара и других видов топлива, а также производственные данные за 2 последующих года для расчета показателя энергоэффективности (EnPI) Департамента энергетики.","Просимо надати дані щодо місячного споживання, електроенергії, природного газу, пари та інших видів пального та дані виробництва за 2 роки поспіль для  розрахунку показника енергоефективності (EnPI) Департаменту енергетики."]
[{"$f":"IF(Disclaimer!$C$2=\"English\",B88,IF(Disclaimer!$C$2=\"Russian\",C88,D88))","v":"Facility's Energy and Production Data:"},"Facility's Energy and Production Data:","Производство энергии и данных:","Виробництво енергії і даних:"]
[{"$f":"IF(Disclaimer!$C$2=\"English\",B89,IF(Disclaimer!$C$2=\"Russian\",C89,D89))","v":"Year 1 ( Baseline Year):"},"Year 1 ( Baseline Year):","Год 1 ( Базисный год):","Рік 1 ( Базисний рік):"]
[{"$f":"IF(Disclaimer!$C$2=\"English\",B90,IF(Disclaimer!$C$2=\"Russian\",C90,D90))","v":"Month"},"Month","Месяц","Місяць"]
[{"$f":"IF(Disclaimer!$C$2=\"English\",B91,IF(Disclaimer!$C$2=\"Russian\",C91,D91))","v":"Monthly Site Electricity Consumption(0)"},{"$f":"CONCATENATE(\"Monthly Site Electricity Consumption\", \"(\",List!G39,\")\")","v":"Monthly Site Electricity Consumption(0)"},{"$f":"CONCATENATE(\"Месячное потребление энергии установкой\",\"(\",List!G39,\")\")","v":"Месячное потребление энергии установкой(0)"},{"$f":"CONCATENATE(\"Місячне споживання енергії на об'єкті\",\"(\",List!G39,\")\")","v":"Місячне споживання енергії на об'єкті(0)"}]
[{"$f":"IF(Disclaimer!$C$2=\"English\",B92,IF(Disclaimer!$C$2=\"Russian\",C92,D92))","v":"Total Monthly Electricity Cost($)"},{"$f":"CONCATENATE(\"Total Monthly Electricity Cost\", \"(\",List!$G$48,\")\")","v":"Total Monthly Electricity Cost($)"},{"$f":"CONCATENATE(\"Общая стоимость электроэнергии в месяц\", \"(\",List!$G$48,\")\")","v":"Общая стоимость электроэнергии в месяц($)"},{"$f":"CONCATENATE(\"Загальна вартість електроенергії на місяць \", \"(\",List!$G$48,\")\")","v":"Загальна вартість електроенергії на місяць ($)"}]
[{"$f":"IF(Disclaimer!$C$2=\"English\",B93,IF(Disclaimer!$C$2=\"Russian\",C93,D93))","v":"Monthly Natural Gas Consumption(0)"},{"$f":"CONCATENATE(\"Monthly Natural Gas Consumption\", \"(\",List!$G$40,\")\")","v":"Monthly Natural Gas Consumption(0)"},{"$f":"CONCATENATE(\"Месячное потребление природного газа\", \"(\",List!$G$40,\")\")","v":"Месячное потребление природного газа(0)"},{"$f":"CONCATENATE(\"Місячне споживання природного газу \", \"(\",List!$G$40,\")\")","v":"Місячне споживання природного газу (0)"}]
[{"$f":"IF(Disclaimer!$C$2=\"English\",B94,IF(Disclaimer!$C$2=\"Russian\",C94,D94))","v":"Total Monthly Natural Gas Cost ($)"},{"$f":"CONCATENATE(\"Total Monthly Natural Gas Cost \", \"(\",List!$G$48,\")\")","v":"Total Monthly Natural Gas Cost ($)"},{"$f":"CONCATENATE(\"Общая стоимость природного газа в месяц\", \"(\",List!$G$48,\")\")","v":"Общая стоимость природного газа в месяц($)"},{"$f":"CONCATENATE(\"Загальна вартість природного газу на місяць \", \"(\",List!$G$48,\")\")","v":"Загальна вартість природного газу на місяць ($)"}]
[{"$f":"IF(Disclaimer!$C$2=\"English\",B95,IF(Disclaimer!$C$2=\"Russian\",C95,D95))","v":"Monthly Steam Consumption (0)"},{"$f":"CONCATENATE(\"Monthly Steam Consumption \", \"(\",List!$G$41,\")\")","v":"Monthly Steam Consumption (0)"},{"$f":"CONCATENATE(\"Месячное потребление пара \", \"(\",List!$G$41,\")\")","v":"Месячное потребление пара (0)"},{"$f":"CONCATENATE(\"Місячне споживання пари\", \"(\",List!$G$41,\")\")","v":"Місячне споживання пари(0)"}]
[{"$f":"IF(Disclaimer!$C$2=\"English\",B96,IF(Disclaimer!$C$2=\"Russian\",C96,D96))","v":"Total Monthly Steam Consumption Cost ($)"},{"$f":"CONCATENATE(\"Total Monthly Steam Consumption Cost \", \"(\",List!$G$48,\")\")","v":"Total Monthly Steam Consumption Cost ($)"},{"$f":"CONCATENATE(\"Общая стоимость пара в месяц\", \"(\",List!$G$48,\")\")","v":"Общая стоимость пара в месяц($)"},{"$f":"CONCATENATE(\"Загальна вартість пари на місяць\", \"(\",List!$G$48,\")\")","v":"Загальна вартість пари на місяць($)"}]
[{"$f":"IF(Disclaimer!$C$2=\"English\",B97,IF(Disclaimer!$C$2=\"Russian\",C97,D97))","v":"Monthly Other Fuel Consumption (0)"},{"$f":"CONCATENATE(\"Monthly Other Fuel Consumption \", \"(\",List!$G$42,\")\")","v":"Monthly Other Fuel Consumption (0)"},{"$f":"CONCATENATE(\"Месячное потребление других видов топлива\", \"(\",List!$G$42,\")\")","v":"Месячное потребление других видов топлива(0)"},{"$f":"CONCATENATE(\"Місячне споживання інших видів пального \", \"(\",List!$G$42,\")\")","v":"Місячне споживання інших видів пального (0)"}]
[{"$f":"IF(Disclaimer!$C$2=\"English\",B98,IF(Disclaimer!$C$2=\"Russian\",C98,D98))","v":"Total Monthly Other Fuel Cost ($)"},{"$f":"CONCATENATE(\"Total Monthly Other Fuel Cost \", \"(\",List!$G$48,\")\")","v":"Total Monthly Other Fuel Cost ($)"},{"$f":"CONCATENATE(\"Общая стоимость других видов топлива в месяц \", \"(\",List!$G$48,\")\")","v":"Общая стоимость других видов топлива в месяц ($)"},{"$f":"CONCATENATE(\"Загальна вартість інших видів пального на місяць \", \"(\",List!$G$48,\")\")","v":"Загальна вартість інших видів пального на місяць ($)"}]
[{"$f":"IF(Disclaimer!$C$2=\"English\",B99,IF(Disclaimer!$C$2=\"Russian\",C99,D99))","v":"Monthly Production (Product 1)"},"Monthly Production (Product 1)","Месячное производство (продукт  1)","Місячне виробництво (продукт 1)"]
[{"$f":"IF(Disclaimer!$C$2=\"English\",B100,IF(Disclaimer!$C$2=\"Russian\",C100,D100))","v":"Monthly Production (Product 2)"},"Monthly Production (Product 2)","Месячное производство (продукт 2)","Місячне виробництво (продукт 2)"]
[{"$f":"IF(Disclaimer!$C$2=\"English\",B101,IF(Disclaimer!$C$2=\"Russian\",C101,D101))","v":"Monthly Production (Product 3)"},"Monthly Production (Product 3)","Месячное производство (продукт  3)","Місячне виробництво (продукт 3)"]
[{"$f":"IF(Disclaimer!$C$2=\"English\",B102,IF(Disclaimer!$C$2=\"Russian\",C102,D102))","v":"January"},"January","Январь","Січень"]
[{"$f":"IF(Disclaimer!$C$2=\"English\",B103,IF(Disclaimer!$C$2=\"Russian\",C103,D103))","v":"February"},"February","Февраль","Лютий"]
[{"$f":"IF(Disclaimer!$C$2=\"English\",B104,IF(Disclaimer!$C$2=\"Russian\",C104,D104))","v":"March"},"March","Март","Березень"]
[{"$f":"IF(Disclaimer!$C$2=\"English\",B105,IF(Disclaimer!$C$2=\"Russian\",C105,D105))","v":"April"},"April","Апрель","Квітень"]
[{"$f":"IF(Disclaimer!$C$2=\"English\",B106,IF(Disclaimer!$C$2=\"Russian\",C106,D106))","v":"May"},"May","Май","Травень"]
[{"$f":"IF(Disclaimer!$C$2=\"English\",B107,IF(Disclaimer!$C$2=\"Russian\",C107,D107))","v":"June"},"June","Июнь","Червень"]
[{"$f":"IF(Disclaimer!$C$2=\"English\",B108,IF(Disclaimer!$C$2=\"Russian\",C108,D108))","v":"July"},"July","Июль","Липень"]
[{"$f":"IF(Disclaimer!$C$2=\"English\",B109,IF(Disclaimer!$C$2=\"Russian\",C109,D109))","v":"August"},"August","Август","Серпень"]
[{"$f":"IF(Disclaimer!$C$2=\"English\",B110,IF(Disclaimer!$C$2=\"Russian\",C110,D110))","v":"September"},"September","Сентябрь","Вересень"]
[{"$f":"IF(Disclaimer!$C$2=\"English\",B111,IF(Disclaimer!$C$2=\"Russian\",C111,D111))","v":"October"},"October","Октябрь","Жовтень"]
[{"$f":"IF(Disclaimer!$C$2=\"English\",B112,IF(Disclaimer!$C$2=\"Russian\",C112,D112))","v":"November"},"November","Ноябрь","Листопад"]
[{"$f":"IF(Disclaimer!$C$2=\"English\",B113,IF(Disclaimer!$C$2=\"Russian\",C113,D113))","v":"December"},"December","Декабрь","Грудень"]
[{"$f":"IF(Disclaimer!$C$2=\"English\",B114,IF(Disclaimer!$C$2=\"Russian\",C114,D114))","v":"Year 2:"},"Year 2:","Год 2:","Рік 2:"]
[{"$f":"IF(Disclaimer!$C$2=\"English\",B115,IF(Disclaimer!$C$2=\"Russian\",C115,D115))","v":"Year 1 - Grand Total"},"Year 1 - Grand Total","Год 1 - итого","Рік 1 - загалом"]
[{"$f":"IF(Disclaimer!$C$2=\"English\",B116,IF(Disclaimer!$C$2=\"Russian\",C116,D116))","v":"Year 2- Grand Total"},"Year 2- Grand Total","Год 2 - итого","Рік 2 - загалом"]
[{"$f":"IF(Disclaimer!$C$2=\"English\",B117,IF(Disclaimer!$C$2=\"Russian\",C117,D117))","v":"1) For each energy stream you will need to enter account information for each meter for which you have data. For each account enter a Meter ID or name, enter the Annual Energy consumption, Energy Type, Total Annual Cost for 2 consecutive year. "},"1) For each energy stream you will need to enter account information for each meter for which you have data. For each account enter a Meter ID or name, enter the Annual Energy consumption, Energy Type, Total Annual Cost for 2 consecutive year. ","1) По каждому энергоносителю введите показания все имеющихся счетчиков. По каждому показанию укажите тип энергоносителя, номер или наименование счетчика, введите значение годового потребления энергии установкой, общую стоимость за год и показатели годового производства.","1) Для кожного енергоносія необхідно внести показання всіх лічильників, які ви маєте. Для кожного показання зазначте тип енергоносія, номер або назву лічильника, внесіть значення річного споживання енергії на об'єкті, загальну річну вартість та дані про річне виробництво."]
[{"$f":"IF(Disclaimer!$C$2=\"English\",B118,IF(Disclaimer!$C$2=\"Russian\",C118,D118))","v":"2) Other Fuels include Coal, Diesel or nay other fuel that is used in Plant"},"2) Other Fuels include Coal, Diesel or nay other fuel that is used in Plant","2) К другим видам топлива относятся уголь, дизтопливо или любое другое топлива, используемое в установке.","2) До інших видів пального відносяться вугілля, дизельне пальне або будь-яке інше пальне, що використовується на установці."]
[{"$f":"IF(Disclaimer!$C$2=\"English\",B119,IF(Disclaimer!$C$2=\"Russian\",C119,D119))","v":"Total Annual Energy Consumption for the Baseline Year "},"Total Annual Energy Consumption for the Baseline Year ","Общее годовое потребление энергии для базисного года:","Загальне річне споживання енергії для базисного року:"]
[{"$f":"IF(Disclaimer!$C$2=\"English\",B120,IF(Disclaimer!$C$2=\"Russian\",C120,D120))","v":"Energy Type"},"Energy Type","Вид энергии","Тип енергії"]
[{"$f":"IF(Disclaimer!$C$2=\"English\",B121,IF(Disclaimer!$C$2=\"Russian\",C121,D121))","v":"Meter ID"},"Meter ID","Номер счетчика","Номер лічильнику"]
[{"$f":"IF(Disclaimer!$C$2=\"English\",B122,IF(Disclaimer!$C$2=\"Russian\",C122,D122))","v":"Annual Energy Use (SITE)"},"Annual Energy Use (SITE)","Годовое потребление (установка)","Річне споживання (об'єкт)"]
[{"$f":"IF(Disclaimer!$C$2=\"English\",B123,IF(Disclaimer!$C$2=\"Russian\",C123,D123))","v":"Unit"},"Unit","Ед. изм.","Од. вим."]
[{"$f":"IF(Disclaimer!$C$2=\"English\",B124,IF(Disclaimer!$C$2=\"Russian\",C124,D124))","v":"Annual Cost of Energy($)"},{"$f":"CONCATENATE(\"Annual Cost of Energy\", \"(\",List!$G$48,\")\")","v":"Annual Cost of Energy($)"},{"$f":"CONCATENATE(\"Годовая стоимость энергии\", \"(\",List!$G$48,\")\")","v":"Годовая стоимость энергии($)"},{"$f":"CONCATENATE(\"Річна вартість енергії\", \"(\",List!$G$48,\")\")","v":"Річна вартість енергії($)"}]
[{"$f":"IF(Disclaimer!$C$2=\"English\",B125,IF(Disclaimer!$C$2=\"Russian\",C125,D125))","v":"Unit Energy Price"},"Unit Energy Price","Стоимость единицы энергии"]
[{"$f":"IF(Disclaimer!$C$2=\"English\",B126,IF(Disclaimer!$C$2=\"Russian\",C126,D126))","v":"Annual Production (Product 1) "},"Annual Production (Product 1) ","Годовое производство (продукт  1) ","Річне виробництво (продукт 1) "]
[{"$f":"IF(Disclaimer!$C$2=\"English\",B127,IF(Disclaimer!$C$2=\"Russian\",C127,D127))","v":"Annual Production (Product 2)"},"Annual Production (Product 2)","Годовое производство (продукт  2)","Річне виробництво (продукт 2) "]
[{"$f":"IF(Disclaimer!$C$2=\"English\",B128,IF(Disclaimer!$C$2=\"Russian\",C128,D128))","v":"Annual Production (Product 3 )"},"Annual Production (Product 3 )","Годовое производство (продукт  3 )","Річне виробництво (продукт 3) "]
[{"$f":"IF(Disclaimer!$C$2=\"English\",B129,IF(Disclaimer!$C$2=\"Russian\",C129,D129))","v":"Electricity"},"Electricity","Электроэнергия","Електроенергія"]
[{"$f":"IF(Disclaimer!$C$2=\"English\",B130,IF(Disclaimer!$C$2=\"Russian\",C130,D130))","v":"Natural Gas"},"Natural Gas","Природный газ","Природний газ"]
[{"$f":"IF(Disclaimer!$C$2=\"English\",B131,IF(Disclaimer!$C$2=\"Russian\",C131,D131))","v":"Steam"},"Steam","Пар ","Пара "]
[{"$f":"IF(Disclaimer!$C$2=\"English\",B132,IF(Disclaimer!$C$2=\"Russian\",C132,D132))","v":"Other Fuel"},"Other Fuel","Другие виды топлива","Інші види пального"]
[{"$f":"IF(Disclaimer!$C$2=\"English\",B133,IF(Disclaimer!$C$2=\"Russian\",C133,D133))","v":"Unit Cost of Energy:"},"Unit Cost of Energy:","Стоимость единицы энергии:","Вартість одиниці енергії:"]
[{"$f":"IF(Disclaimer!$C$2=\"English\",B134,IF(Disclaimer!$C$2=\"Russian\",C134,D134))","v":"Energy Type"},"Energy Type","Вид энергии","Тип енергії"]
[{"$f":"IF(Disclaimer!$C$2=\"English\",B135,IF(Disclaimer!$C$2=\"Russian\",C135,D135))","v":"1) Please provide unit costs for different energy types used in your plant if the associated costs were not provided in the section above."},"1) Please provide unit costs for different energy types used in your plant if the associated costs were not provided in the section above.","1) Укажите стоимость единицы энергии для ее разных видов - электроэнергии, природного газа, пара и других видов топлива, используемых Вашей ","1) Просимо навести вартість одиниці енергії для її різних видів - електроенергії, природного газу, пари та інших видів пального, що використовуються у вас на установці."]
[{"$f":"IF(Disclaimer!$C$2=\"English\",B136,IF(Disclaimer!$C$2=\"Russian\",C136,D136))","v":"2) Please provide steam cost only if user is buying steam from an utility or a third-party enterprise."},"2) Please provide steam cost only if user is buying steam from an utility or a third-party enterprise.","2) Коэффициенты преобразования \"объект-источник\" по умолчанию приведены ниже. Пользователь может ввести свое собственное значение ","2) Вартість пари наводити тільки в разі, якщо користувач закуповує пару в комунальному підприємстві або у третьої сторони."]
[{"$f":"IF(Disclaimer!$C$2=\"English\",B137,IF(Disclaimer!$C$2=\"Russian\",C137,D137))","v":"Energy Type"},"Energy Type","Вид энергии","Тип енергії"]
[{"$f":"IF(Disclaimer!$C$2=\"English\",B138,IF(Disclaimer!$C$2=\"Russian\",C138,D138))","v":"Unit Price"},"Unit Price","Цена за единицу","Ціна за одиницю"]
[{"$f":"IF(Disclaimer!$C$2=\"English\",B139,IF(Disclaimer!$C$2=\"Russian\",C139,D139))","v":"Site to Source Conversion Factors"},"Site to Source Conversion Factors","Коэффициенты преобразования \"объект-источник\":","Site to Source Conversion Factors:"]
[{"$f":"IF(Disclaimer!$C$2=\"English\",B140,IF(Disclaimer!$C$2=\"Russian\",C140,D140))","v":"Source Energy factor is used to calculate the source energy for each energy stream. Source energy incorporates all transmission, delivery and production losses associated with each energy stream. It is calculated by all multiplying the site energy by source energy factor. The default source factor for each stream is provided , based on those used in Energy Star Portfolio Manager. User may use their own source factor for each energy stream e.g. to account for electricity produced from co-generation, renewable sources, etc. Note: PEPEx  provides results in site energy unless explicitily stated."},"Source Energy factor is used to calculate the source energy for each energy stream. Source energy incorporates all transmission, delivery and production losses associated with each energy stream. It is calculated by all multiplying the site energy by source energy factor. The default source factor for each stream is provided , based on those used in Energy Star Portfolio Manager. User may use their own source factor for each energy stream e.g. to account for electricity produced from co-generation, renewable sources, etc. Note: PEPEx  provides results in site energy unless explicitily stated.","Коэффициент энергоносителя используется для расчета энергетики по каждому носителю. В энергетике источника учитываются все потери при передаче, доставке и производству по каждому носителю. Расчет производится путем умножения энергетического значения объекта на коэффициент для данного энергоносителя. Значения коэффициентов для энергоносителей по умолчанию приведены по носителям на основе значений, используемых в программе Energy Star Portfolio Manager. Пользователь может воспользоваться своим собственным значением коэффициента для каждого энергоносителя, например, с учетом электроэнергии, полученной за счет когенерации, от возобновляемых источников и т.п.","Коефіцієнт джерела енергії використовується для розрахунку джерела енергії для кожного носія. В джерелі енергії враховуються всі втрати передавання, постачання та виробництва для кожного носія. Розрахунок робиться шляхом множення енергії об'єкту на коефіцієнт для енергоносія. Значення коефіцієнтів для енергоносіїв за замовчуванням надані для кожного носія на основі значень, що використовуються в програмі Energy Star Portfolio Manager. Користувач може використати свій власний коефіцієнт носія для кожного з енергоносіїв, наприклад враховувати електроенергію, вироблену шляхом ко-генерації, від відновлювальних джерел, тощо."]
[{"$f":"IF(Disclaimer!$C$2=\"English\",B141,IF(Disclaimer!$C$2=\"Russian\",C141,D141))","v":"Site-to-Source Conversion Factor"},"Site-to-Source Conversion Factor","Коэффициент преобразования \"объект - источник\"","Коефіцієнт перетворення \"об'єкт - джерело\""]
[{"$f":"IF(Disclaimer!$C$2=\"English\",B142,IF(Disclaimer!$C$2=\"Russian\",C142,D142))","v":"Total Annual Energy Consumption "},"Total Annual Energy Consumption "]
[{"$f":"IF(Disclaimer!$C$2=\"English\",B143,IF(Disclaimer!$C$2=\"Russian\",C143,D143))","v":"Annual Energy Consumption (SOURCE) \nMJ"},"Annual Energy Consumption (SOURCE) \nMJ","Annual Energy Consumption (SOURCE) \nМДж","Annual Energy Consumption (SOURCE) \nМДж"]
[{"$f":"IF(Disclaimer!$C$2=\"English\",B144,IF(Disclaimer!$C$2=\"Russian\",C144,D144))","v":"Energy Use Systems Used in the Plant"},"Energy Use Systems Used in the Plant","Энергопотребляющие системы, используемые на Вашей установке","Системи енерговикористання, що використовуються на вашій установці"]
[{"$f":"IF(Disclaimer!$C$2=\"English\",B145,IF(Disclaimer!$C$2=\"Russian\",C145,D145))","v":"Please respond to the following questions on energy use systems used in the plant."},"Please respond to the following questions on energy use systems used in the plant.","Просим дать ответы на следующие вопросы по энергопотребляющим системам, используемым на Вашей установке.","Просимо відповісти на наступні запитання щодо систем енерговикористання, що використовуються на вашій установці."]
[{"$f":"IF(Disclaimer!$C$2=\"English\",B146,IF(Disclaimer!$C$2=\"Russian\",C146,D146))","v":"Select Not Applicable (N/A) if the system is not present in your plant."},"Select Not Applicable (N/A) if the system is not present in your plant.","Выбирайте \"неприменимо\" (N/A) для вопросов, не имеющих отношения к вашей установке","Вибирайте \"не стосується\" (N/A) для запитань, які не стосуються системи на вашій установці"]
[{"$f":"IF(Disclaimer!$C$2=\"English\",B147,IF(Disclaimer!$C$2=\"Russian\",C147,D147))","v":"1) Please select the systems present in your plant and choose the associated energy sources in Cells C24 - E35."},"1) Please select the systems present in your plant and choose the associated energy sources in Cells C24 - E35.","1)Выберите имеющиеся на Вашей установке системы. Выберите энергопотребляющие системы, используемые энергоемким оборудованием установки.","Виберіть системи, наявні на вашій установці. Виберіть енергетичні системи, що використовуються річним енергоємним обладнанням на вашій установці."]
[{"$f":"IF(Disclaimer!$C$2=\"English\",B148,IF(Disclaimer!$C$2=\"Russian\",C148,D148))","v":"2) If known, provide the percent energy distribution by fuel type for the different systems used in your plant in cells F24 - G35. PEPEx uses \"Default\" numbers if this information is not provided."},"2) If known, provide the percent energy distribution by fuel type for the different systems used in your plant in cells F24 - G35. PEPEx uses \"Default\" numbers if this information is not provided.","2)Укажите распределение энергии в процентах по типам топлива для систем, используемых на Вашей установке, в таблице Энергопотребляющие системы, используемые в установке (определяются пользователем)."," Наведіть розподіл енергії у відсотках за типами пального для різних систем, що використовуються на вашій установці, в таблиці Системи енерговикористання, що використовуються на установці (визначені користувачем)."]
[{"$f":"IF(Disclaimer!$C$2=\"English\",B149,IF(Disclaimer!$C$2=\"Russian\",C149,D149))","v":"3) The table Energy Use Systems Used in the Plant (Default) provides U.S. default percentages for you based on the industry that you selected in the Basic Information sheet (Tab 2). "},"3) The table Energy Use Systems Used in the Plant (Default) provides U.S. default percentages for you based on the industry that you selected in the Basic Information sheet (Tab 2). ","3) В таблице Энергопотребляющие системы, используемые в установке (по умолчанию) для Вас приведены принятые по умолчанию в США значения для отрасли, выбранной Вами в формуляре базовой информации (табл. 2). Вы можете воспользоваться этими значениями по умолчанию, если у Вас нет точных данных о доле, используемой каждой энергопотребляющей системой.","В таблиці Системи енерговикористання, що використовуються на установці (за замовчуванням) наведені для вас американські значення для галузі, що були обрані Вами в формулярі базової інформації (таб.2). Ви можете скористатися цими значеннями за замовчуванням, якщо у вас немає точних даних про фактичний відсоток що використовується кожною енергоспоживаючою системою. "]
[{"$f":"IF(Disclaimer!$C$2=\"English\",B150,IF(Disclaimer!$C$2=\"Russian\",C150,D150))","v":"4) Default energy distribution values are based on the Energy Information Administration 2010 Manufacturing Energy Consumption Survey (MECS) for all industries except cement. Default energy distributions for the cement industry were updated to more accurately portray the industry norm by Dr. Ali Hasanbeigi of the Lawrence Berkeley National Laboratory on December 7, 2011."},"4) Default energy distribution values are based on the Energy Information Administration 2010 Manufacturing Energy Consumption Survey (MECS) for all industries except cement. Default energy distributions for the cement industry were updated to more accurately portray the industry norm by Dr. Ali Hasanbeigi of the Lawrence Berkeley National Laboratory on December 7, 2011.","4) Значения разбивки энергии по умолчанию рассчитывались на основе Обзора потребления энергии на производстве за 2010 год (MECS) Администрации по вопросам данных энергетики для всех отраслей за исключением производства цемента. Значения разбивки энергии по умолчанию для цементной промышленности были обновлены для более точного отображения нормативов этой отрасли доктором Ali Hasanbeigi из Национальной лаборатории Лоуренса Беркли 7 декабря 2011 года.","Значення розподілу енергії за замовчуванням розраховані на основі Огляду споживання енергії на виробництві від 2010 року (MECS) Адміністрації з питань даних енергетики для всіх галузей, за винятком вироблення цементу. Значення розподілу енергії за замовчуванням для цементної промисловості були оновлені для того, щоб точніше відобразити нормативи цієї галузі, доктором Ali Hasanbeigi з Національної лабораторії Лоуренса Берклі 7 грудня 2011 року."]
[{"$f":"IF(Disclaimer!$C$2=\"English\",B151,IF(Disclaimer!$C$2=\"Russian\",C151,D151))","v":"5) If the user wants to use default value kindly select the systems present in your plant and the type of energy source used for the system (in cells Cells C24 - E35.) and leave the cells F24 - G35 blank. "},"5) If the user wants to use default value kindly select the systems present in your plant and the type of energy source used for the system (in cells Cells C24 - E35.) and leave the cells F24 - G35 blank. ","5) Если пользователь хочет использовать значение по умолчанию, просим обратиться к таблице Энергопотребляющие системы, используемые в ","Якщо користувач хоче скористатися значенням за замовчуванням, просимо скористатися таблицею Системи енерговикористання, що використовуються на установці (За замовчуванням) для вибору тих систем, що наявні на вашій установці, і значення за замочуванням для вашої галузі будуть використані для розрахунку енергоспоживання кожної із систем."]
[{"$f":"IF(Disclaimer!$C$2=\"English\",B152,IF(Disclaimer!$C$2=\"Russian\",C152,D152))","v":"Energy Consumption Systems Utilized in the Plant - User Defined:"},"Energy Consumption Systems Utilized in the Plant - User Defined:","Энергопотребляющие системы, используемые на установке (по определению пользователя):","Системи енерговикористання, що використовуються на установці (визначені користувачем):"]
[{"$f":"IF(Disclaimer!$C$2=\"English\",B153,IF(Disclaimer!$C$2=\"Russian\",C153,D153))","v":"System "},"System ","Тип системы","Тип системи"]
[{"$f":"IF(Disclaimer!$C$2=\"English\",B154,IF(Disclaimer!$C$2=\"Russian\",C154,D154))","v":"Energy System in use (Please select Yes/No)"},"Energy System in use (Please select Yes/No)","Используемая энергопотребл. система (выберите  Yes/No)","енергетична системи у використанні (Виберіть Yes/No)"]
[{"$f":"IF(Disclaimer!$C$2=\"English\",B155,IF(Disclaimer!$C$2=\"Russian\",C155,D155))","v":"Primary Energy Source"},"Primary Energy Source","Первичный источник энергии","Первинне джерело енергії"]
[{"$f":"IF(Disclaimer!$C$2=\"English\",B156,IF(Disclaimer!$C$2=\"Russian\",C156,D156))","v":"Secondary Energy Source"},"Secondary Energy Source","Вторичный источник энергии","Вторинне джерело енергії"]
[{"$f":"IF(Disclaimer!$C$2=\"English\",B157,IF(Disclaimer!$C$2=\"Russian\",C157,D157))","v":"% Primary Energy Source"},"% Primary Energy Source","% первичного источника энергии","% первинного джерела енергії"]
[{"$f":"IF(Disclaimer!$C$2=\"English\",B158,IF(Disclaimer!$C$2=\"Russian\",C158,D158))","v":"% Secondary Energy Source"},"% Secondary Energy Source","% вторичного источника энергии","% вторинного джерела енергії"]
[{"$f":"IF(Disclaimer!$C$2=\"English\",B159,IF(Disclaimer!$C$2=\"Russian\",C159,D159))","v":"Annual Consumption(0)"},{"$f":"CONCATENATE(\"Annual Consumption\", \"(\",List!$G$43,\")\")","v":"Annual Consumption(0)"},{"$f":"CONCATENATE(\"Годичное потребление\", \"(\",List!$G$43,\")\")","v":"Годичное потребление(0)"},{"$f":"CONCATENATE(\"Річне споживання\", \"(\",List!$G$43,\")\")","v":"Річне споживання(0)"}]
[{"$f":"IF(Disclaimer!$C$2=\"English\",B160,IF(Disclaimer!$C$2=\"Russian\",C160,D160))","v":"Annual Cost($)"},{"$f":"CONCATENATE(\"Annual Cost\", \"(\",List!$G$48,\")\")","v":"Annual Cost($)"},{"$f":"CONCATENATE(\"Годичная стоимость\", \"(\",List!$G$48,\")\")","v":"Годичная стоимость($)"},{"$f":"CONCATENATE(\"Річна вартість\", \"(\",List!$G$48,\")\")","v":"Річна вартість($)"}]
[{"$f":"IF(Disclaimer!$C$2=\"English\",B161,IF(Disclaimer!$C$2=\"Russian\",C161,D161))","v":"Combined Heat and Power (Cogeneration)"},"Combined Heat and Power (Cogeneration)","Комбинированное производство тепла и электроэнергии (когенерация)","Комбіноване виробництво тепла та електрики (Ко-генерація)"]
[{"$f":"IF(Disclaimer!$C$2=\"English\",B162,IF(Disclaimer!$C$2=\"Russian\",C162,D162))","v":"Compressed Air"},"Compressed Air","Сжатый воздух","Стиснуте повітря"]
[{"$f":"IF(Disclaimer!$C$2=\"English\",B163,IF(Disclaimer!$C$2=\"Russian\",C163,D163))","v":"Electrochemical Processes"},"Electrochemical Processes","Электрохимические технологии","Електрохімічні технології"]
[{"$f":"IF(Disclaimer!$C$2=\"English\",B164,IF(Disclaimer!$C$2=\"Russian\",C164,D164))","v":"Fans and Blowers"},"Fans and Blowers","Вентиляторы и воздуходувки","Вентилятори та повітродувки"]
[{"$f":"IF(Disclaimer!$C$2=\"English\",B165,IF(Disclaimer!$C$2=\"Russian\",C165,D165))","v":"Industrial Facilities (Lighting)"},"Industrial Facilities (Lighting)","Производственные площади (освещение)","Промислові площини (освітлення)"]
[{"$f":"IF(Disclaimer!$C$2=\"English\",B166,IF(Disclaimer!$C$2=\"Russian\",C166,D166))","v":"Industrial Facilities (HVAC)"},"Industrial Facilities (HVAC)","Производственные площади (ОВКВ)","Промислові площини (ОВКП)"]
[{"$f":"IF(Disclaimer!$C$2=\"English\",B167,IF(Disclaimer!$C$2=\"Russian\",C167,D167))","v":"Material Handling"},"Material Handling","Подготовка материалов","Підготовка матеріалів"]
[{"$f":"IF(Disclaimer!$C$2=\"English\",B168,IF(Disclaimer!$C$2=\"Russian\",C168,D168))","v":"Material Processing"},"Material Processing","Обработка материалов","Обробка матеріалів"]
[{"$f":"IF(Disclaimer!$C$2=\"English\",B169,IF(Disclaimer!$C$2=\"Russian\",C169,D169))","v":"Process Cooling and Refrigeration"},"Process Cooling and Refrigeration","Технологическое охлаждение и замораживание","Технологічне охолодження та заморожування"]
[{"$f":"IF(Disclaimer!$C$2=\"English\",B170,IF(Disclaimer!$C$2=\"Russian\",C170,D170))","v":"Process Heating"},"Process Heating","Технологическое тепло","Технологічний обігрів"]
[{"$f":"IF(Disclaimer!$C$2=\"English\",B171,IF(Disclaimer!$C$2=\"Russian\",C171,D171))","v":"Pumps"},"Pumps","Насосы","Насоси"]
[{"$f":"IF(Disclaimer!$C$2=\"English\",B172,IF(Disclaimer!$C$2=\"Russian\",C172,D172))","v":"Steam Generation Equipment"},"Steam Generation Equipment","Оборудование производства пара","Паровиробне обладнання"]
[{"$f":"IF(Disclaimer!$C$2=\"English\",B173,IF(Disclaimer!$C$2=\"Russian\",C173,D173))","v":"Energy Management"},"Energy Management"]
[{"$f":"IF(Disclaimer!$C$2=\"English\",B174,IF(Disclaimer!$C$2=\"Russian\",C174,D174))","v":"Energy Consumption Systems Utilized in the Plant - Default (Default values are used when user defined values are not provided):"},"Energy Consumption Systems Utilized in the Plant - Default (Default values are used when user defined values are not provided):","Энергопотребляющие системы, используемые на установке (по умолчанию):","Системи енерговикористання, що використовуються на установці (За замовчуванням):"]
[{"$f":"IF(Disclaimer!$C$2=\"English\",B175,IF(Disclaimer!$C$2=\"Russian\",C175,D175))","v":"Rating of Major Equipment in the Plant:"},"Rating of Major Equipment in the Plant:","Рейтинг основного оборудования установки:","Рейтинг основного обладнання установки:"]
[{"$f":"IF(Disclaimer!$C$2=\"English\",B176,IF(Disclaimer!$C$2=\"Russian\",C176,D176))","v":"Please provide the quantity, rated size, unit for rated size, % load factor and annual hours of operation  for the major equipment used in the plant."},"Please provide the quantity, rated size, unit for rated size, % load factor and annual hours of operation  for the major equipment used in the plant.","Просим указать количество единиц, паспортную мощность, единицу паспортной мощности, % рабочей загруженности и количество часов работы в год для основного оборудования, используемого на установке.","Просимо зазначити кількість одиниць, паспортну потужність, одиниці паспортної потужності,% робочого завантаження та кількість годин роботи на рік для основного обладнання, що використовується на установці."]
[{"$f":"IF(Disclaimer!$C$2=\"English\",B177,IF(Disclaimer!$C$2=\"Russian\",C177,D177))","v":"Quantity"},"Quantity","Количество","Quantity"]
[{"$f":"IF(Disclaimer!$C$2=\"English\",B178,IF(Disclaimer!$C$2=\"Russian\",C178,D178))","v":"Total Rated Size"},"Total Rated Size","Рейтинг","Rated Size"]
[{"$f":"IF(Disclaimer!$C$2=\"English\",B179,IF(Disclaimer!$C$2=\"Russian\",C179,D179))","v":"Unit for Rated Size"},"Unit for Rated Size","\nАппарат для номинального размера","Апарат для номінального розміру"]
[{"$f":"IF(Disclaimer!$C$2=\"English\",B180,IF(Disclaimer!$C$2=\"Russian\",C180,D180))","v":"% Load factor"},"% Load factor","% \nКоэффициент нагрузки","% коефіцієнт навантаження"]
[{"$f":"IF(Disclaimer!$C$2=\"English\",B181,IF(Disclaimer!$C$2=\"Russian\",C181,D181))","v":"Annual Hours of Operation (hr/year) "},"Annual Hours of Operation (hr/year) ","Количество часов работы за год (часов/год) ","Річна кількість годин роботи (годин/рік) "]
[{"$f":"IF(Disclaimer!$C$2=\"English\",B182,IF(Disclaimer!$C$2=\"Russian\",C182,D182))","v":"Air Compressor"},"Air Compressor","Воздушный компрессор","Повітряний компресор"]
[{"$f":"IF(Disclaimer!$C$2=\"English\",B183,IF(Disclaimer!$C$2=\"Russian\",C183,D183))","v":"Boiler"},"Boiler","Котел","Котел"]
[{"$f":"IF(Disclaimer!$C$2=\"English\",B184,IF(Disclaimer!$C$2=\"Russian\",C184,D184))","v":"Furnace/Oven/Dryers"},"Furnace/Oven/Dryers","Печь/Сушилки","Піч/Сушильні"]
[{"$f":"IF(Disclaimer!$C$2=\"English\",B185,IF(Disclaimer!$C$2=\"Russian\",C185,D185))","v":"Chillers"},"Chillers","Охладители","Охолоджувачі"]
[{"$f":"IF(Disclaimer!$C$2=\"English\",B186,IF(Disclaimer!$C$2=\"Russian\",C186,D186))","v":"Cooling Tower"},"Cooling Tower","Охладительные башни","Охолоджувальні вежі"]
[{"$f":"IF(Disclaimer!$C$2=\"English\",B187,IF(Disclaimer!$C$2=\"Russian\",C187,D187))","v":"Major Pumps"},"Major Pumps","Основные насосы","Основні насоси"]
[{"$f":"IF(Disclaimer!$C$2=\"English\",B188,IF(Disclaimer!$C$2=\"Russian\",C188,D188))","v":"Major Fans and blowers"},"Major Fans and blowers","Основные вентиляторы и воздуходувки","Основні вентилятори та повітродувки"]
[{"$f":"IF(Disclaimer!$C$2=\"English\",B189,IF(Disclaimer!$C$2=\"Russian\",C189,D189))","v":"Energy Savings Opportunities"},"Energy Savings Opportunities","Возможности энергосбережения","Можливості енергозаощадження"]
[{"$f":"IF(Disclaimer!$C$2=\"English\",B190,IF(Disclaimer!$C$2=\"Russian\",C190,D190))","v":"Please respond to the following questions on Energy saving opportunities"},"Please respond to the following questions on Energy saving opportunities","Просим дать ответы на следующие вопросы по возможностям энергосбережения","Просимо відповісти на наступні запитання щодо можливостей енергозаощадження"]
[{"$f":"IF(Disclaimer!$C$2=\"English\",B191,IF(Disclaimer!$C$2=\"Russian\",C191,D191))","v":"1)Use the following table to characterize the potential energy savings opportunities for the various major systems in your plant. Use the criteria listed below to categorize your energy use systems."},"1)Use the following table to characterize the potential energy savings opportunities for the various major systems in your plant. Use the criteria listed below to categorize your energy use systems.","Воспользуйтесь приведенной таблицей для описания потенциальных возможностей энергосбережения для разных основных систем Вашей установки. Для описания Ваших энергопотребляющих систем воспользуйтесь приведенными здесь критериями."," Скористайтеся поданою тут таблицею й опишіть потенційні можливості енергозаощадження для різних основних систем Вашої установки. "]
[{"$f":"IF(Disclaimer!$C$2=\"English\",B192,IF(Disclaimer!$C$2=\"Russian\",C192,D192))","v":"2) If the user wants to use scorecard to characterize the potential energy saving opportunities fro major system please select scorecard from the drop down list. "},"2) If the user wants to use scorecard to characterize the potential energy saving opportunities fro major system please select scorecard from the drop down list. ","2) Если пользователь желает воспользоваться карточкой оценки для характеристики потенциальных возможностей экономии энергии на главной системе, просим выбрать карточку из выплывающего списка. ","2) Якщо користувач бажає скористатися карткою оцінки щоб охарактеризувати потенційні можливості заощадження енергії на головній системі, просимо вибрати картку оцінки з випливного списку. "]
[{"$f":"IF(Disclaimer!$C$2=\"English\",B193,IF(Disclaimer!$C$2=\"Russian\",C193,D193))","v":"High = No system assessment completed in the last three years/ Don't know"},"High = No system assessment completed in the last three years/ Don't know","Большие = Оценка системы не проводилась / Данные отсутствуют","Великі = Системи не оцінювалися / Відомостей не маємо"]
[{"$f":"IF(Disclaimer!$C$2=\"English\",B194,IF(Disclaimer!$C$2=\"Russian\",C194,D194))","v":"Medium = System assessment completed but little or no implementation completed in the last three years"},"Medium = System assessment completed but little or no implementation completed in the last three years","Средние = Оценка систем проводилась, но никакие или почти никакие усовершенствования не внедрялись","Середні = Оцінка систем проводилась, але жодних або майже жодних удосконалень не було"]
[{"$f":"IF(Disclaimer!$C$2=\"English\",B195,IF(Disclaimer!$C$2=\"Russian\",C195,D195))","v":"Low = System assessment completed and substantial implementation completed in the last three years"},"Low = System assessment completed and substantial implementation completed in the last three years","Маленькие = Оценка системы была проведена, после чего были внедрены значительные усовершенствования","Малі = Система була піддана оцінці, після чого були запроваджені істотні удосконалення"]
[{"$f":"IF(Disclaimer!$C$2=\"English\",B196,IF(Disclaimer!$C$2=\"Russian\",C196,D196))","v":"Energy Use System"},"Energy Use System","Энергопотребляющая система","Система енерговикористання"]
[{"$f":"IF(Disclaimer!$C$2=\"English\",B197,IF(Disclaimer!$C$2=\"Russian\",C197,D197))","v":"Energy Saving Opportunity Level"},"Energy Saving Opportunity Level","Уровень возможностей энергосбережения","Рівень можливостей енергозаощадження"]
[{"$f":"IF(Disclaimer!$C$2=\"English\",B198,IF(Disclaimer!$C$2=\"Russian\",C198,D198))","v":"Industry"},"Industry","Отрасль промышленности","Галузь промисловості"]
[{"$f":"IF(Disclaimer!$C$2=\"English\",B199,IF(Disclaimer!$C$2=\"Russian\",C199,D199))","v":"Aluminum and Alumina "},"Aluminum and Alumina ","Алюминий и глинозем","Алюміній та глинозем"]
[{"$f":"IF(Disclaimer!$C$2=\"English\",B200,IF(Disclaimer!$C$2=\"Russian\",C200,D200))","v":"Cement "},"Cement ","Цемент ","Цемент "]
[{"$f":"IF(Disclaimer!$C$2=\"English\",B201,IF(Disclaimer!$C$2=\"Russian\",C201,D201))","v":"Chemical and Allied Products "},"Chemical and Allied Products ","Химическая и сопутствующая продукция ","Хімічна та супутня продукція "]
[{"$f":"IF(Disclaimer!$C$2=\"English\",B202,IF(Disclaimer!$C$2=\"Russian\",C202,D202))","v":"Computer, Electronics and Appliances "},"Computer, Electronics and Appliances ","Компьютеры, электронные и бытовые приборы ","Комп'ютери, електронні та побутові прилади "]
[{"$f":"IF(Disclaimer!$C$2=\"English\",B203,IF(Disclaimer!$C$2=\"Russian\",C203,D203))","v":"Fabricated Metal Products"},"Fabricated Metal Products","Готовая металлопродукция","Готова металева продукція"]
[{"$f":"IF(Disclaimer!$C$2=\"English\",B204,IF(Disclaimer!$C$2=\"Russian\",C204,D204))","v":"Food, Beverage and  Tobacco Products "},"Food, Beverage and  Tobacco Products ","Продукты питания, напитки и табак ","Продукти харчування, напої та тютюн "]
[{"$f":"IF(Disclaimer!$C$2=\"English\",B205,IF(Disclaimer!$C$2=\"Russian\",C205,D205))","v":"Foundries "},"Foundries ","Литейное производство ","Ливарництво "]
[{"$f":"IF(Disclaimer!$C$2=\"English\",B206,IF(Disclaimer!$C$2=\"Russian\",C206,D206))","v":"Glass and Glass Products "},"Glass and Glass Products ","Стекло и стеклянная продукция ","Скло і скляна продукція "]
[{"$f":"IF(Disclaimer!$C$2=\"English\",B207,IF(Disclaimer!$C$2=\"Russian\",C207,D207))","v":"Heavy Machinery "},"Heavy Machinery ","Тяжелое машиностроение ","Важке машинобудування "]
[{"$f":"IF(Disclaimer!$C$2=\"English\",B208,IF(Disclaimer!$C$2=\"Russian\",C208,D208))","v":"Integrated Steel "},"Integrated Steel ","Полный металлургический цикл ","Повний металургійний цикл "]
[{"$f":"IF(Disclaimer!$C$2=\"English\",B209,IF(Disclaimer!$C$2=\"Russian\",C209,D209))","v":"Petroleum Refining "},"Petroleum Refining ","Нефтепереработка ","Нафтопереробка "]
[{"$f":"IF(Disclaimer!$C$2=\"English\",B210,IF(Disclaimer!$C$2=\"Russian\",C210,D210))","v":"Plastic and Rubber Products "},"Plastic and Rubber Products ","Пластмассовая и резиновая продукция","Пластмасова та гумова продукція"]
[{"$f":"IF(Disclaimer!$C$2=\"English\",B211,IF(Disclaimer!$C$2=\"Russian\",C211,D211))","v":"Textile and Apparels and Leather goods "},"Textile and Apparels and Leather goods ","Текстиль, одежда и кожаные изделия ","Текстиль, одяг та шкіряні вироби "]
[{"$f":"IF(Disclaimer!$C$2=\"English\",B212,IF(Disclaimer!$C$2=\"Russian\",C212,D212))","v":"Transportation Equipment "},"Transportation Equipment ","Транспортная техника ","Транспортна техніка "]
[{"$f":"IF(Disclaimer!$C$2=\"English\",B213,IF(Disclaimer!$C$2=\"Russian\",C213,D213))","v":"Wood Produces, Pulp and Paper "},"Wood Produces, Pulp and Paper ","Деревообрабатывающая, целлюлозно-бумажная ","Деревообробна, целюлозо-паперова "]
[{"$f":"IF(Disclaimer!$C$2=\"English\",B214,IF(Disclaimer!$C$2=\"Russian\",C214,D214))","v":"Others (All Manufacturing)"},"Others (All Manufacturing)","Другое (различное производство-","Інше (різне виробництво-"]
[{"$f":"IF(Disclaimer!$C$2=\"English\",B215,IF(Disclaimer!$C$2=\"Russian\",C215,D215))","v":"Units Build"},"Units Build","Строительные единицы","Будівельні одиниці"]
[{"$f":"IF(Disclaimer!$C$2=\"English\",B216,IF(Disclaimer!$C$2=\"Russian\",C216,D216))","v":"Metric Tons"},"Metric Tons","Метрические тонны","Метричні тони"]
[{"$f":"IF(Disclaimer!$C$2=\"English\",B217,IF(Disclaimer!$C$2=\"Russian\",C217,D217))","v":"Yes"},"Yes","Да","Так"]
[{"$f":"IF(Disclaimer!$C$2=\"English\",B218,IF(Disclaimer!$C$2=\"Russian\",C218,D218))","v":"No"},"No","Нет","Ні"]
[{"$f":"IF(Disclaimer!$C$2=\"English\",B219,IF(Disclaimer!$C$2=\"Russian\",C219,D219))","v":"N/A"},"N/A","N/A","N/A"]
[{"$f":"IF(Disclaimer!$C$2=\"English\",B220,IF(Disclaimer!$C$2=\"Russian\",C220,D220))","v":"MJ"},"MJ","МДж","МДж"]
[{"$f":"IF(Disclaimer!$C$2=\"English\",B221,IF(Disclaimer!$C$2=\"Russian\",C221,D221))","v":"MWH"},"MWH","МВт-час","МВт-годин"]
[{"$f":"IF(Disclaimer!$C$2=\"English\",B222,IF(Disclaimer!$C$2=\"Russian\",C222,D222))","v":"$/kWh"},"$/kWh","$/кВт-час","$/кВт-год."]
[{"$f":"IF(Disclaimer!$C$2=\"English\",B223,IF(Disclaimer!$C$2=\"Russian\",C223,D223))","v":"$/Kilo Joules"},"$/Kilo Joules","$/килоджоуль","$/кілоджоуль"]
[{"$f":"IF(Disclaimer!$C$2=\"English\",B224,IF(Disclaimer!$C$2=\"Russian\",C224,D224))","v":"Weekly"},"Weekly","Раз в неделю","Раз на тиждень"]
[{"$f":"IF(Disclaimer!$C$2=\"English\",B225,IF(Disclaimer!$C$2=\"Russian\",C225,D225))","v":"Monthly"},"Monthly","Раз в месяц","Раз на місяць"]
[{"$f":"IF(Disclaimer!$C$2=\"English\",B226,IF(Disclaimer!$C$2=\"Russian\",C226,D226))","v":"Quarterly "},"Quarterly ","Раз в квартал","Раз на квартал "]
[{"$f":"IF(Disclaimer!$C$2=\"English\",B227,IF(Disclaimer!$C$2=\"Russian\",C227,D227))","v":"Semi-annually"},"Semi-annually","Раз в полгода","Раз на півроку"]
[{"$f":"IF(Disclaimer!$C$2=\"English\",B228,IF(Disclaimer!$C$2=\"Russian\",C228,D228))","v":"Annually"},"Annually","Раз в год","Раз на рік"]
[{"$f":"IF(Disclaimer!$C$2=\"English\",B229,IF(Disclaimer!$C$2=\"Russian\",C229,D229))","v":"N/A"},"N/A","N/A","N/A"]
[{"$f":"IF(Disclaimer!$C$2=\"English\",B230,IF(Disclaimer!$C$2=\"Russian\",C230,D230))","v":"HP"},"HP","л.с.","к.с.."]
[{"$f":"IF(Disclaimer!$C$2=\"English\",B231,IF(Disclaimer!$C$2=\"Russian\",C231,D231))","v":"Metric Tons"},"Metric Tons","Метрические тонны","Метричні тони"]
[{"$f":"IF(Disclaimer!$C$2=\"English\",B232,IF(Disclaimer!$C$2=\"Russian\",C232,D232))","v":"kJ/ Hr."},"kJ/ Hr.","Джоулей/ час","Джоулів/ год."]
[{"$f":"IF(Disclaimer!$C$2=\"English\",B233,IF(Disclaimer!$C$2=\"Russian\",C233,D233))","v":"KW"},"KW","кВт","кВт"]
[{"$f":"IF(Disclaimer!$C$2=\"English\",B234,IF(Disclaimer!$C$2=\"Russian\",C234,D234))","v":"MMBTU/hr"},"MMBTU/hr"]
[{"$f":"IF(Disclaimer!$C$2=\"English\",B235,IF(Disclaimer!$C$2=\"Russian\",C235,D235))","v":"Greater than 80%"},"Greater than 80%","Свыше 80%","Більше 80%"]
[{"$f":"IF(Disclaimer!$C$2=\"English\",B236,IF(Disclaimer!$C$2=\"Russian\",C236,D236))","v":"40% to 80%"},"40% to 80%","40% - 80%","40% - 80%"]
[{"$f":"IF(Disclaimer!$C$2=\"English\",B237,IF(Disclaimer!$C$2=\"Russian\",C237,D237))","v":"20% to 40%"},"20% to 40%","20% - 40%","20% - 40%"]
[{"$f":"IF(Disclaimer!$C$2=\"English\",B238,IF(Disclaimer!$C$2=\"Russian\",C238,D238))","v":"less than 20%"},"less than 20%","Менее 20%","менше 20%"]
[{"$f":"IF(Disclaimer!$C$2=\"English\",B239,IF(Disclaimer!$C$2=\"Russian\",C239,D239))","v":"Use Scorecard"},"Use Scorecard","Use Scorecard","картка оцінок"]
[{"$f":"IF(Disclaimer!$C$2=\"English\",B240,IF(Disclaimer!$C$2=\"Russian\",C240,D240))","v":"High "},"High ","Высокий","Високий"]
[{"$f":"IF(Disclaimer!$C$2=\"English\",B241,IF(Disclaimer!$C$2=\"Russian\",C241,D241))","v":"Medium"},"Medium","Средний","Середній"]
[{"$f":"IF(Disclaimer!$C$2=\"English\",B242,IF(Disclaimer!$C$2=\"Russian\",C242,D242))","v":"Low"},"Low","Низкий","Низький"]
[{"$f":"IF(Disclaimer!$C$2=\"English\",B243,IF(Disclaimer!$C$2=\"Russian\",C243,D243))","v":"N/A"},"N/A","N/A","N/A"]
[{"$f":"IF(Disclaimer!$C$2=\"English\",B244,IF(Disclaimer!$C$2=\"Russian\",C244,D244))","v":"Electricity"},"Electricity","Электроэнергия","Електроенергія"]
[{"$f":"IF(Disclaimer!$C$2=\"English\",B245,IF(Disclaimer!$C$2=\"Russian\",C245,D245))","v":"Natural Gas"},"Natural Gas","Природный газ","Природний газ"]
[{"$f":"IF(Disclaimer!$C$2=\"English\",B246,IF(Disclaimer!$C$2=\"Russian\",C246,D246))","v":"Steam"},"Steam","Пар","Пара"]
[{"$f":"IF(Disclaimer!$C$2=\"English\",B247,IF(Disclaimer!$C$2=\"Russian\",C247,D247))","v":"Other Fuel"},"Other Fuel","Другое топливо","Інше пальне"]
[{"$f":"IF(Disclaimer!$C$2=\"English\",B248,IF(Disclaimer!$C$2=\"Russian\",C248,D248))","v":"$/kWh"},"$/kWh","$/кВт-час","$/кВт-год."]
[{"$f":"IF(Disclaimer!$C$2=\"English\",B249,IF(Disclaimer!$C$2=\"Russian\",C249,D249))","v":"$/MWh"},"$/MWh","$/МВт-час","$/МВт-год."]
[{"$f":"IF(Disclaimer!$C$2=\"English\",B250,IF(Disclaimer!$C$2=\"Russian\",C250,D250))","v":"$/MJ"},"$/MJ","$/МДж","$/МДж"]
[{"$f":"IF(Disclaimer!$C$2=\"English\",B251,IF(Disclaimer!$C$2=\"Russian\",C251,D251))","v":"$/cu.ft"},"$/cu.ft","$/куб. фут","$/куб. фут"]
[{"$f":"IF(Disclaimer!$C$2=\"English\",B252,IF(Disclaimer!$C$2=\"Russian\",C252,D252))","v":"$/gallon"},"$/gallon","$/галлон","$/галон"]
[{"$f":"IF(Disclaimer!$C$2=\"English\",B253,IF(Disclaimer!$C$2=\"Russian\",C253,D253))","v":"$/metric ton"},"$/metric ton","$/метрическая тонна","$/метрична тонна"]
[{"$f":"IF(Disclaimer!$C$2=\"English\",B254,IF(Disclaimer!$C$2=\"Russian\",C254,D254))","v":"Other Electricity Generation"},"Other Electricity Generation","Другое производство электроэнергии","Інше виробництво електроенергії"]
[{"$f":"IF(Disclaimer!$C$2=\"English\",B255,IF(Disclaimer!$C$2=\"Russian\",C255,D255))","v":"Other Machine Driven Systems"},"Other Machine Driven Systems","Другие системы с механическим приводом","Інші системи з механічним приводом"]
[{"$f":"IF(Disclaimer!$C$2=\"English\",B256,IF(Disclaimer!$C$2=\"Russian\",C256,D256))","v":"Other Process Uses"},"Other Process Uses","Другие технологические применения","Інші технологічні застосування"]
[{"$f":"IF(Disclaimer!$C$2=\"English\",B257,IF(Disclaimer!$C$2=\"Russian\",C257,D257))","v":"Other Facility Support"},"Other Facility Support","Другое обслуживание площадей","Інше обслуговування площин"]
[{"$f":"IF(Disclaimer!$C$2=\"English\",B258,IF(Disclaimer!$C$2=\"Russian\",C258,D258))","v":"Onsite Transportation"},"Onsite Transportation","Внутренние перевозки","Внутрішні перевезення"]
[{"$f":"IF(Disclaimer!$C$2=\"English\",B259,IF(Disclaimer!$C$2=\"Russian\",C259,D259))","v":"Other Nonprocess Uses"},"Other Nonprocess Uses","Другие применения помимо технологических нужд","Інші застосування поза технологічними потребами"]
[{"$f":"IF(Disclaimer!$C$2=\"English\",B260,IF(Disclaimer!$C$2=\"Russian\",C260,D260))","v":"Yes/No"},"Yes/No","Да/Нет","Так/Ні"]
[{"$f":"IF(Disclaimer!$C$2=\"English\",B261,IF(Disclaimer!$C$2=\"Russian\",C261,D261))","v":"Annual Primary Energy"},"Annual Primary Energy","Энергия первичного источника в год","Енергія первинного джерела на рік"]
[{"$f":"IF(Disclaimer!$C$2=\"English\",B262,IF(Disclaimer!$C$2=\"Russian\",C262,D262))","v":"Annual Secondary Energy"},"Annual Secondary Energy","Энергия вторичного источника в год","Енергія вторинного джерела на рік"]
[{"$f":"IF(Disclaimer!$C$2=\"English\",B263,IF(Disclaimer!$C$2=\"Russian\",C263,D263))","v":"Primary Energy Cost"},"Primary Energy Cost","Стоимость энергии первичного источника","Вартість енергії первинного джерела"]
[{"$f":"IF(Disclaimer!$C$2=\"English\",B264,IF(Disclaimer!$C$2=\"Russian\",C264,D264))","v":"Secondary Energy Cost"},"Secondary Energy Cost","Стоимость энергии вторичного источника","Вартість енергії вторинного джерела"]
[{"$f":"IF(Disclaimer!$C$2=\"English\",B265,IF(Disclaimer!$C$2=\"Russian\",C265,D265))","v":"Unit cost of Energy"},"Unit cost of Energy","Стоимость единицы энергии","Вартість одиниці енергії:"]
[{"$f":"IF(Disclaimer!$C$2=\"English\",B266,IF(Disclaimer!$C$2=\"Russian\",C266,D266))","v":"Energy Type"},"Energy Type","Вид энергии","Вид енергії"]
[{"$f":"IF(Disclaimer!$C$2=\"English\",B267,IF(Disclaimer!$C$2=\"Russian\",C267,D267))","v":"Ranges for ePeP scorecard Result"},"Ranges for ePeP scorecard Result","Интервалы для результата карточки оценки ePeP","Інтервали для результату картки оцінки ePeP"]
[{"$f":"IF(Disclaimer!$C$2=\"English\",B268,IF(Disclaimer!$C$2=\"Russian\",C268,D268))","v":"Score Card"},"Score Card","карточка оценок","картка оцінок"]
[{"$f":"IF(Disclaimer!$C$2=\"English\",B269,IF(Disclaimer!$C$2=\"Russian\",C269,D269))","v":"Point"},"Point","Пункт","Пункт"]
[{"$f":"IF(Disclaimer!$C$2=\"English\",B270,IF(Disclaimer!$C$2=\"Russian\",C270,D270))","v":"Ranking"},"Ranking","Рейтинг","Рейтинг"]
[{"$f":"IF(Disclaimer!$C$2=\"English\",B271,IF(Disclaimer!$C$2=\"Russian\",C271,D271))","v":"End Use"},"End Use","Конечное применение","Кінцеве застосування"]
[{"$f":"IF(Disclaimer!$C$2=\"English\",B272,IF(Disclaimer!$C$2=\"Russian\",C272,D272))","v":"Ranking  and Potential Percent of Savings for each End Use based on Scorecard and User Input"},"Ranking  and Potential Percent of Savings for each End Use based on Scorecard and User Input","Рейтинг и потенциальная доля экономии для каждого конечного применения на основе карточки оценок и данных пользователя","Рейтинг та початкова частка економії для кожного кінцевого користувача на основі картки оцінок та даних користувача"]
[{"$f":"IF(Disclaimer!$C$2=\"English\",B273,IF(Disclaimer!$C$2=\"Russian\",C273,D273))","v":"User Input"},"User Input","Данные пользователя","Дані користувача"]
[{"$f":"IF(Disclaimer!$C$2=\"English\",B274,IF(Disclaimer!$C$2=\"Russian\",C274,D274))","v":"% saving based on input"},"% saving based on input","% экономии, исходя из данных пользователя","% економії, виходячи з даних користувача"]
[{"$f":"IF(Disclaimer!$C$2=\"English\",B275,IF(Disclaimer!$C$2=\"Russian\",C275,D275))","v":"Energy Saving "},"Energy Saving ","Экономия энергии ","Економія енергії "]
[{"$f":"IF(Disclaimer!$C$2=\"English\",B276,IF(Disclaimer!$C$2=\"Russian\",C276,D276))","v":"% Energy Consumption by system "},"% Energy Consumption by system ","% потребления энергии на систему ","% споживання енергії на систему "]
[{"$f":"IF(Disclaimer!$C$2=\"English\",B277,IF(Disclaimer!$C$2=\"Russian\",C277,D277))","v":"Miscellaneous"},"Miscellaneous","Другое","Інше"]
[{"$f":"IF(Disclaimer!$C$2=\"English\",B278,IF(Disclaimer!$C$2=\"Russian\",C278,D278))","v":"1) Consider use of heat from diesel generator engine (cooling water and exhaust gases) for steam generation or in heating processes.\n\n2) Consider use of heat from gas turbine exhaust gases for steam generation or in heating processes.\n\n3) Develop and implement a preventive and predictive maintenance program for the system.\n\n4) Maximize use of HRSG to meet the plant steam requirements, minimize load on boilers outside the co-gen system"},"1) Consider use of heat from diesel generator engine (cooling water and exhaust gases) for steam generation or in heating processes.\n\n2) Consider use of heat from gas turbine exhaust gases for steam generation or in heating processes.\n\n3) Develop and implement a preventive and predictive maintenance program for the system.\n\n4) Maximize use of HRSG to meet the plant steam requirements, minimize load on boilers outside the co-gen system","1) Учтите использование тепла двигателя дизель-генератора (охлаждающая вода и выхлопные газы) для выработки пара или в технологиях нагрева.\n2) Учтите использование тепла  выхлопных газов газотурбины для выработки пара или в технологиях разогрева.\n3) Разработайте и внедрите программу превентивного и диагностического обслуживания для системы.\n4) Максимизируйте использование HRSG для удовлетворения потребностей установки в паре, минимизируйте нагрузку на котлы за пределами системы когенерации","1) Зважте на можливість використання тепла дизель-генератора (охолоджувальна вода та відхідні гази) для вироблення пари або в технологіях нагрівання.\n2) Зважте на використання тепла відхідних газів газотурбіни для вироблення пари або в технологіях нагрівання.\n3) Розробіть і запровадьте програму превентивного і діагностичного обслуговування для системи.\n4) Максимізуйте використання HRSG для задоволення потреб установки в парі, мінімізуйте навантаження на котли за межами системи когенерації"]
[{"$f":"IF(Disclaimer!$C$2=\"English\",B279,IF(Disclaimer!$C$2=\"Russian\",C279,D279))","v":"1) Consider use of HRSG with a duct burner (if not used currently) for gas turbine based on-site power generation system\n\n2) Investigate possibility of selling excess steam or/and power if there is a potential customer close by.\n\n3) Minimize flue gases temperature from HRSG by recovering heat from HRSG flue gases.\n\n4) Use system optimization tools to minimize combined cost of steam and electric power for the plant"},"1) Consider use of HRSG with a duct burner (if not used currently) for gas turbine based on-site power generation system\n\n2) Investigate possibility of selling excess steam or/and power if there is a potential customer close by.\n\n3) Minimize flue gases temperature from HRSG by recovering heat from HRSG flue gases.\n\n4) Use system optimization tools to minimize combined cost of steam and electric power for the plant","1) Рассмотрите вариант применения HRSG с канальной горелкой (если сейчас не применяется) для газотурбины системы выработки электроэнергии на объекте\n\n2) Исследуйте возможность продажи излишков пара и/или электроэнергии, если где-то рядом имеется потенциальный заказчик.\n\n3) Минимизируйте температуру отработанных газов HRSG путем отбора тепла этих газов.\n\n4) Воспользуйтесь инструментом оптимизации системы для минимизации суммарной стоимости пара и электроэнергии для установки","1) Розгляньте варіант застосування HRSG з канальним пальником (якщо зараз не застосовується) для газотурбіни, що виробляє електроенергію на об'єкті \n\n2) Дослідіть можливість продажу надлишків пари та/або електроенергії, якщо поблизу є потенційний замовник.\n\n3) Мінімізуйте температуру відпрацьованих газів HRSG шляхом відбору тепла цих газів\n\n4) Скористайтеся інструментом оптимізації системи для мінімізації сумарної вартості пари та електроенергії для установки"]
[{"$f":"IF(Disclaimer!$C$2=\"English\",B280,IF(Disclaimer!$C$2=\"Russian\",C280,D280))","v":"1) Analyze economics of use of additional CHP capacity to reduce peak power demand for the plant.\n\n2) Consider evaporative cooling for turbine combustion air using HRSG exhaust gases or other source of waste heat.\n\n3) Consider use of turbine exhaust gases for process heating equipment (process heaters, furnaces etc.)"},"1) Analyze economics of use of additional CHP capacity to reduce peak power demand for the plant.\n\n2) Consider evaporative cooling for turbine combustion air using HRSG exhaust gases or other source of waste heat.\n\n3) Consider use of turbine exhaust gases for process heating equipment (process heaters, furnaces etc.)","1) Проанализируйте экономику использования дополнительной мощности ТЭЦ для сокращения пиковых потребностей в электроэнергии на установке.\n\n2) Рассмотрите вариант испарительного охлаждения для воздуха сгорания турбины за счет использования выхлопных газов HRSG или другого источника неиспользуемого тепла.\n\n3) Рассмотрите вариант использования выхлопных газов турбины для оборудования технологического тепла (технологические нагреватели, печи и т.п.)","1) Проаналізуйте економіку використання додаткової потужності ТЕЦ для зменшення пікових потреб в електроенергії на установці.\n\n2) Розгляньте варіант випаровувального охолодження для повітря камери турбіни за рахунок використання відхідних газів HRSG або ж іншого джерела тепла, що не використовується.\n\n3) Розгляньте варіант використання відхідних газів турбіни для обладнання технологічного тепла (технологічні нагрівачі, печі, тощо)"]
[{"$f":"IF(Disclaimer!$C$2=\"English\",B281,IF(Disclaimer!$C$2=\"Russian\",C281,D281))","v":"1) Eliminate inappropriate uses of compressed air.\n\n2) Implement air leak management program.\n\n3) Perform a detailed Compressed Air System Assessment at your site.\n\n4) Reduce compressor operating pressure with or without controls."},"1) Eliminate inappropriate uses of compressed air.\n\n2) Implement air leak management program.\n\n3) Perform a detailed Compressed Air System Assessment at your site.\n\n4) Reduce compressor operating pressure with or without controls.","1) Устраните использование сжатого воздуха не по назначению.\n\n2) Внедрите программу контроля утечек воздуха.\n\n3) Проведите на объекте детальную оценку системы сжатого воздуха.\n\n4) Уменьшите рабочее давление компрессоров, имеющих и не имеющих органы управления давлением.","1) Усуньте використання стиснутого повітря не за призначенням.\n\n2) Впровадьте програму контролю витоків повітря.\n\n3) Проведіть на об'єкті детальну оцінку системи стиснутого повітря.\n\n4) Уменшіть робочий тиск компресорів, які мають або не мають органи управління тиском."]
[{"$f":"IF(Disclaimer!$C$2=\"English\",B282,IF(Disclaimer!$C$2=\"Russian\",C282,D282))","v":"1) Implement the recommendations of the Compressed Air System Assessment at your site.\n\n2) Install and operate equipment (including storage) that matches shifting demands\n\n3) Install or upgrade system controls\n\n4) Use the DOE AirMaster+ software tool & other resources to verify energy saving opportunities\n\n5) Install instrumentation to measure and trend compressed air cost indicators (kW/100 cfm)."},"1) Implement the recommendations of the Compressed Air System Assessment at your site.\n\n2) Install and operate equipment (including storage) that matches shifting demands\n\n3) Install or upgrade system controls\n\n4) Use the DOE AirMaster+ software tool & other resources to verify energy saving opportunities\n\n5) Install instrumentation to measure and trend compressed air cost indicators (kW/100 cfm).","1) Внедрите на объекте рекомендации по результатам оценки системы сжатого воздуха.\n\n2) Установите и эксплуатируйте оборудование (включая складское), отвечающее потребностям сменной работы\n\n3) Установите или усовершенствуйте органы управления системой\n\n4) Используйте программный инструмент Минэнерго AirMaster+ и другие ресурсы для проверки возможностей экономии энергии\n\n5) Установите приборы для измерения показателей стоимости сжатого воздуха и отслеживания ее трендов (кВт/100 кфм).","1)Впровадьте на об'єкті рекомендації за результатами оцінки системи стиснутого повітря.\n\n2) Встановіть та експлуатуйте обладнання (включаючи складське), яке відповідало б потребам позмінної роботи\n\n3) Встановіть або вдоскональте органи управління системою\n\n4) Скористайтеся програним інструментом Міненерго AirMaster+ та іншими ресурсами для перевірки можливостей заощадження енергії\n\n5) Встановіть прилади для вимірювання показників вартості стиснутого повітря та відстеження її трендів (кВт/100 кфм)."]
[{"$f":"IF(Disclaimer!$C$2=\"English\",B283,IF(Disclaimer!$C$2=\"Russian\",C283,D283))","v":"1) Evaluate heat recovery with compressed air systems.\n\n2) Monitor performance and document energy and cost savings on recently completed projects.\n\n3) Replace inefficient cooling and drying equipment.\n\n4) Install instrumentation to measure and trend compressed air cost indicators (kW/100 cfm)\n"},"1) Evaluate heat recovery with compressed air systems.\n\n2) Monitor performance and document energy and cost savings on recently completed projects.\n\n3) Replace inefficient cooling and drying equipment.\n\n4) Install instrumentation to measure and trend compressed air cost indicators (kW/100 cfm)\n","1) Проведите оценку возврата тепла в системах сжатого воздуха.\n\n2) Отследите рабочие параметры и зафиксируйте экономию энергии и затрат в недавно завершенных проектах.\n\n3) Замените неэффективное охлаждающее и сушильное оборудование.\n\n4) Установите приборы для измерения показателей стоимости сжатого воздуха и создания ее трендов (кВт/100 кфм)\n","1) Проведіть оцінку повернення тепла в системах стиснутого повітря.\n\n2) Відстежуйте робочі параметри та фіксуйте економію енергії та коштів в нещодавно завершених проектах.\n\n3) Здійсніть заміну неефективного охолоджувального та сушильного обладнання.\n\n4) Встановіть прилади для вимірювання показників вартості стиснутого повітря та формування її трендів (кВт/100 кфм)\n"]
[{"$f":"IF(Disclaimer!$C$2=\"English\",B284,IF(Disclaimer!$C$2=\"Russian\",C284,D284))","v":"1) Evaluate and reduce \"system effect\" through better inlet and outlet designs and duct sizing.\n\n2) Improve O&M practices such as belt tightening, cleaning fans and changing filters regularly.\n\n3) Minimize leakage and perform tightness tests, if needed.\n\n4) Perform a detailed Fan and Blower System Assessment at your site.\n\n5) Replace dampers, variable inlet vanes with electronic variable speed drives for meeting variable loads.\n\n6) Use the DOE FSAT software tool & other resources to identify and quantify energy saving opportunities"},"1) Evaluate and reduce \"system effect\" through better inlet and outlet designs and duct sizing.\n\n2) Improve O&M practices such as belt tightening, cleaning fans and changing filters regularly.\n\n3) Minimize leakage and perform tightness tests, if needed.\n\n4) Perform a detailed Fan and Blower System Assessment at your site.\n\n5) Replace dampers, variable inlet vanes with electronic variable speed drives for meeting variable loads.\n\n6) Use the DOE FSAT software tool & other resources to identify and quantify energy saving opportunities","1) Оцените \"эффект системы\" и уменьшите его влияние путем подбора более удачных конструкций впуска и выпуска, а также размеров трубопроводов.\n\n2) Добейтесь регулярности проведения таких видов обслуживания как подтяжка ремней, очистка вентиляторов и смена фильтров.\n\n3) Минимизируйте утечки и при необходимости проведите тест на герметичность.\n\n4) Проведите детальную оценку систем вентиляторов и воздуходувок на объекте.\n\n5) Замените шиберы, впускные устройства изменяемого размера на приводы с электронным управлением скоростью для адаптации к изменяемым нагрузкам.\n\n6) Воспользуйтесь программным инструментом Минэнерго DOE FSAT и другими ресурсами для выявления и количественной оценки возможностей экономии энергии ","1) Оцініть \"ефекти системи\" та уменшіть його вплив шляхом підбору більш досконалих конструкцій впуску та випуску, а також розміру трубопроводів.\n\n2) Домагайтеся регулярності проведення таких виді обслуговування як підтягування ременів та заміна фільтрів.\n\n3) Мінімізуйте витоки та, за необхідності, проведіть тест на герметичність.\n\n4) Проведіть детальну оцінку систем вентиляторів та повітродувок на об'єкті.\n\n5) Замініть шибери, впускні пристрої перемінного розміру на приводи з електронним управлінням швидкістю для адаптації до навантажень, що змінюються.\n\n6) Скористайтеся програним інструментом Міненерго FSAT та іншими ресурсами для виявлення можливостей заощадження енергії та їх кількісної оцінки"]
[{"$f":"IF(Disclaimer!$C$2=\"English\",B285,IF(Disclaimer!$C$2=\"Russian\",C285,D285))","v":"1)Implement the recommendations of the Fans / Blowers System Assessment at your site\n\n2)Reduce and control fan speed by using variable speed drives\n\n3)Reduce fan oversizing by matching demand with proper fan type and size (for example: Use of axial fan with controllable pitch blades)\n\n4)Replace standard V-belts with cogged V-belts.\n\n5)Use the DOE FSAT software tool & other resources to verify energy saving opportunities"},"1)Implement the recommendations of the Fans / Blowers System Assessment at your site\n\n2)Reduce and control fan speed by using variable speed drives\n\n3)Reduce fan oversizing by matching demand with proper fan type and size (for example: Use of axial fan with controllable pitch blades)\n\n4)Replace standard V-belts with cogged V-belts.\n\n5)Use the DOE FSAT software tool & other resources to verify energy saving opportunities","1) Внедрите на объекте рекомендации по результатам оценки вентиляторов/воздуходувок\n\n2) Уменьшите и контролируйте скорость вентиляторов путем применения приводов с изменяемой скоростью\n\n3) Избегайте применения вентиляторов излишней мощности путем подбора вентиляторов подходящего типа и мощности (например, применение осевого вентилятора с управляемым шагом лопастей)\n\n4) Замените клиновидные обычные ремни зубчатыми клиновидными ремнями.\n\n5) Используйте программный инструмент Минэнерго FSAT и другие ресурсы для проверки возможностей экономии энергии","1)Впровадьте на об'єкті рекомендації за результатами оцінки вентиляторів / повітродувок\n2) Уменшіть та контролюйте швидкість вентиляторів шляхом застосування провидів з перемінною швидкістю\n\n3) Никайте застосування вентиляторів надлишкової потужності шляхом підбору вентиляторів належного типу і потужності (наприклад, осьового вентилятора з керованим кроком лопатей)\n\n4) Замініть клиновидні звичайні ремені на зубчасті клиновидні ремені\n\n5) Скористайтеся програним інструментом Міненерго FSAT та іншими ресурсами для оцінки можливостей економії енергії"]
[{"$f":"IF(Disclaimer!$C$2=\"English\",B286,IF(Disclaimer!$C$2=\"Russian\",C286,D286))","v":"1) Evaluate use of a back-pressure turbine drive instead of an electric motor, if applicable\n\n2) Evaluate use of multiple smaller fans (operating close to their Best Efficiency Point) than one large fan\n\n3) Install instrumentation to measure and trend fan performance (efficiency) periodically\n\n4) Monitor performance and document energy and cost savings on recently completed projects\n\n5) Replace electric motor with premium efficiency model\n\n6) Replace fan / blower with more efficient model"},"1) Evaluate use of a back-pressure turbine drive instead of an electric motor, if applicable\n\n2) Evaluate use of multiple smaller fans (operating close to their Best Efficiency Point) than one large fan\n\n3) Install instrumentation to measure and trend fan performance (efficiency) periodically\n\n4) Monitor performance and document energy and cost savings on recently completed projects\n\n5) Replace electric motor with premium efficiency model\n\n6) Replace fan / blower with more efficient model","1) Оцените вариант использования турбопривода с противодавлением вместо электродвигателя, если это возможно\n\n2) Оцените вариант использования нескольких вентиляторов меньшей мощности (эксплуатируемых с максимальным к.п.д.) вместо одного вентилятора большой мощности\n\n3) Установите приборы для периодического измерения к.п.д. вентиляторов и отслеживания его трендов\n\n4) Отслеживайте рабочие параметры и фиксируйте экономию энергии и средств по недавно завершенным проектам\n\n5) Замените электродвигатель на модель с премиум-к.п.д.\n\n6) Замените вентилятор/воздуходувку на более эффективную модель","1) Оцініть варіант використання турбоприводу з протитиском замість електродвигуна, якщо це можливо\n\n2) Оцініть варіант використання декількох вентиляторів меншої потужності (що експлуатуються з максимальним к.к.д.) замість одного вентилятора великої потужності\n\n3) Встановіть прилади для періодичного вимірювання к.к.д. вентиляторів та відстеження його трендів\n\n4) Відстежуйте робочі параметри та фіксуйте економію енергії та коштів в нещодавно завершених проектах\n\n5) Замініть електродвигун на модель з к.к.д. преміум-класу\n\n6) Замініть вентилятор/повітродувку на більш ефективну модель"]
[{"$f":"IF(Disclaimer!$C$2=\"English\",B287,IF(Disclaimer!$C$2=\"Russian\",C287,D287))","v":"1)Evaluate lighting upgrades that includes implementing group relamp & maintenance programs.\n\n2)Install occupancy sensors.\n\n3)Perform a detailed Lighting Assessment at your site to identify and quantify energy saving opportunities\n\n\n\n"},"1)Evaluate lighting upgrades that includes implementing group relamp & maintenance programs.\n\n2)Install occupancy sensors.\n\n3)Perform a detailed Lighting Assessment at your site to identify and quantify energy saving opportunities\n\n\n\n","1) Оцените возможности усовершенствования освещения путем массовой замены ламп и внедрения программ обслуживания.\n\n2) Установите выключатели с датчиками движения.\n\n3) Проведите детальную оценку освещения на объект для выявления возможностей экономии энергии и их количественного выражения\n\n\n\n","1) Оцініть можливості вдосконалення освітлення шляхом масової заміни ламп та впровадження програм обслуговування.\n\n2)Встановіть вимикачі з датчиками руху.\n\n3) Проведіть детальну оцінку освітлення на об'єкті для виявлення можливостей заощадження енергії та їх кількісної оцінки\n\n\n\n"]
[{"$f":"IF(Disclaimer!$C$2=\"English\",B288,IF(Disclaimer!$C$2=\"Russian\",C288,D288))","v":"1) Implement lighting control systems and zone areas based on task lighting\n\n2) Implement the recommendations of the Lighting Assessment at your site"},"1) Implement lighting control systems and zone areas based on task lighting\n\n2) Implement the recommendations of the Lighting Assessment at your site","1) Внедрите системы контроля освещения и зонирование по освещению разных участков работ\n\n2) Реализуйте на объекте рекомендации по результатам оценки освещения","1) Впровадьте системи контролю освітлення та зонування щодо освітлення різних робочих ділянок\n\n2) Реалізуйте на об'єкті рекомендації за результатами оцінки освітлення"]
[{"$f":"IF(Disclaimer!$C$2=\"English\",B289,IF(Disclaimer!$C$2=\"Russian\",C289,D289))","v":"1) Evaluate incorporating daylighting, skylights, dimming, etc.\n\n2) Implement a central computerized Energy Management System to control Lights.\n\n3) Monitor performance and document energy and cost savings on recently completed projects"},"1) Evaluate incorporating daylighting, skylights, dimming, etc.\n\n2) Implement a central computerized Energy Management System to control Lights.\n\n3) Monitor performance and document energy and cost savings on recently completed projects","1) Оцените варианты использования дневного света, естественного освещения, регулировки освещенности и т.п.\n\n2) Внедрите централизованную компьютерную систему управления энергозатратами для контроля систем освещения.\n\n3)  Отслеживайте рабочие параметры и фиксируйте экономию энергии и средств по недавно завершенным проектам","1) Оцініть варіанти використання денного світла, природного освітлення, регулювання освітленості, тощо.\n\n2)  Впровадьте централізовану комп'ютерну систему управління енерговитратами для контролю систем освітлення.\n\n3) Відстежуйте робочі параметри та фіксуйте економію енергії та коштів в нещодавно завершених проектах"]
[{"$f":"IF(Disclaimer!$C$2=\"English\",B290,IF(Disclaimer!$C$2=\"Russian\",C290,D290))","v":"1) Implement night setback and weekend/vacation temperature / ventilation controls\n\n2) Perform a detailed  HVAC System Assessment at your site to identify and quantify energy saving opportunities\n\n3) Shut-off steam / chilled water flows to air handlers that are not needed or are out of service\n"},"1) Implement night setback and weekend/vacation temperature / ventilation controls\n\n2) Perform a detailed  HVAC System Assessment at your site to identify and quantify energy saving opportunities\n\n3) Shut-off steam / chilled water flows to air handlers that are not needed or are out of service\n","1) Внедрите систему управления температурой/вентиляцией в ночное время и во время выходных\n\n2) Проведите детальную оценку системы ОВКВ на объекте для выявления возможностей экономии энергии и их количественного выражения\n3) Отсеките подачу потоков пара / охлажденной воды к тем установкам подготовки воздуха, которые не нужны или выведены из эксплуатации\n","1) Впровадьте систему управління температурою / вентиляцією в нічний час та під час вихідних\n\n2) Проведіть детальну оцінку системи ОВКП на об'єкті для виявлення можливостей заощадження енергії та їх кількісного вираження\n\n3) Відімкніть подавання потоків пари / охолодженої води до тих установок підготовки повітря, які не потрібні або виведені з експлуатації\n"]
[{"$f":"IF(Disclaimer!$C$2=\"English\",B291,IF(Disclaimer!$C$2=\"Russian\",C291,D291))","v":"1) Implement the recommendations of the HVAC System Assessment at your site.\n\n2) Install dry-bulb and/or enthalpy economizers.\n\n3) Optimize the operation of air handling units - start/stop.\n\n4) Rebalance the air-side system to reduce overall supply or meet changed zone demands"},"1) Implement the recommendations of the HVAC System Assessment at your site.\n\n2) Install dry-bulb and/or enthalpy economizers.\n\n3) Optimize the operation of air handling units - start/stop.\n\n4) Rebalance the air-side system to reduce overall supply or meet changed zone demands","1) Внедрите рекомендации по результатам оценки системы ОВКВ на объекте.\n\n2) Установите экономайзеры на основе сухого термометра и/или явления энтальпии.\n\n3) Оптимизируйте работу блоков подготовки воздуха - пуск/стоп.\n\n4) Проведите перебалансировку системы по стороне воздуха для сокращения общего объема его подачи или для удовлетворения потребностей при измененном зонировании","1) Implement the recommendations of the HVAC System Assessment at your site.\n\n2) Install dry-bulb and/or enthalpy economizers.\n\n3) Optimize the operation of air handling units - start/stop.\n\n4) Rebalance the air-side system to reduce overall supply or meet changed zone demands"]
[{"$f":"IF(Disclaimer!$C$2=\"English\",B292,IF(Disclaimer!$C$2=\"Russian\",C292,D292))","v":"1) Implement a central computerized Energy Management System to control HVAC system\n\n2) Implement demand controlled ventilation (CO2 sensor-based)\n\n3) Install instrumentation to measure and trend efficiency (Watts per sq. ft.) periodically.\n\n4) Monitor performance and document energy and cost savings on recently completed projects.\n\n5) Replace air conditioning  or air handling unit with a properly sized higher efficiency unit.\n"},"1) Implement a central computerized Energy Management System to control HVAC system\n\n2) Implement demand controlled ventilation (CO2 sensor-based)\n\n3) Install instrumentation to measure and trend efficiency (Watts per sq. ft.) periodically.\n\n4) Monitor performance and document energy and cost savings on recently completed projects.\n\n5) Replace air conditioning  or air handling unit with a properly sized higher efficiency unit.\n","1) Внедрите централизованную компьютерную систему управления энергоснабжением для контроля системы ОВКВ\n\n2) Внедрите вентиляцию нв основе потребности (на основе датчиков СО2)\n\n3) Установите приборы для периодического измерения к.п.д. (ватт на кв. фут) и формирования его трендов.\n\n4) Отследите рабочие параметры и зафиксируйте экономию энергии и затрат в недавно завершенных проектах.\n\n5) Замените блок кондиционирования воздуха или подготовки воздуха на более эффективный блок подходящей мощности.\n","1) Впровадьте централізовану компютерну систему управління енергопостачанням для контролю системи ОВКП\n\n2) Впровадьте вентиляцію на основі потреби (на основі датчиків СО2)\n\n3) Встановіть прилади для періодичного вимірювання к.к.д. (Ватт на кв. фут) та формування його трендів.\n\n4) Відстежуйте робочі параметри та фіксуйте економію енергії та коштів в нещодавно завершених проектах.\n\n5) Замініть блок кондиціювання повітря або підготовки повітря на більш ефективний блок належної потужності.\n"]
[{"$f":"IF(Disclaimer!$C$2=\"English\",B293,IF(Disclaimer!$C$2=\"Russian\",C293,D293))","v":"1) Ensure proper refrigerant charge and eliminate non-condensable from the system.\n\n2) Evaluate use of variable speed drives on chilled water pumps, cooling tower fans, etc. \n\n3) Float head pressure to minimum possible.\n\n4) Implement chilled water temperature and condenser water temperature reset.\n\n5) Perform a detailed Refrigeration / Process Cooling System Assessment at your site.\n\n6) Use the DOE CWSAT software tool & other resources to identify and quantify energy saving opportunities\n\n"},"1) Ensure proper refrigerant charge and eliminate non-condensable from the system.\n\n2) Evaluate use of variable speed drives on chilled water pumps, cooling tower fans, etc. \n\n3) Float head pressure to minimum possible.\n\n4) Implement chilled water temperature and condenser water temperature reset.\n\n5) Perform a detailed Refrigeration / Process Cooling System Assessment at your site.\n\n6) Use the DOE CWSAT software tool & other resources to identify and quantify energy saving opportunities\n\n","1) Обеспечивайте надлежащий заря хладагента и удаляйте из системы неконденсирующиеся компоненты.\n\n2) Оцените вариант применения приводов переменной скорости для насосов охлажденной воды, вентиляторов охладительных башен и т.п.\n\n3) Снизьте давление напора до минимально возможного.\n\n4) Внедрите возможность сброса значений температуры охлажденной воды и конденсаторной воды.\n\n5) Проведите на объекте детальную оценку системы технологического охлаждения.\n\n6) Воспользуйтесь программным инструментом Минэнерго CWSAT и другими ресурсами для выявления возможностей экономии энергии и их количественной оценки\n\n","1) Забезпечуйте належний заряд хладагенту та видаляйте з системи компоненти, що не конденсуються.\n\n2) Оцініть варіант застосування приводі змінної швидкості для насосів охолодженої води, вентиляторів охолоджувальних веж, тощо. \n\n3) Знизьте тиск напору до мінімально можливого\n4) Впровадьте можливість скидання значень температури охолодженої води та конденсаторної води.\n\n5) Проведіть на об'єкті детальну оцінку системи технологічного охолодження.\n\n6) Скористайтеся програним інструментом Міненерго CWSAT та іншими ресурсами для виявлення можливостей економії енергії та їх кількісної оцінки\n\n"]
[{"$f":"IF(Disclaimer!$C$2=\"English\",B294,IF(Disclaimer!$C$2=\"Russian\",C294,D294))","v":"1)Eliminate fouling on heat exchanger tubes\n\n2)Evaluate use of an economizer in the system (cooling tower water vs. chilled water)\n\n3)Implement a predictive maintenance program that correlates performance with fluid contaminants in the system\n\n4)Implement the recommendations of the Refrigeration / Process Cooling System Assessment at your site\n\n5)Incorporate optimized chiller sequencing and controls\n\n6)Use the DOE CWSAT software tool & other resources to verify energy saving opportunities"},"1)Eliminate fouling on heat exchanger tubes\n\n2)Evaluate use of an economizer in the system (cooling tower water vs. chilled water)\n\n3)Implement a predictive maintenance program that correlates performance with fluid contaminants in the system\n\n4)Implement the recommendations of the Refrigeration / Process Cooling System Assessment at your site\n\n5)Incorporate optimized chiller sequencing and controls\n\n6)Use the DOE CWSAT software tool & other resources to verify energy saving opportunities","1) Удаляйте осадок на трубах теплообменника\n\n2) Оцените вариант применения экономайзера в системе (вода охладительной башни или же охлажденная вода)\n\n3) Внедрите программу диагностического обслуживания, которая будет соотносить рабочие параметры с загрязнением жидкостей в системе\n\n4 ) Внедрите на объекте рекомендации по результатам оценки системы технологического охлаждения\n\n5) Внедрите оптимизированные циклы работы охладителя и контроль его параметров\n\n6)Воспользуйтесь программным инструментом Минэнерго CWSAT и другими ресурсами для выявления возможностей экономии энергии и их количественной оценки","1) Видаляйте осад на трубах теплообмінювача\n\n2) Оцініть варіант застосування економайзеру в системі (вода охолоджувальної вежі або ж охолоджена вода)\n\n3) Впровадьте програму діагностичного обслуговування, яка буде співвідносити робочі параметри із забрудненням рідин в системі\n\n4) Впровадьте на об'єкті рекомендації за результатами оцінки системи технологічного охолодження\n\n5) Впровадьте оптимізовані цикли роботи охолоджувача та контроль його параметрів\n\n6) Скористайтеся програним інструментом Міненерго CWSAT та іншими ресурсами для оцінки можливостей економії енергії"]
[{"$f":"IF(Disclaimer!$C$2=\"English\",B295,IF(Disclaimer!$C$2=\"Russian\",C295,D295))","v":"1)Convert air-cooled chillers to water-cooled units\n\n2)Evaluate chiller replacement (type, size) for a more efficient overall system or plant efficiency\n\n3)Evaluate heat recovery from chiller systems\n\n4)Evaluate use of thermally driven (absorption, engine, steam-turbine driven) chiller systems to balance steam and electric demand\n\n5)Install instrumentation to measure and trend individual compressor and overall system performance (efficiency - kW/ton) periodically\n\n6)Monitor performance and document energy and cost savings on recently completed projects\n\n"},"1)Convert air-cooled chillers to water-cooled units\n\n2)Evaluate chiller replacement (type, size) for a more efficient overall system or plant efficiency\n\n3)Evaluate heat recovery from chiller systems\n\n4)Evaluate use of thermally driven (absorption, engine, steam-turbine driven) chiller systems to balance steam and electric demand\n\n5)Install instrumentation to measure and trend individual compressor and overall system performance (efficiency - kW/ton) periodically\n\n6)Monitor performance and document energy and cost savings on recently completed projects\n\n","1) Смените охладители с воздушным охлаждением на блоки с водяным охлаждением\n\n2) Оцените вариант замены охладителя (тип, мощность) для повышения к.п.д. всей системы или установки\n\n3) Оцените вариант отбора тепла от систем охлаждения\n\n4) Оцените вариант применения систем охлаждения с тепловым приводом (поглощение, двигатель, паротурбина) для сбалансирования потребностей в паре и электроэнергии\n\n5) Установите приборы для периодического измерения рабочих параметров каждого компрессора и к.п.д. всей системы (кВт/тонн)\n\n6) Отслеживайте рабочие параметры и фиксируйте экономию энергии и затрат на недавно выполненных проектах\n\n","1) Замініть охолоджувачі з повітряним охолодженням на блоки з водяним охолодженням\n\n2) EОцініть варіант заміни охолоджувача (тип, потужність) для підвищення к.к.д. всієї системи або установки\n\n3) Оцініть варіант відбору тепла від систем охолодження\n\n4) Оцініть варіант застосування систем охолодження з тепловим приводом (поглинання, двигун, паротурбіна) для збалансування потреб в парі та електроенергії\n\n5) Встановіть прилади для періодичного вимірювання робочих параметрів кожного компресору та к.к.д. всієї системи (кВт/тонн)\n\n6)Відстежуйте робочі параметри та фіксуйте економію енергії та коштів в нещодавно завершених проектах\n\n"]
[{"$f":"IF(Disclaimer!$C$2=\"English\",B296,IF(Disclaimer!$C$2=\"Russian\",C296,D296))","v":"1)Conduct a detail energy assessment for your heating equipment using tools such as Process Heating Survey and Assessment Tool (PHAST) to identify energy saving opportunities.\n\n2)Keep heat transfer surfaces clean by eliminating build up of soot, scale or other material.\n\n3)Measure oxygen (O2) and Carbon Monoxide CO or combustible in flue gases and take actions to reduce O2 in flue gases while maintaining near zero value for CO or combustibles.  In certain cases safety requirements may require to have high values of O2 in flue gases.  Consult your equipment supplier before making any changes.\n\n4)Operate the furnace at or close to design load by proper furnace scheduling and loading- avoid delays, waits, cooling between operations etc. as much a possible.\n\n5)Reduce or eliminate openings in the furnace to reduce radiation heat losses.  Repair cracks and damaged insulation in furnace walls, doors etc. Keep the door opening to minimum during operations."},"1)Conduct a detail energy assessment for your heating equipment using tools such as Process Heating Survey and Assessment Tool (PHAST) to identify energy saving opportunities.\n\n2)Keep heat transfer surfaces clean by eliminating build up of soot, scale or other material.\n\n3)Measure oxygen (O2) and Carbon Monoxide CO or combustible in flue gases and take actions to reduce O2 in flue gases while maintaining near zero value for CO or combustibles.  In certain cases safety requirements may require to have high values of O2 in flue gases.  Consult your equipment supplier before making any changes.\n\n4)Operate the furnace at or close to design load by proper furnace scheduling and loading- avoid delays, waits, cooling between operations etc. as much a possible.\n\n5)Reduce or eliminate openings in the furnace to reduce radiation heat losses.  Repair cracks and damaged insulation in furnace walls, doors etc. Keep the door opening to minimum during operations.","1) Поведите детальную оценку энергетики оборудования подогрева с использованием таких инструментов как изучение и оценка технологического тепла (PHAST) для выявления возможностей экономии энергии.\n\n2) Следите за чистотой теплопередающих поверхностей путем удаления накипи, шлама и других материалов.\n\n3 ) Производите замеры содержания кислорода (O2) и окиси углерода СО либо горючих компонентов в дымовых газах и принимайте меры  для уменьшения содержания О2 в дымовых газах и сведения почти до нуля содержания СО или горючих компонентов.  В некоторых случаях соображения техники безопасности могут требовать высоких значений содержания О2 в дымовых газах. Прежде чем внедрять изменения проконсультируйтесь с поставщиком оборудования.\n\n4) Эксплуатируйте печь в режиме проектной нагрузки путем создания надлежащего графика ее работы и загрузки: избегайте задержек, простоев и остывания в периоды между рабочими операциями в максимально возможной мере.\n\n5) Уменьшите или ликвидируйте проемы в печи для сокращения потерь тепла от его излучения. Заделывайте трещины и повреждения изоляции на стенах и дверях печи. Сводите к минимуму число открывания дверей в ходе работы.","1) Проведіть детальну оцінку обладнання підігрівання з використанням таких інструментів як вивчення та оцінка технологічного тепла (PHAST) для виявлення можливостей економії енергії.\n\n2) Стежте за чистотою поверхонь, що передають тепло шляхом видалення накипу, шламу та інших матеріалів.\n\n3 Вимірюйте вміст кисню (О2) та окису вуглецю СО або ж займистих компонентів в димових газах ти вживайте заходів для зменшення вмісту О2 в димових газах та зведення майже до нуля вмісту СО або займистих компонентів. В деяких випадках міркування техніки безпеки можуть вимагати високих значень вмісту О2 в димових газах. Перш ніж впроваджувати зміни проконсультуйтесь з постачальником обладнання.\n\n4) Експлуатуйте піч в режимі проектного навантаження шляхом створення належного графіку її роботи та завантаження: уникайте затримок, простоїв та вистигання в періоди між робочими циклами.\n\n5) Уменшіть або ліквідуйте отвори в печі для зменшення втрат тепла. Ремонтуйте тріщини та ушкоджену ізоляцію на стінах, в дверцятах, тощо. Зводьте до мінімуму кількість відкривання дверцят в ході роботи."]
[{"$f":"IF(Disclaimer!$C$2=\"English\",B297,IF(Disclaimer!$C$2=\"Russian\",C297,D297))","v":"1)Consider use of combustion air preheating by recovering heat from furnace flue gases.  Evaluate use of recuperator, regenerators or regenerative burners.\n\n2)Consider use of heat from furnace flue gases to heat charge material, fixtures etc.\n\n3)Insulate water or air cooled parts used in the furnaces.  Examples are: rolls, supports etc. used in furnaces.\n\n4)Maintain proper (balanced or slightly positive) pressure in furnaces using proper control to avoid air leakage in the furnace.\n\n5)Reduce weight of fixtures, trays and other material handling weight and use 'hot-return' as much as possible."},"1)Consider use of combustion air preheating by recovering heat from furnace flue gases.  Evaluate use of recuperator, regenerators or regenerative burners.\n\n2)Consider use of heat from furnace flue gases to heat charge material, fixtures etc.\n\n3)Insulate water or air cooled parts used in the furnaces.  Examples are: rolls, supports etc. used in furnaces.\n\n4)Maintain proper (balanced or slightly positive) pressure in furnaces using proper control to avoid air leakage in the furnace.\n\n5)Reduce weight of fixtures, trays and other material handling weight and use 'hot-return' as much as possible.","1) Рассмотрите вариант применения подогрева топочного воздуха путем возврата тепла дымовых газов печи. Оцените вариант применения рекуператора, регенераторов или горелок с регенерацией.\n\n2) Рассмотрите вариант использования тепла дымовых газов печи для подогрева материала заряда, арматуры и т.п.\n\n3) Изолируйте используемые в печах элементы с водяным или воздушным охлаждением. Примерю: вальцы, кронштейны, используемые в печах.\n\n4) Обеспечивайте надлежащее (уравновешенное или несколько избыточное) давление в печах при помощи контрольной аппаратуры для предупреждения утечек воздуха в печи.\n\n5) Сокращайте вес арматуры, поддонов и других элементов подготовки материала, а также применяйте \"возврат тепла\" в максимально возможной степени.","1) Розгляньте варіант застосування підігрівання топкового повітря шляхом повернення тепла димових газів печі. Оцініть варіант застосування рекуператора, регенераторів або пальників з регенерацією.\n\n2) Розгляньте варіант використання тепла димових газів печі для підігрівання матеріалу заряду, арматури, тощо.                                                                                    \n3) Ізолюйте елементи з водяним або повітряним охолодженням, що використовуються в печах. Приклад: вальці, кронштейни в печах.\n\n4) Забезпечуйте належний (врівноважений або дещо надлишковий) тиск в печах за допомогою контрольної апаратури для запобігання витокам повітря в печі.\n\n5) Зменшуйте вагу арматури, піддонів та інших елементів підготовки матеріалу, а також застосовуйте повернення тепла максимально можливою мірою."]
[{"$f":"IF(Disclaimer!$C$2=\"English\",B298,IF(Disclaimer!$C$2=\"Russian\",C298,D298))","v":"1)Consider use of alternate source of heat such as switching from steam heating to direct fired heating for processes where possible.  Consider safety and process requirements before making changes.\n\n2)Consider use of heat from furnace flue gases in lower temperature processes, for steam generation, for water heating or air heating for the plant or other applications.\n\n3)Consider use of oxygen enriched air or oxy-fuel fired burners for high temperature processes.\n\n4)Design and build or rebuild furnaces and other heated components with adequate insulation to reduce wall heat losses"},"1)Consider use of alternate source of heat such as switching from steam heating to direct fired heating for processes where possible.  Consider safety and process requirements before making changes.\n\n2)Consider use of heat from furnace flue gases in lower temperature processes, for steam generation, for water heating or air heating for the plant or other applications.\n\n3)Consider use of oxygen enriched air or oxy-fuel fired burners for high temperature processes.\n\n4)Design and build or rebuild furnaces and other heated components with adequate insulation to reduce wall heat losses","1) Рассмотрите вариант альтернативных источников тепла, таких как переход от парового подогрева к подогревы с прямым огневым подводом тепла там, где технологии это позволяют. Перед внедрением изменений обратите внимание на требования техники безопасности и технологий.\n\n2) Рассмотрите вариант использования тепла дымовых газов печи в низкотемпературных технологиях, для выработки пара, подогрева воды или же подогрева воздуха для установки или в других технологических процессах.\n\n3) Рассмотрите вариант использования обогащенного кислородом воздуха или горелок на кислородном топливе для высокотемпературных технологий.\n\n4) Проектируйте и монтируйте или перемонтируйте печи и другие подогреваемые компоненты с надлежащей изоляцией для сокращения потерь тепла","1) Розгляньте варіант альтернативних джерел тепла, таких як перехід від парового підігріву до прямого вогньового підведення тепла там, де це дозволяють технології. Перш ніж впроваджувати зміни, зверніть увагу на вимоги техніки безпеки та технологій.\n\n2) Розгляньте варіант використання тепла димових газів печі в низькотемпературних технологіях, для вироблення пари, підігрівання води або ж підігрівання повітря для установки або ж в інших технологічних процесах.\n\n3) Розгляньте варіант використання збагаченого киснем повітря або пальників на кисневому пальному для високотемпературних технологій.\n\n4) Проектуйте та монтуйте або перемонтуйте печі та інші компоненти, що підігріваються, з належною ізоляцією для зменшення втрат тепла"]
[{"$f":"IF(Disclaimer!$C$2=\"English\",B299,IF(Disclaimer!$C$2=\"Russian\",C299,D299))","v":"1)Evaluate the use of adjustable speed drives on pumps that have variable flow and are being throttled.\n\n2)Explore the potential for using a fixed speed pump to supply base load and a smaller, properly sized fixed speed pump for trim.\n\n3)Perform a detailed Pumping System Assessment at your site\n\n4)Turn pumps ON and OFF to match needs.\n\n5)Use the DOE PSAT software tool & other resources to identify and quantify energy saving opportunities."},"1)Evaluate the use of adjustable speed drives on pumps that have variable flow and are being throttled.\n\n2)Explore the potential for using a fixed speed pump to supply base load and a smaller, properly sized fixed speed pump for trim.\n\n3)Perform a detailed Pumping System Assessment at your site\n\n4)Turn pumps ON and OFF to match needs.\n\n5)Use the DOE PSAT software tool & other resources to identify and quantify energy saving opportunities.","1) Оцените вариант использования приводов с регулируемой скоростью для насосов с переменными значениями потока или с дросселированием.\n\n2) Изучите потенциал использования насоса фиксированной скорости для подачи базового заряда и менее мощного насоса фиксированной скорости для триммирования.\n\n3) Проведите на объекте детальную оценку насосной системы\n\n4) Обеспечьте включение и выключение насосов в соответствии с потребностями.\n\n5) Используйте программный инструмент Минэнерго PSAT и другие ресурсы для выявления возможностей экономии энергии и их количественного выражения.","1)Evaluate the use of adjustable speed drives on pumps that have variable flow and are being throttled.\n\n2)Explore the potential for using a fixed speed pump to supply base load and a smaller, properly sized fixed speed pump for trim.\n\n3)Perform a detailed Pumping System Assessment at your site\n\n4)Turn pumps ON and OFF to match needs.\n\n5)Скористайтеся програним інструментом Міненерго PSAT та іншими ресурсами для виявлення можливостей економії енергії та їх кількісної оцінки."]
[{"$f":"IF(Disclaimer!$C$2=\"English\",B300,IF(Disclaimer!$C$2=\"Russian\",C300,D300))","v":"1)Identify the true pumping need (flow rate and head required) and ensure pumps are operating at their best efficiency point\n\n2)Implement the recommendations of the Pumping System Assessment at your site\n\n3)Use the DOE PSAT software tool & other resources to verify energy saving opportunities\n\n4)Install instrumentation to measure and trend pump performance (efficiency) periodically"},"1)Identify the true pumping need (flow rate and head required) and ensure pumps are operating at their best efficiency point\n\n2)Implement the recommendations of the Pumping System Assessment at your site\n\n3)Use the DOE PSAT software tool & other resources to verify energy saving opportunities\n\n4)Install instrumentation to measure and trend pump performance (efficiency) periodically","1) Определите истинные потребности в перекачке (необходимые мощности потока и напора) и обеспечьте работу насосов с оптимальным к.п.д.\n\n2) Внедрите рекомендации по результатам Оценки насосной системы на объекте\n\n3) Используйте программный инструмент Минэнерго PSAT и другие ресурсы для проверки возможностей экономии энергии\n\n4) Установите приборы для периодического измерения рабочих параметров (к.п.д.) насосов","1)Identify the true pumping need (flow rate and head required) and ensure pumps are operating at their best efficiency point\n\n2)Implement the recommendations of the Pumping System Assessment at your site\n\n3)Скористайтеся програним інструментом Міненерго PSAT та іншими ресурсами для оцінки можливостей економії енергії\n\n4)Install instrumentation to measure and trend pump performance (efficiency) periodically"]
[{"$f":"IF(Disclaimer!$C$2=\"English\",B301,IF(Disclaimer!$C$2=\"Russian\",C301,D301))","v":"1)Monitor performance and document energy and cost savings on recently completed projects\n\n2)Purchase premium efficiency motors and specify energy efficiency guidelines for new pump purchases and/or retrofits\n\n3)Install instrumentation to measure and trend pump performance (efficiency) periodically"},"1)Monitor performance and document energy and cost savings on recently completed projects\n\n2)Purchase premium efficiency motors and specify energy efficiency guidelines for new pump purchases and/or retrofits\n\n3)Install instrumentation to measure and trend pump performance (efficiency) periodically","1) Отследите рабочие параметры и зафиксируйте экономию энергии и затрат в недавно завершенных проектах\n\n2) Закупайте двигатели с к.п.д. премиум-класса и выработайте руководящие принципы для закупки новых насосов или модификации существующих\n\n3) Установите приборы для периодического измерения рабочих параметров (к.п.д.) насосов и выявления трендов","1)Відстежуйте робочі параметри та фіксуйте економію енергії та коштів в нещодавно завершених проектах\n\n2)Purchase premium efficiency motors and specify energy efficiency guidelines for new pump purchases and/or retrofits\n\n3)Install instrumentation to measure and trend pump performance (efficiency) periodically"]
[{"$f":"IF(Disclaimer!$C$2=\"English\",B302,IF(Disclaimer!$C$2=\"Russian\",C302,D302))","v":"1)Implement a Best Practices based leak management program\n\n2)Improve boiler efficiency by proper air/fuel control\n\n3)Improve boiler efficiency by proper blowdown management\n\n4)Improve condensate recovery\n\n5)Improve thermal insulation of the overall steam system\n\n6)Perform a detailed Steam Energy System Assessment at your site.\n\n7)Use the DOE Steam Best Practices Tools to identify and quantify energy saving opportunities.\n\n8)Implement a Best Practices based steam trap maintenance program"},"1)Implement a Best Practices based leak management program\n\n2)Improve boiler efficiency by proper air/fuel control\n\n3)Improve boiler efficiency by proper blowdown management\n\n4)Improve condensate recovery\n\n5)Improve thermal insulation of the overall steam system\n\n6)Perform a detailed Steam Energy System Assessment at your site.\n\n7)Use the DOE Steam Best Practices Tools to identify and quantify energy saving opportunities.\n\n8)Implement a Best Practices based steam trap maintenance program","1) Внедрите лучшие примеры практики на основе программы контроля утечек\n2) Увеличьте к.п.д. котла за счет управления соотношением подачи топлива и воздуха\n\n3) Увеличьте к.п.д. котла путем оптимизации продувок\n4) Увеличьте возврат конденсата\n\n5) Улучшите теплоизоляцию всей паровой системы\n\n6) Проведите на объекте детальную оценку системы паровой энергии.\n\n7) Примените инструмент Минэнерго, связанный с лучшими образцами практики для выявления возможностей экономии энергии и их количественного выражения.\n\n8) Реализуйте лучшие образцы практики на основе программы обслуживание конденсатных горшков","1) Впроваджуйте кращі зразки практики на основі програм контролю витоків\n\n2)Збільште к.к.д. котла за рахунок управління співвідношенням подавання пального та повітря\n\n3) Підвищте к.к.д. котла шляхом оптимізації продувок\n\n4) Збільште повернення конденсату\n5) Поліпшіть теплоізоляцію для всієї парової системи\n\n6) Проведіть на об'єкті детальну оцінку системи парової енергії.\n\n7)Скористайтеся програним інструментом Міненерго Steam Best Practices Tools для виявлення можливостей економії енергії та їх кількісного вираження.\n\n8) Реалізуйте кращі зразки практики на основі програми обслуговування конденсатних горшків"]
[{"$f":"IF(Disclaimer!$C$2=\"English\",B303,IF(Disclaimer!$C$2=\"Russian\",C303,D303))","v":"1)Implement the recommendations of the Steam Energy System Assessment at your site\n\n2)Improve boiler efficiency by proper air/fuel control, blowdown management, etc.\n\n3)Use the DOE Steam Best Practices Tools to re-verify energy saving opportunities & prioritize\n\n4)Implement a Best Practices based steam trap maintenance program\n\n5)Install instrumentation to measure and trend steam cost indicators ($/Mlb)\n\n"},"1)Implement the recommendations of the Steam Energy System Assessment at your site\n\n2)Improve boiler efficiency by proper air/fuel control, blowdown management, etc.\n\n3)Use the DOE Steam Best Practices Tools to re-verify energy saving opportunities & prioritize\n\n4)Implement a Best Practices based steam trap maintenance program\n\n5)Install instrumentation to measure and trend steam cost indicators ($/Mlb)\n\n","1) Реализуйте рекомендации по результатам оценки системы паровой энергии на объекте\n\n2) Повысьте к.п.д. котлов за счет надлежащего контроля соотношения воздуха и топлива, продувок и т.п..\n\n3) Воспользуйтесь инструментами лучших образцов практики Минэнерго для повторной проверки возможностей экономии энергии и определения их приоритетности\n\n4) Реализуйте лучшие образцы практики на основе программы обслуживания конденсатных горшков\n\n5) Установите приборы для измерения показателей стоимости пара и определения их трендов ($/Мфт)\n\n","1) Реалізуйте рекомендації за результатами оцінки системи парової енергії на об'єкті\n\n2)Підвищте к.к.д. котлів за рахунок належного контролю співвідношення повітря та пального, продувок, тощо\n\n3)Скористайтеся програним інструментом Міненерго Steam Best Practices Tools для повторної перевірки можливостей заощадження енергії та визначення їхньої пріоритетності\n\n4)Реалізуйте кращі зразки практики на основі програми обслуговування конденсатних горшків\n\n5) Встановіть прилади для вимірювання показників вартості пари та визначення їхніх трендів ($/Мфт)\n\n"]
[{"$f":"IF(Disclaimer!$C$2=\"English\",B304,IF(Disclaimer!$C$2=\"Russian\",C304,D304))","v":"1)Evaluate the use of back pressure steam turbines in lieu of pressure reducing stations\n\n2)Implement heat recovery opportunities viz. economizers, combustion air preheaters, etc.\n\n3)Install instrumentation to measure and trend steam cost indicators ($/Mlb)\n\n4)Monitor performance and document energy and cost savings on recently completed projects.\n\n"},"1)Evaluate the use of back pressure steam turbines in lieu of pressure reducing stations\n\n2)Implement heat recovery opportunities viz. economizers, combustion air preheaters, etc.\n\n3)Install instrumentation to measure and trend steam cost indicators ($/Mlb)\n\n4)Monitor performance and document energy and cost savings on recently completed projects.\n\n","1) Оцените вариант применения паротурбин с противодавлением вместо установок понижения давления\n\n2) Внедряйте варианты возврата тепла для экономайзеров, подогревателей топочного воздуха и т.п.\n\n3) Установите приборы для измерения показателей стоимости пара ($/M фунтов) и отслеживания трендов\n\n4) Отслеживайте рабочие параметры и фиксируйте экономию энергии на недавно завершенных проектах.\n\n","1) Оцініть варіант застосування паротурбін з протитиском замість установок зниження тиску\n\n2) Впроваджуйте варіанти повернення тепла для економайзерів, підігрівачів топкового повітря, тощо\n\n3) Встановіть прилади для вимірювання показників вартості пари  ($/Мфт) та відстеження трендів\n\n4)Відстежуйте робочі параметри та фіксуйте економію енергії та коштів в нещодавно завершених проектах.\n\n"]
[{"$f":"IF(Disclaimer!$C$2=\"English\",B305,IF(Disclaimer!$C$2=\"Russian\",C305,D305))","v":"Annual Power consumption in (MJ)"},"Annual Power consumption in (MJ)","Ежегодное потребление энергии (МДж)","Щорічне споживання енергії (МДж)"]
[{"$f":"IF(Disclaimer!$C$2=\"English\",B306,IF(Disclaimer!$C$2=\"Russian\",C306,D306))","v":"Power consumption by System (MJ)"},"Power consumption by System (MJ)","Потребление энергии системой (МДж)","Споживання енергії системою (МДж)"]
[{"$f":"IF(Disclaimer!$C$2=\"English\",B307,IF(Disclaimer!$C$2=\"Russian\",C307,D307))","v":"Other (MJ)"},"Other (MJ)","Другое (МДж)","Інше (МДж)"]
[{"$f":"IF(Disclaimer!$C$2=\"English\",B308,IF(Disclaimer!$C$2=\"Russian\",C308,D308))","v":"% of Total Energy Consumption "},"% of Total Energy Consumption ","% от общего объема потребления энергии","% від загального обсягу споживання енергії"]
[{"$f":"IF(Disclaimer!$C$2=\"English\",B309,IF(Disclaimer!$C$2=\"Russian\",C309,D309))","v":"Default Energy Distribution Values by System and Fuel Type for Different Industries"},"Default Energy Distribution Values by System and Fuel Type for Different Industries","Принятые по умолчанию значения распределения энергии по системам и по типам топлива для разных отраслей","Прийняті за замовчуванням значення розподілу енергії  по системам та типам пального для різних галузей"]
[{"$f":"IF(Disclaimer!$C$2=\"English\",B310,IF(Disclaimer!$C$2=\"Russian\",C310,D310))","v":"Month"},"Month","Месяц","Місяць"]
[{"$f":"IF(Disclaimer!$C$2=\"English\",B311,IF(Disclaimer!$C$2=\"Russian\",C311,D311))","v":"Production "},"Production ","Производство ","Виробництво"]
[{"$f":"IF(Disclaimer!$C$2=\"English\",B312,IF(Disclaimer!$C$2=\"Russian\",C312,D312))","v":"Combined Heat and Power (Scorecard)"},"Combined Heat and Power (Scorecard)","Комбинированное производство тепла и электроэнергии (карточка оценок)","Комбінований видобуток тепла та енергії (картка оцінок)"]
[{"$f":"IF(Disclaimer!$C$2=\"English\",B313,IF(Disclaimer!$C$2=\"Russian\",C313,D313))","v":"Please respond to the following questions on Combined Heat and Power"},"Please respond to the following questions on Combined Heat and Power","Просим дать ответы на следующие вопросы по комбинированному производству тепла и электроэнергии.","Просимо відповісти на наступні запитання щодо комбінованого вироблення тепла та електроенергії. Комбіноване вироблення тепла та електроенергії - це розташовані на об'єкті системи комбінованого вироблення тепла та електроенергії (КВТЕ), або ж системи ко-генерації; в оглядах MECS використовують термін \"ко-генерація\"."]
[{"$f":"IF(Disclaimer!$C$2=\"English\",B314,IF(Disclaimer!$C$2=\"Russian\",C314,D314))","v":"Please select Not Applicable (N/A) to the questions which are not applicable for the system in your plant."},"Please select Not Applicable (N/A) to the questions which are not applicable for the system in your plant.","Выбирайте \"неприменимо\" (N/A) для вопросов, не имеющих отношения к вашей установке","Вибирайте \"не стосується\" (N/A) для запитань, які не стосуються системи на вашій установці."]
[{"$f":"IF(Disclaimer!$C$2=\"English\",B315,IF(Disclaimer!$C$2=\"Russian\",C315,D315))","v":"HRSG- Heat Recovery Steam Generator"},"HRSG- Heat Recovery Steam Generator","HRSG- парогенератор-рекуператор","5) HRSG- парогенератор-рекуператор"]
[{"$f":"IF(Disclaimer!$C$2=\"English\",B316,IF(Disclaimer!$C$2=\"Russian\",C316,D316))","v":"Select the Equipment present as part of CHP system:"},"Select the Equipment present as part of CHP system:","Выберите оборудование, входящее в состав Вашей системы КПТЭ:","Виберіть обладнання, яке входить до Вашої системи КВТЕ:"]
[{"$f":"IF(Disclaimer!$C$2=\"English\",B317,IF(Disclaimer!$C$2=\"Russian\",C317,D317))","v":"Gas Turbine"},"Gas Turbine","Газовая турбина","Газова турбіна"]
[{"$f":"IF(Disclaimer!$C$2=\"English\",B318,IF(Disclaimer!$C$2=\"Russian\",C318,D318))","v":"Unfired Heat Recovery System Generator (HRSG)"},"Unfired Heat Recovery System Generator (HRSG)","Генератор-рекуператор без огневого подвода тепла (HRSG)","Генератор-рекуператор без вогньового підведення тепла (HRSG)"]
[{"$f":"IF(Disclaimer!$C$2=\"English\",B319,IF(Disclaimer!$C$2=\"Russian\",C319,D319))","v":"Supplementary Fired HRSG"},"Supplementary Fired HRSG","Генератор-рекуператор с дополнительным огневым подводом тепла","Генератор-рекуператор з додатковим вогньовим підведенням тепла"]
[{"$f":"IF(Disclaimer!$C$2=\"English\",B320,IF(Disclaimer!$C$2=\"Russian\",C320,D320))","v":"Fully Fired Boilers "},"Fully Fired Boilers ","Котлы-утилизаторы","Котли-утилізатори"]
[{"$f":"IF(Disclaimer!$C$2=\"English\",B321,IF(Disclaimer!$C$2=\"Russian\",C321,D321))","v":"Extraction Steam Turbogenerator"},"Extraction Steam Turbogenerator","Турбогенератор с промежуточным отбором пара","Турбогенератор з проміжним відбором пари"]
[{"$f":"IF(Disclaimer!$C$2=\"English\",B322,IF(Disclaimer!$C$2=\"Russian\",C322,D322))","v":"Condensing Steam Turbogenerator "},"Condensing Steam Turbogenerator ","Конденсационный паровой турбогенератор","Конденсаційний паровий турбогенератор"]
[{"$f":"IF(Disclaimer!$C$2=\"English\",B323,IF(Disclaimer!$C$2=\"Russian\",C323,D323))","v":"Diesel Engine "},"Diesel Engine ","Дизельный двигатель","Дизельний двигун"]
[{"$f":"IF(Disclaimer!$C$2=\"English\",B324,IF(Disclaimer!$C$2=\"Russian\",C324,D324))","v":"Direct Exhaust to furnace , Kiln, Dryer"},"Direct Exhaust to furnace , Kiln, Dryer","Прямоточные печи, сушки, горны","Прямострумні печі, сушильники , горни"]
[{"$f":"IF(Disclaimer!$C$2=\"English\",B325,IF(Disclaimer!$C$2=\"Russian\",C325,D325))","v":"Questions:"},"Questions:","Вопросы:","Запитання:"]
[{"$f":"IF(Disclaimer!$C$2=\"English\",B326,IF(Disclaimer!$C$2=\"Russian\",C326,D326))","v":"Please select the answer from the drop down list"},"Please select the answer from the drop down list","Выберите ответ из всплывающего списка","Виберіть відповідь з контекстного списку"]
[{"$f":"IF(Disclaimer!$C$2=\"English\",B327,IF(Disclaimer!$C$2=\"Russian\",C327,D327))","v":"For Gas Turbine or Diesel generator is the exhaust gas used for :"},"For Gas Turbine or Diesel generator is the exhaust gas used for :","В случае газовой турбины, используются ли отходящие газы для:","У випадку газової турбіни або дизельного двигуна, чи використовуються відхідні гази для :"]
[{"$f":"IF(Disclaimer!$C$2=\"English\",B328,IF(Disclaimer!$C$2=\"Russian\",C328,D328))","v":"If a HRSG ( Heat Recovery Steam Generator)is a part of your system, how many steam generation level are there?"},"If a HRSG ( Heat Recovery Steam Generator)is a part of your system, how many steam generation level are there?","Входит ли в состав Вашей системы HRSG ( генератор-рекуператор), и сколько имеется уровней генерации пара?","Чи входить до складу Вашої системи HRSG ( генератор-рекуператор), скільки рівнів генерації пари існує?"]
[{"$f":"IF(Disclaimer!$C$2=\"English\",B329,IF(Disclaimer!$C$2=\"Russian\",C329,D329))","v":"What type of deaerator do you have?"},"What type of deaerator do you have?","Какой у Вас тип деаэратора?","Який тип деаератора Ви маєте?"]
[{"$f":"IF(Disclaimer!$C$2=\"English\",B330,IF(Disclaimer!$C$2=\"Russian\",C330,D330))","v":"If the HRSG has supplementary firing, does HRSG runs at maximum firing or maximum steam generation capacity all the time?"},"If the HRSG has supplementary firing, does HRSG runs at maximum firing or maximum steam generation capacity all the time?","Имеется ли в HRSG дополнительный огневой подвод тепла, и работает ли HRSG на максимальной тепловой или парогенерирующей мощности постоянно?","Чи має HRSG додаткове вогньове підведення тепла і чи працює HRSG на максимальній тепловій або парогенераційній потужності весь час?"]
[{"$f":"IF(Disclaimer!$C$2=\"English\",B331,IF(Disclaimer!$C$2=\"Russian\",C331,D331))","v":"Are the boiler used as the swing steam load production or the HRSG?"},"Are the boiler used as the swing steam load production or the HRSG?","Используются ли котлы для создания паровой нагрузки перепада или же как утилизационные?","Чи використовуються котли для  створення парового навантаження перепаду або як утилізаційні?"]
[{"$f":"IF(Disclaimer!$C$2=\"English\",B332,IF(Disclaimer!$C$2=\"Russian\",C332,D332))","v":"What is your HRSG stack temperature?"},"What is your HRSG stack temperature?","Какова температура газов в дымовой трубе HRSG?","Якою є температура газів в димарі HRSG?"]
[{"$f":"IF(Disclaimer!$C$2=\"English\",B333,IF(Disclaimer!$C$2=\"Russian\",C333,D333))","v":"If the HRSG is supplementary fired, what is the HRSG fires operating temperature?"},"If the HRSG is supplementary fired, what is the HRSG fires operating temperature?","при наличии дополнительного огневого подвода тепла к HRSG, какова рабочая температура нагрева?","В разі додаткового вогньового підведення тепла до HRSG, якою є робоча температура нагріву?"]
[{"$f":"IF(Disclaimer!$C$2=\"English\",B334,IF(Disclaimer!$C$2=\"Russian\",C334,D334))","v":"Are any of the boilers outside of the cogeneration  unit operated?"},"Are any of the boilers outside of the cogeneration  unit operated?","Эксплуатируются ли какие-либо из котлов за пределами системы когенерации?","Чи експлуатуються які-небудь з котлів за межами системи когенерації?"]
[{"$f":"IF(Disclaimer!$C$2=\"English\",B335,IF(Disclaimer!$C$2=\"Russian\",C335,D335))","v":"If this is a condensing turbine do you have to run the turbine for extended periods at low to minimum load to keep it on-line?"},"If this is a condensing turbine do you have to run the turbine for extended periods at low to minimum load to keep it on-line?","Используете ли Вы конденсационную турбину при работе турбины в режиме низкой или минимальной нагрузки и для ее поддержания в контуре?","Для роботи турбіни за низького або мінімального навантаження та її утримання в контурі Ви використовуєте конденсаційну турбіну?"]
[{"$f":"IF(Disclaimer!$C$2=\"English\",B336,IF(Disclaimer!$C$2=\"Russian\",C336,D336))","v":"For a condensing steam turbine as a part of cogeneration unit what is the average condensing pressure?"},"For a condensing steam turbine as a part of cogeneration unit what is the average condensing pressure?","Каково среднее значение давления конденсации в конденсационной паровой турбине?","Яким є середній тиск конденсації для конденсаційної парової турбіни?"]
[{"$f":"IF(Disclaimer!$C$2=\"English\",B337,IF(Disclaimer!$C$2=\"Russian\",C337,D337))","v":"What is the average load factor (average/rated power production ratio) for cogeneration unit?"},"What is the average load factor (average/rated power production ratio) for cogeneration unit?","Каков средний коэффициент загрузки (средняя/паспортная производительность) блока когенерации?","Яким є середній коефіцієнт завантаження (середнє/паспортне вироблення) блоку когенерації?"]
[{"$f":"IF(Disclaimer!$C$2=\"English\",B338,IF(Disclaimer!$C$2=\"Russian\",C338,D338))","v":"Do you use evaporative cooling on the GT inlet air temp?"},"Do you use evaporative cooling on the GT inlet air temp?","Используется ли к Вас испарительное охлаждение для контроля температуры на впуске ГТ?","Чи використовуєте Ви випарне охолодження для контролю температури повітря на впуску ГТ?"]
[{"$f":"IF(Disclaimer!$C$2=\"English\",B339,IF(Disclaimer!$C$2=\"Russian\",C339,D339))","v":"Is the energy for this cooling supplied by the HRSG?"},"Is the energy for this cooling supplied by the HRSG?","Подается ли энергия для такого охлаждения от HRSG?","Чи постачається енергія для такого охолодження від HRSG?"]
[{"$f":"IF(Disclaimer!$C$2=\"English\",B340,IF(Disclaimer!$C$2=\"Russian\",C340,D340))","v":"Do you have large seasonal variation in gas turbine inlet air temp?"},"Do you have large seasonal variation in gas turbine inlet air temp?","Велики ли сезонные вариации температуры воздуха на впуске газотурбины?","Чи великі сезонні варіації температури повітря на впуску газотурбіни?"]
[{"$f":"IF(Disclaimer!$C$2=\"English\",B341,IF(Disclaimer!$C$2=\"Russian\",C341,D341))","v":"Do you sell excess stem or have potential customer for excess steam?"},"Do you sell excess stem or have potential customer for excess steam?","Осуществляете ли Вы экспорт энергии в сеть или внешнему заказчику?","Чи продаєте надлишкову пару або ж чи маєте потенційного покупця для неї?"]
[{"$f":"IF(Disclaimer!$C$2=\"English\",B342,IF(Disclaimer!$C$2=\"Russian\",C342,D342))","v":"Do you export power to grid or external customer?"},"Do you export power to grid or external customer?","Если это так, какую долю от полной стоимости импортированной энергии Вы получаете?","Чи Ви експортуєте енергію до мережі або зовнішньому клієнту?"]
[{"$f":"IF(Disclaimer!$C$2=\"English\",B343,IF(Disclaimer!$C$2=\"Russian\",C343,D343))","v":"If  so what fraction of the full imported power cost do you receive?"},"If  so what fraction of the full imported power cost do you receive?","Какова чистая тепловая мощность блока когенерации (в чистых БТЕ топлива на 1 кВт произведенной энергии?","Якщо так, яку частку повної вартості імпортованої енергії Ви отримуєте?"]
[{"$f":"IF(Disclaimer!$C$2=\"English\",B344,IF(Disclaimer!$C$2=\"Russian\",C344,D344))","v":"What is the average net heat rate of the cogeneration unit (Net Btu's of the fuel/kWh of power produced)? "},"What is the average net heat rate of the cogeneration unit (Net Btu's of the fuel/kWh of power produced)? ","Каков средний рабочий паровой коэффициент блока когенерации (как доля времени работы в контуре)?","Якою є чиста теплова потужність блоку когенерації (в чистих БТО пального на кВт виробленої енергії)? "]
[{"$f":"IF(Disclaimer!$C$2=\"English\",B345,IF(Disclaimer!$C$2=\"Russian\",C345,D345))","v":"What is the average cogeneration unit operating stream factor (on-line time as a fraction)? "},"What is the average cogeneration unit operating stream factor (on-line time as a fraction)? ","Сколько у Вас бывает внеплановых остановок в год?","Яким чином ви управляєте рівнями викидів оксиду азоту?"]
[{"$f":"IF(Disclaimer!$C$2=\"English\",B346,IF(Disclaimer!$C$2=\"Russian\",C346,D346))","v":"How many unplanned trips per year?"},"How many unplanned trips per year?","Как часто Вы контролируете общий к.п.д. когенерации?","Чи Ви маєте програму превентивного обслуговування системи КВТЕ?"]
[{"$f":"IF(Disclaimer!$C$2=\"English\",B347,IF(Disclaimer!$C$2=\"Russian\",C347,D347))","v":"How often is the overall co-generation efficiency monitored?"},"How often is the overall co-generation efficiency monitored?","Применяете ли Вы оптимизацию динамической нагрузки без отключения от контура?","Яким є середній робочий паровий коефіцієнт блоку когенерації (як частка від часу роботи в контурі)? "]
[{"$f":"IF(Disclaimer!$C$2=\"English\",B348,IF(Disclaimer!$C$2=\"Russian\",C348,D348))","v":"Do you have on-line dynamic load optimization? "},"Do you have on-line dynamic load optimization? ","Как осуществляется контроль выбросов окисла азота?","Чи Ви маєте оптимізацію динамічного навантаження без відключення від контуру? "]
[{"$f":"IF(Disclaimer!$C$2=\"English\",B349,IF(Disclaimer!$C$2=\"Russian\",C349,D349))","v":"How do you control Exhaust NOx levels?"},"How do you control Exhaust NOx levels?","Есть ли у Вам программа превентивного обслуживания системы КПТЭ?","Яким чином ви управляєте рівнями викидів оксиду азоту?"]
[{"$f":"IF(Disclaimer!$C$2=\"English\",B350,IF(Disclaimer!$C$2=\"Russian\",C350,D350))","v":"Do you have a program for preventive maintenance of the CHP system?"},"Do you have a program for preventive maintenance of the CHP system?","Есть ли у Вам программа превентивного обслуживания системы КПТЭ?","Чи Ви маєте програму превентивного обслуговування системи КВТЕ?"]
[{"$f":"IF(Disclaimer!$C$2=\"English\",B351,IF(Disclaimer!$C$2=\"Russian\",C351,D351))","v":"Do you have a program for predictive maintenance? "},"Do you have a program for predictive maintenance? ","Есть ли у Вас программа диагностического обслуживания?","Чи Ви маєте програму діагностичного обслуговування? "]
[{"$f":"IF(Disclaimer!$C$2=\"English\",B352,IF(Disclaimer!$C$2=\"Russian\",C352,D352))","v":"Do you periodically re-certify cogen operators? "},"Do you periodically re-certify cogen operators? ","Проводите ли Вы периодическую переаттестацию операторов когенерации?","Чи проводите Ви періодичну переатестацію операторів когенерації? "]
[{"$f":"IF(Disclaimer!$C$2=\"English\",B353,IF(Disclaimer!$C$2=\"Russian\",C353,D353))","v":"Other comments or information  related to Combined Heat and Power  equipment, energy use, operations etc. "},"Other comments or information  related to Combined Heat and Power  equipment, energy use, operations etc. ","Другие комментарии относительно оборудования комбинированного производства тепла и электроэнергии,  комментарии относительно ","Інші коментарі стосовно обладнання комбінованого вироблення тепла та електроенергії, використання енергії, робочих операцій, тощо. "]
[{"$f":"IF(Disclaimer!$C$2=\"English\",B354,IF(Disclaimer!$C$2=\"Russian\",C354,D354))","v":"Direct heating (dryer, kiln or preheated furnace air)"},"Direct heating (dryer, kiln or preheated furnace air)","Сушки прямого нагрева, сушки, горна или подогрева печного воздуха","Сушильник прямого нагріву, сушильник, горн або підігріте пічне повітря)"]
[{"$f":"IF(Disclaimer!$C$2=\"English\",B355,IF(Disclaimer!$C$2=\"Russian\",C355,D355))","v":"Steam Generation"},"Steam Generation","Производство пара","Виробництво пари"]
[{"$f":"IF(Disclaimer!$C$2=\"English\",B356,IF(Disclaimer!$C$2=\"Russian\",C356,D356))","v":1},1,1,1]
[{"$f":"IF(Disclaimer!$C$2=\"English\",B357,IF(Disclaimer!$C$2=\"Russian\",C357,D357))","v":"2 or more"},"2 or more","2 или больше","2 або більше"]
[{"$f":"IF(Disclaimer!$C$2=\"English\",B358,IF(Disclaimer!$C$2=\"Russian\",C358,D358))","v":"External"},"External","Внешний","Зовнішнє"]
[{"$f":"IF(Disclaimer!$C$2=\"English\",B359,IF(Disclaimer!$C$2=\"Russian\",C359,D359))","v":"Internal "},"Internal ","Внутренний","Внутрішнє "]
[{"$f":"IF(Disclaimer!$C$2=\"English\",B360,IF(Disclaimer!$C$2=\"Russian\",C360,D360))","v":"Boiler (HRSG base loaded)"},"Boiler (HRSG base loaded)","Котел (HRSG базисный)","Котел (HRSG базисний)"]
[{"$f":"IF(Disclaimer!$C$2=\"English\",B361,IF(Disclaimer!$C$2=\"Russian\",C361,D361))","v":"HRSG(Boiler base loaded)"},"HRSG(Boiler base loaded)","HRSG(котел базисный)","HRSG(котел базисний)"]
[{"$f":"IF(Disclaimer!$C$2=\"English\",B362,IF(Disclaimer!$C$2=\"Russian\",C362,D362))","v":"<=300° F"},"<=300° F","<=300° F","<=300° F"]
[{"$f":"IF(Disclaimer!$C$2=\"English\",B363,IF(Disclaimer!$C$2=\"Russian\",C363,D363))","v":"Between 300-400° F"},"Between 300-400° F","Между 300-400° F","Між 300-400° F"]
[{"$f":"IF(Disclaimer!$C$2=\"English\",B364,IF(Disclaimer!$C$2=\"Russian\",C364,D364))","v":">400° F"},">400° F",">400° F",">400° F"]
[{"$f":"IF(Disclaimer!$C$2=\"English\",B365,IF(Disclaimer!$C$2=\"Russian\",C365,D365))","v":"1500° F or greater"},"1500° F or greater","1500° F или больше","1500° F або більше"]
[{"$f":"IF(Disclaimer!$C$2=\"English\",B366,IF(Disclaimer!$C$2=\"Russian\",C366,D366))","v":"1400° F "},"1400° F ","1400° F ","1400° F "]
[{"$f":"IF(Disclaimer!$C$2=\"English\",B367,IF(Disclaimer!$C$2=\"Russian\",C367,D367))","v":"1200° F or less"},"1200° F or less","1200° F или меньше","1200° F або менше"]
[{"$f":"IF(Disclaimer!$C$2=\"English\",B368,IF(Disclaimer!$C$2=\"Russian\",C368,D368))","v":"On hot stand by"},"On hot stand by","В горячем резерве","В гарячому резерві"]
[{"$f":"IF(Disclaimer!$C$2=\"English\",B369,IF(Disclaimer!$C$2=\"Russian\",C369,D369))","v":"At minimum load"},"At minimum load","При минимальной нагрузке","За мінімального навантаження"]
[{"$f":"IF(Disclaimer!$C$2=\"English\",B370,IF(Disclaimer!$C$2=\"Russian\",C370,D370))","v":"<2 in Hg"},"<2 in Hg","<2 по Hg","<2 за Hg"]
[{"$f":"IF(Disclaimer!$C$2=\"English\",B371,IF(Disclaimer!$C$2=\"Russian\",C371,D371))","v":"Between 2-4 in Hg"},"Between 2-4 in Hg","Между 2-4 по Hg","Між 2-4 за Hg"]
[{"$f":"IF(Disclaimer!$C$2=\"English\",B372,IF(Disclaimer!$C$2=\"Russian\",C372,D372))","v":"> 4 in Hg"},"> 4 in Hg","> 4 по Hg","> 4 за Hg"]
[{"$f":"IF(Disclaimer!$C$2=\"English\",B373,IF(Disclaimer!$C$2=\"Russian\",C373,D373))","v":"5000 or less"},"5000 or less","5000 или меньше","5000 або less"]
[{"$f":"IF(Disclaimer!$C$2=\"English\",B374,IF(Disclaimer!$C$2=\"Russian\",C374,D374))","v":"5,000-7,000"},"5,000-7,000","5,000-7,000","5,000-7,000"]
[{"$f":"IF(Disclaimer!$C$2=\"English\",B375,IF(Disclaimer!$C$2=\"Russian\",C375,D375))","v":">7,000"},">7,000",">7,000",">7,000"]
[{"$f":"IF(Disclaimer!$C$2=\"English\",B376,IF(Disclaimer!$C$2=\"Russian\",C376,D376))","v":"Don’t Know"},"Don’t Know","Нет данных","Невідомо"]
[{"$f":"IF(Disclaimer!$C$2=\"English\",B377,IF(Disclaimer!$C$2=\"Russian\",C377,D377))","v":"Water Injection "},"Water Injection ","Нагнетание воды","Нагнітання води"]
[{"$f":"IF(Disclaimer!$C$2=\"English\",B378,IF(Disclaimer!$C$2=\"Russian\",C378,D378))","v":"Steam Injection "},"Steam Injection ","Нагнетание пара","Нагнітання пари  "]
[{"$f":"IF(Disclaimer!$C$2=\"English\",B379,IF(Disclaimer!$C$2=\"Russian\",C379,D379))","v":"Low NOx Burner"},"Low NOx Burner","Горелка с низкими выбросами окисла азота","Пальник з низькими оксидом азоту"]
[{"$f":"IF(Disclaimer!$C$2=\"English\",B380,IF(Disclaimer!$C$2=\"Russian\",C380,D380))","v":"Null"},"Null","Нуль","Нуль"]
[{"$f":"IF(Disclaimer!$C$2=\"English\",B381,IF(Disclaimer!$C$2=\"Russian\",C381,D381))","v":"Routine lubrication"},"Routine lubrication","Регулярная смазка","Регулярне змащування"]
[{"$f":"IF(Disclaimer!$C$2=\"English\",B382,IF(Disclaimer!$C$2=\"Russian\",C382,D382))","v":"Borescope inspections"},"Borescope inspections","Контроль бороскопом","Контроль бороскопом"]
[{"$f":"IF(Disclaimer!$C$2=\"English\",B383,IF(Disclaimer!$C$2=\"Russian\",C383,D383))","v":"Instrument calibrations"},"Instrument calibrations","Калибровка приборов","Калібрування приладів "]
[{"$f":"IF(Disclaimer!$C$2=\"English\",B384,IF(Disclaimer!$C$2=\"Russian\",C384,D384))","v":"Blade cleaning- peanut-almond shells"},"Blade cleaning- peanut-almond shells","Очистка лопастей миндально-ореховой шелухой","Очищення лопатей горіховою лузгою"]
[{"$f":"IF(Disclaimer!$C$2=\"English\",B385,IF(Disclaimer!$C$2=\"Russian\",C385,D385))","v":"Lube oil sampling"},"Lube oil sampling","Отбор проб масла","Відбір проб мастила"]
[{"$f":"IF(Disclaimer!$C$2=\"English\",B386,IF(Disclaimer!$C$2=\"Russian\",C386,D386))","v":"Advanced diagnostics"},"Advanced diagnostics","Углубленная диагностика","Поглиблена діагностика"]
[{"$f":"IF(Disclaimer!$C$2=\"English\",B387,IF(Disclaimer!$C$2=\"Russian\",C387,D387))","v":"Instrument histograms"},"Instrument histograms","Гистограммы приборов","Гістограми приладів"]
[{"$f":"IF(Disclaimer!$C$2=\"English\",B388,IF(Disclaimer!$C$2=\"Russian\",C388,D388))","v":"Compressed Air (Scorecard)"},"Compressed Air (Scorecard)","Сжатый воздух (карточка оценок)","Стиснуте повітря (картка оцінок)"]
[{"$f":"IF(Disclaimer!$C$2=\"English\",B389,IF(Disclaimer!$C$2=\"Russian\",C389,D389))","v":"Please respond to the following questions on Comressed Air"},"Please respond to the following questions on Comressed Air","Просим дать ответы на следующие вопросы по сжатому воздуху.","Просимо відповісти на наступні запитання щодо стиснутого повітря. Під системами стиснутого повітря розуміються механічні повітряні компресорні системи."]
[{"$f":"IF(Disclaimer!$C$2=\"English\",B390,IF(Disclaimer!$C$2=\"Russian\",C390,D390))","v":"Have you developed a basic block diagram of the system? "},"Have you developed a basic block diagram of the system? ","Разрабатывалась ли у Вас базовая блок-схема системы?","Чи розробляли Ви базову блок-схему системи? "]
[{"$f":"IF(Disclaimer!$C$2=\"English\",B391,IF(Disclaimer!$C$2=\"Russian\",C391,D391))","v":"Have you developed a pressure profile of your system to determine peak demand and dynamics of demand?"},"Have you developed a pressure profile of your system to determine peak demand and dynamics of demand?","Разрабатывалась ли у Вас эпюра давления Вашей системы для определения пикового спроса и динамики спроса?","Чи розробляли Ви епюру тиску Вашої системи для визначення пікового попиту та динаміки попиту?"]
[{"$f":"IF(Disclaimer!$C$2=\"English\",B392,IF(Disclaimer!$C$2=\"Russian\",C392,D392))","v":"Have you estimated total compressed air flow during different shift"},"Have you estimated total compressed air flow during different shift","Оценивались ли у Вас затраты сжатого воздуха в периоды разных смен?","Чи оцінювали Ви загальні витрати стиснутого повітря під час різних змін?"]
[{"$f":"IF(Disclaimer!$C$2=\"English\",B393,IF(Disclaimer!$C$2=\"Russian\",C393,D393))","v":"Have you measured pressure at various points in the system to determine pressure drop?"},"Have you measured pressure at various points in the system to determine pressure drop?","Измерялось ли у Вас давление в разных точках системы для определения перепада давления?","Чи замірювали ви тиск в різних точках системи для визначення перепаду тиску?"]
[{"$f":"IF(Disclaimer!$C$2=\"English\",B394,IF(Disclaimer!$C$2=\"Russian\",C394,D394))","v":"Have you measured compressed air temperature at various points in supply system?"},"Have you measured compressed air temperature at various points in supply system?","Измерялась ли у Вам температура сжатого воздуха в разных точках системы его подачи?","Чи вимірювали Ви температуру стиснутого повітря в різних точках системи постачання?"]
[{"$f":"IF(Disclaimer!$C$2=\"English\",B395,IF(Disclaimer!$C$2=\"Russian\",C395,D395))","v":"Have you estimated leak load?"},"Have you estimated leak load?","Производилась ли у Вас оценка нагрузки утечек?","Чи оцінювали Ви навантаження від витоків?"]
[{"$f":"IF(Disclaimer!$C$2=\"English\",B396,IF(Disclaimer!$C$2=\"Russian\",C396,D396))","v":"Do you exceed compressor and dryer manufacturer's requirements for maintenance? "},"Do you exceed compressor and dryer manufacturer's requirements for maintenance? ","Применяете ли Вы в ходе технического обслуживания требования, превышающие требования производителя компрессора и сушки? ","Чи застосовуєте ви для технічного обслуговування вимоги, вищі за вимоги виробника компресора та сушильника? "]
[{"$f":"IF(Disclaimer!$C$2=\"English\",B397,IF(Disclaimer!$C$2=\"Russian\",C397,D397))","v":"Do you periodically check ventilation openings to the compressor room to make sure they are free of obstructions? "},"Do you periodically check ventilation openings to the compressor room to make sure they are free of obstructions? ","Проводятся ли у Вас периодические проверки вентиляционный проемов в компрессорную на предмет их забивания? ","Чи здійснюєте Ви періодичну перевірку вентиляційних отворів до компресорної, щоб переконатися у відсутності їхнього захаращування? "]
[{"$f":"IF(Disclaimer!$C$2=\"English\",B398,IF(Disclaimer!$C$2=\"Russian\",C398,D398))","v":"Do you inspect condensate drains daily? "},"Do you inspect condensate drains daily? ","Проводятся ли у Вас ежедневные проверки стоков конденсата? ","Чи здійснюєте Ви щоденну перевірку стоків конденсату? "]
[{"$f":"IF(Disclaimer!$C$2=\"English\",B399,IF(Disclaimer!$C$2=\"Russian\",C399,D399))","v":"Do you periodically inspect and replace hoses that have become cracked or worn?"},"Do you periodically inspect and replace hoses that have become cracked or worn?","Проводятся ли у Вас периодические осмотры и замена шлангов, имеющих трещины или износ?","Чи проводите Ви періодичні інспекції та заміну шлангів, які мають тріщини або є зношеними?"]
[{"$f":"IF(Disclaimer!$C$2=\"English\",B400,IF(Disclaimer!$C$2=\"Russian\",C400,D400))","v":"Do you periodically inspect and replace end-use filters, check regulators, and lubricators to maintain functionality? "},"Do you periodically inspect and replace end-use filters, check regulators, and lubricators to maintain functionality? ","Проводите ли Вы периодические проверки и замену фильтров на местах, проверки регуляторов и наличия масла для поддержания работоспособности оборудования? ","Чи здійснюєте Ви періодичні перевірки та заміну одноразових фільтрів, перевірки регуляторів та перевірки наявності мастила для забезпечення працездатності обладнання? "]
[{"$f":"IF(Disclaimer!$C$2=\"English\",B401,IF(Disclaimer!$C$2=\"Russian\",C401,D401))","v":"Have you adjusted your compressor controls in the last year?"},"Have you adjusted your compressor controls in the last year?","Проводилась ли у Вас регулировка органов управления компрессорами в прошлом году?","Чи проводили Ви регулювання органів управління компресорами минулого року?"]
[{"$f":"IF(Disclaimer!$C$2=\"English\",B402,IF(Disclaimer!$C$2=\"Russian\",C402,D402))","v":"Have you developed a control strategy that allow you to efficiently match supply with demand?"},"Have you developed a control strategy that allow you to efficiently match supply with demand?","Разрабатывалась ли у Вас стратегия управления, которая позволяла бы достичь эффективного соответствия между потребностями в сжатом воздухе и его поставкой?","Чи розробляли Ви стратегію управління, яка давала б можливість досягати ефективної відповідності між попитом та постачанням?"]
[{"$f":"IF(Disclaimer!$C$2=\"English\",B403,IF(Disclaimer!$C$2=\"Russian\",C403,D403))","v":"Do you monitor compressor operation to avoid rapid cycling of equipment?"},"Do you monitor compressor operation to avoid rapid cycling of equipment?","Контролируете ли Вы работу компрессоров для предупреждения быстрых изменений циклов работы оборудования?","Чи контролюєте Ви роботу компресора для запобігання швидким змінам циклів роботи обладнання?"]
[{"$f":"IF(Disclaimer!$C$2=\"English\",B404,IF(Disclaimer!$C$2=\"Russian\",C404,D404))","v":"Do you have a few high pressure application that determines the operating pressure of your entire? plant?"},"Do you have a few high pressure application that determines the operating pressure of your entire? plant?","Есть ли у Вас несколько единиц оборудования высокого давления, диктующих рабочее давление всей Вашей установки?","Чи маєте ви декілька приладів високого тиску, які визначають робочий тиск Вашої установки?"]
[{"$f":"IF(Disclaimer!$C$2=\"English\",B405,IF(Disclaimer!$C$2=\"Russian\",C405,D405))","v":"Have you investigated ways to serve high pressure applications at a lower pressure? "},"Have you investigated ways to serve high pressure applications at a lower pressure? ","Пытались ли Вы найти способы эксплуатации оборудования высокого давления при более низких значениях давления? ","Чи шукали ви способів експлуатувати прилади високого тиску за нижчих значень тиску? "]
[{"$f":"IF(Disclaimer!$C$2=\"English\",B406,IF(Disclaimer!$C$2=\"Russian\",C406,D406))","v":"Do you have end use application requiring high quality air that determines the air quality for entire plant?"},"Do you have end use application requiring high quality air that determines the air quality for entire plant?","Есть ли у Вас отдельная система, требующая воздуха высокого качества и определяющая качество воздуха для всей установки?","Чи маєте Ви спеціальну систему, яка потребує повітря високої якості та визначає якість повітря для всієї установки?"]
[{"$f":"IF(Disclaimer!$C$2=\"English\",B407,IF(Disclaimer!$C$2=\"Russian\",C407,D407))","v":"Have you investigated ways to serve these  high air quality applications with point-of-use solutions?"},"Have you investigated ways to serve these  high air quality applications with point-of-use solutions?","Пытались ли Вы найти способы обслуживания систем обеспечения качества воздуха, не демонтируя их?","Чи шукали Ви способів обслуговувати ці системи якості повітря без їх демонтажу? "]
[{"$f":"IF(Disclaimer!$C$2=\"English\",B408,IF(Disclaimer!$C$2=\"Russian\",C408,D408))","v":"Are you using any of the following to supply the intermittent, high volume applications?"},"Are you using any of the following to supply the intermittent, high volume applications?","Используете ли Вы какие-нибудь из указанных устройств для бесперебойной поставки воздуха в больших объемах?","Чи використовуєте Ви які-небудь з наведених пристроїв для безперебійного постачання повітря у великих обсягах?"]
[{"$f":"IF(Disclaimer!$C$2=\"English\",B409,IF(Disclaimer!$C$2=\"Russian\",C409,D409))","v":"Have you analyzed your end uses to make sure they could not be more efficiently using alternative energy sources? "},"Have you analyzed your end uses to make sure they could not be more efficiently using alternative energy sources? ","Проводился ли у Вас анализ целевого оборудования на предмет возможности их более эффективного использования при использовании альтернативных источников энергии? ","Чи проводили Ви аналіз цільового обладнання, щоб переконатися в тому, що за використання альтернативних джерел енергії їх не можна було б використовувати ефективніше? "]
[{"$f":"IF(Disclaimer!$C$2=\"English\",B410,IF(Disclaimer!$C$2=\"Russian\",C410,D410))","v":"Is compressed air sent to abandoned equipment?"},"Is compressed air sent to abandoned equipment?","Подается ли у Вас сжатый воздух на оборудование, находящееся в простое?","Чи подається стиснуте повітря на обладнання, яке простоює?"]
[{"$f":"IF(Disclaimer!$C$2=\"English\",B411,IF(Disclaimer!$C$2=\"Russian\",C411,D411))","v":"Have you estimated the leak in your system?"},"Have you estimated the leak in your system?","Проводилась ли у Вас оценка объемов утечек в Вашей системе?","Чи оцінювали Ви обсяг витоків у Вашій системі?"]
[{"$f":"IF(Disclaimer!$C$2=\"English\",B412,IF(Disclaimer!$C$2=\"Russian\",C412,D412))","v":"Do you have the equipment to detect leaks (e.g., ultrasonic leak detector) or do you outsource leak detection? "},"Do you have the equipment to detect leaks (e.g., ultrasonic leak detector) or do you outsource leak detection? ","Есть ли у Вас оборудование выявления утечек (например, ультразвуковой детектор утечек), или же Вы поручаете выявление утечек подрядчикам? ","Чи маєте Ви обладнання для виявлення витоків (наприклад, УФ-детектор витоків) або ж ви доручаєте виявлення витоків підрядникам? "]
[{"$f":"IF(Disclaimer!$C$2=\"English\",B413,IF(Disclaimer!$C$2=\"Russian\",C413,D413))","v":"Do you have an ongoing leak management program? "},"Do you have an ongoing leak management program? ","Существует ли у вас на данный момент программа контроля утечек? ","Чи маєте Ви програму контролю витоків, яка реалізовується на даний момент? "]
[{"$f":"IF(Disclaimer!$C$2=\"English\",B414,IF(Disclaimer!$C$2=\"Russian\",C414,D414))","v":"Does your plant have a demand for space heating or hot water?"},"Does your plant have a demand for space heating or hot water?","Существует ли на Вашем объекте потребность в отоплении помещений или в горячей воде?","Чи є на вашому об'єкті потреба в опаленні приміщень або в гарячій воді?"]
[{"$f":"IF(Disclaimer!$C$2=\"English\",B415,IF(Disclaimer!$C$2=\"Russian\",C415,D415))","v":"Are you using heat recovery on your compressed air system?"},"Are you using heat recovery on your compressed air system?","Используется ли в Вашей системе сжатого воздуха возврат тепла?","Чи використовуєте Ви у вашій системі стиснутого повітря використовуєте Ви повернення тепла?"]
[{"$f":"IF(Disclaimer!$C$2=\"English\",B416,IF(Disclaimer!$C$2=\"Russian\",C416,D416))","v":"How many different locations are compressors installed at your facility?"},"How many different locations are compressors installed at your facility?","В каком количестве разных точек Вашего объекта установлены компрессоры?","В якій кількості різних точок встановлені компресори на Вашому підприємстві?"]
[{"$f":"IF(Disclaimer!$C$2=\"English\",B417,IF(Disclaimer!$C$2=\"Russian\",C417,D417))","v":"Please identify the quantity and type of each air compressor in your facility:"},"Please identify the quantity and type of each air compressor in your facility:","Укажите количество компрессоров на Вашем объекте по типам:","Зазначте кількість компресорів на Вашому об'єкті за типами:"]
[{"$f":"IF(Disclaimer!$C$2=\"English\",B418,IF(Disclaimer!$C$2=\"Russian\",C418,D418))","v":"Select the option which best describes your production rate:"},"Select the option which best describes your production rate:","Выберите вариант, наилучшим образом описывающий Ваши показатели производства:","Виберіть варіант, який найкраще описує Ваш показник виробництва:"]
[{"$f":"IF(Disclaimer!$C$2=\"English\",B419,IF(Disclaimer!$C$2=\"Russian\",C419,D419))","v":"Please review the following list of potential compressed air system operational issues. Please select Yes/ No from the drop down list "},"Please review the following list of potential compressed air system operational issues. Please select Yes/ No from the drop down list ","Просмотрите приведенный перечень вариантов использования потенциальных систем сжатого воздуха. Выбирайте ответ Yes/ No из всплывающего списка","Познайомтеся з поданим переліком варіантів використання потенційних систем стиснутого повітря. Вибирайте Yes/ No з контекстного списку"]
[{"$f":"IF(Disclaimer!$C$2=\"English\",B420,IF(Disclaimer!$C$2=\"Russian\",C420,D420))","v":"Other comments or information  related to compressed air equipment, energy use, operations etc. "},"Other comments or information  related to compressed air equipment, energy use, operations etc. ","Другие комментарии или информация относительно оборудования сжатого воздуха, использования энергии, рабочих операций и т.п. ","Інші коментарі або інформація стосовно обладнання стиснутого повітря, використання енергії, режимів роботи, тощо. "]
[{"$f":"IF(Disclaimer!$C$2=\"English\",B421,IF(Disclaimer!$C$2=\"Russian\",C421,D421))","v":"Secondary Storage Receiver"},"Secondary Storage Receiver","Вторичный ресивер","Вторинний ресивер"]
[{"$f":"IF(Disclaimer!$C$2=\"English\",B422,IF(Disclaimer!$C$2=\"Russian\",C422,D422))","v":"Separate Compressor, booster or amplifier"},"Separate Compressor, booster or amplifier","Отдельный компрессор, бустер или усилитель","Окремий компресор,  бустер або підсилювач"]
[{"$f":"IF(Disclaimer!$C$2=\"English\",B423,IF(Disclaimer!$C$2=\"Russian\",C423,D423))","v":"Double acting reciprocating compressor(s)"},"Double acting reciprocating compressor(s)","Поршневой компрессор(ы) двойного действия","Поршньовий компресор(и) подвійної дії"]
[{"$f":"IF(Disclaimer!$C$2=\"English\",B424,IF(Disclaimer!$C$2=\"Russian\",C424,D424))","v":"Lubricant injected rotary screw compressor(s)"},"Lubricant injected rotary screw compressor(s)","Ротационный винтовой компрессор(ы) с нагнетанием масла","Ротаційний гвинтовий компресор(и) з нагнітанням мастила"]
[{"$f":"IF(Disclaimer!$C$2=\"English\",B425,IF(Disclaimer!$C$2=\"Russian\",C425,D425))","v":"Centrifugal air compressor(s)"},"Centrifugal air compressor(s)","Центрифужный воздушный компрессор(ы)","Центрифужний повітряний компресор(и)"]
[{"$f":"IF(Disclaimer!$C$2=\"English\",B426,IF(Disclaimer!$C$2=\"Russian\",C426,D426))","v":"Other or unknown type of compressor(s)"},"Other or unknown type of compressor(s)","Другой или не указанный тип компрессора","Інший або невідомий тип компресора"]
[{"$f":"IF(Disclaimer!$C$2=\"English\",B427,IF(Disclaimer!$C$2=\"Russian\",C427,D427))","v":"Constant throughout the year"},"Constant throughout the year","Постоянная мощность в течение года","Постійний протягом року"]
[{"$f":"IF(Disclaimer!$C$2=\"English\",B428,IF(Disclaimer!$C$2=\"Russian\",C428,D428))","v":"Varies seasonally,"},"Varies seasonally,","Зависимость от сезона","Залежить від сезону"]
[{"$f":"IF(Disclaimer!$C$2=\"English\",B429,IF(Disclaimer!$C$2=\"Russian\",C429,D429))","v":"Varies throughout the day."},"Varies throughout the day.","Разное в разное время суток","Різний в різну пору доби"]
[{"$f":"IF(Disclaimer!$C$2=\"English\",B430,IF(Disclaimer!$C$2=\"Russian\",C430,D430))","v":"The reliability of the compressed air system in supporting manufacturing operations needs improvement."},"The reliability of the compressed air system in supporting manufacturing operations needs improvement.","Надежность системы сжатого воздуха, обеспечивающей производственные операции, требует повышения.","Надійність системи стиснутого повітря, яка забезпечує виробничі операції, потребує поліпшення."]
[{"$f":"IF(Disclaimer!$C$2=\"English\",B431,IF(Disclaimer!$C$2=\"Russian\",C431,D431))","v":"Production interruptions occur which are a result of poor compressed air system performance; we need to minimize production downtime. Product quality is affected by poor compressed air system performance: we need to prevent product spoilage."},"Production interruptions occur which are a result of poor compressed air system performance; we need to minimize production downtime. Product quality is affected by poor compressed air system performance: we need to prevent product spoilage.","Бывают перебои в производстве из-за плохой работы системы сжатого воздуха; нам необходимо свести к минимуму время простоев. Из-за плохой работы системы сжатого воздуха страдает качество продукции: нам необходимо бороться с низким качеством продукции.","Мають місце перебої виробництва внаслідок поганої роботи системи стиснутого повітря; мусимо звести до мінімуму час простоїв виробництва. Якість продукції страждає через погану роботу системи стиснутого повітря: мусимо запобігати низькій якості продукції."]
[{"$f":"IF(Disclaimer!$C$2=\"English\",B432,IF(Disclaimer!$C$2=\"Russian\",C432,D432))","v":"The automated equipment which is operated by compressed air will not achieve its full capacity throughput; we need to know if the compressed air supply is slowing down our production rate. "},"The automated equipment which is operated by compressed air will not achieve its full capacity throughput; we need to know if the compressed air supply is slowing down our production rate. ","Автоматическое оборудование с приводом от сжатого воздуха не достигает своей полной мощности; нам необходимо установить, не замедляется ли наше производство из-за недопоставок сжатого воздуха. ","Автоматичне обладнання з приводом від стиснутого повітря не досягне своєї повної потужності; нам необхідно встановити, чи не уповільнює наше виробництво постачання стиснутого повітря. "]
[{"$f":"IF(Disclaimer!$C$2=\"English\",B433,IF(Disclaimer!$C$2=\"Russian\",C433,D433))","v":"We need to reduce air demand and lower energy cost of operating our compressed air system."},"We need to reduce air demand and lower energy cost of operating our compressed air system.","Нам необходимо уменьшить потребность в объемах воздуха, а также энергозатраты, связанные с работой нашей системы сжатого воздуха.","Мусимо зменшити потребу в повітрі та зменшити витрати на енергію, необхідну для роботи нашої системи стиснутого повітря."]
[{"$f":"IF(Disclaimer!$C$2=\"English\",B434,IF(Disclaimer!$C$2=\"Russian\",C434,D434))","v":"Low pressure, impacting production occurs on a system wide and/or localized basis (at the point of use). We are unable to maintain acceptable pressure. Pressure fluctuations frequently occur; we need to maintain more stable air pressure. "},"Low pressure, impacting production occurs on a system wide and/or localized basis (at the point of use). We are unable to maintain acceptable pressure. Pressure fluctuations frequently occur; we need to maintain more stable air pressure. ","Понижение давления, уменьшающее темпы нашего производства, происходит как в масштабе всей установки, так и локально на местах. Нам не удается поддерживать приемлемое давление. Бывают частые скачки давления; нам необходимо стабилизировать давление воздуха.","Зниження тиску, через яке зменшується темп нашого виробництва має місце як в масштабі всієї системи, так і локально за місцем використання). Ми не маємо можливості підтримувати прийнятний тиск. Часто відбуваються стрибки тиску; нам необхідно забезпечувати стабільніший тиск повітря. "]
[{"$f":"IF(Disclaimer!$C$2=\"English\",B435,IF(Disclaimer!$C$2=\"Russian\",C435,D435))","v":"Water and/or oil contamination in the compressed air affects production; we need to maintain acceptable compressed air quality delivered to our end uses. "},"Water and/or oil contamination in the compressed air affects production; we need to maintain acceptable compressed air quality delivered to our end uses. ","Попадание в сжатый воздух загрязненной воды и смазки отрицательно сказывается на производстве; нам необходимо обеспечить приемлемое качество сжатого воздуха, подаваемого на наше оборудование.","Потрапляння забрудненої води та мастила в стиснуте повітря негативно впливає на виробництво; маємо забезпечувати прийнятну якість стиснутого повітря, що подається на наше обладнання. "]
[{"$f":"IF(Disclaimer!$C$2=\"English\",B436,IF(Disclaimer!$C$2=\"Russian\",C436,D436))","v":"Process Heating (Scorecard)"},"Process Heating (Scorecard)","Технологическое тепло (карточка оценок)","Технологічне тепло (картка оцінок)"]
[{"$f":"IF(Disclaimer!$C$2=\"English\",B437,IF(Disclaimer!$C$2=\"Russian\",C437,D437))","v":"Please respond to the following questions on process heating."},"Please respond to the following questions on process heating.","Просим дать ответы на следующие вопросы по технологическому теплу. ","Просимо відповісти на наступні запитання щодо технологічного тепла. "]
[{"$f":"IF(Disclaimer!$C$2=\"English\",B438,IF(Disclaimer!$C$2=\"Russian\",C438,D438))","v":"Process heating equipment include furnaces used for melting or heating of various materials, fuel fired chemical reactions, kilns, ovens, dryers, heaters, electrically heated process equipment  etc."},"Process heating equipment include furnaces used for melting or heating of various materials, fuel fired chemical reactions, kilns, ovens, dryers, heaters, electrically heated process equipment  etc.","Технологическое тепло включает в себя системы с огневым подводом тепла, например, горны, печи, сушилки, ленточные нагреватели"," Технологічне тепло включає в себе системи з вогньовим підведенням тепла, як-от, горни, пічки, сушильники, стрічкові нагрівачі."]
[{"$f":"IF(Disclaimer!$C$2=\"English\",B439,IF(Disclaimer!$C$2=\"Russian\",C439,D439))","v":"Have you conducted a detail energy assessment for your heating equipment using tools such as Process Heating Survey and Assessment Tool (PHAST) to identify energy saving opportunities? "},"Have you conducted a detail energy assessment for your heating equipment using tools such as Process Heating Survey and Assessment Tool (PHAST) to identify energy saving opportunities? ","Проводился ли у Вас детализированный аудит теплового оборудования с использованием таких инструментов как Обзор и оценка систем технологического тепла (PHAST) для определения возможностей энергосбережения?","Чи проводили Ви детальний енергетичний аудит Вашого теплового обладнання з використанням таких інструментів як Огляд та оцінка систем "]
[{"$f":"IF(Disclaimer!$C$2=\"English\",B440,IF(Disclaimer!$C$2=\"Russian\",C440,D440))","v":"Types of Processes for which process heating equipment is used in the Enterprise "},"Types of Processes for which process heating equipment is used in the Enterprise ","Типы технологических процессов, в которых на Вашем предприятии используется тепловое оборудование","Типи технологічних процесів, в яких на Вашому підприємстві використовується теплове обладнання "]
[{"$f":"IF(Disclaimer!$C$2=\"English\",B441,IF(Disclaimer!$C$2=\"Russian\",C441,D441))","v":"Type of fuel(s) used for Process Heating Equipment "},"Type of fuel(s) used for Process Heating Equipment ","Типы топлива, используемые в технологическом тепловом оборудовании","Типи пального, що використовується для технологічного теплового обладнання "]
[{"$f":"IF(Disclaimer!$C$2=\"English\",B442,IF(Disclaimer!$C$2=\"Russian\",C442,D442))","v":"Do you have co-generation or power generation equipment?"},"Do you have co-generation or power generation equipment?","Есть ли у Вас оборудование когенерации или производства электроэнергии?","Чи маєте Ви обладнання когенерації або вироблення електроенергії?"]
[{"$f":"IF(Disclaimer!$C$2=\"English\",B443,IF(Disclaimer!$C$2=\"Russian\",C443,D443))","v":"If yes, give size (MW) capacity:"},"If yes, give size (MW) capacity:","Если да - укажите мощность (МВт):","Якщо так - наведіть потужність (МВт):"]
[{"$f":"IF(Disclaimer!$C$2=\"English\",B444,IF(Disclaimer!$C$2=\"Russian\",C444,D444))","v":"Do you use steam in heating equipment"},"Do you use steam in heating equipment","Используется ли в Вашем тепловом оборудовании пар?","Чи використовуєте Ви пару в тепловому обладнанні?"]
[{"$f":"IF(Disclaimer!$C$2=\"English\",B445,IF(Disclaimer!$C$2=\"Russian\",C445,D445))","v":"Do you use electrically heated equipment such as induction, electric arc or electric resistance heating type furnaces?"},"Do you use electrically heated equipment such as induction, electric arc or electric resistance heating type furnaces?","Используется ли у Вас оборудование с электронагревом, например, индукционная печь, электродуга или электрическое сопротивление?","Чи використовуєте Ви обладнання з електричним нагріванням, як от печі з індукцією, електричною дугою або електричним опором?"]
[{"$f":"IF(Disclaimer!$C$2=\"English\",B446,IF(Disclaimer!$C$2=\"Russian\",C446,D446))","v":"Do you measure oxygen (O2) and Carbon Monoxide CO or combustible in flue gases and \"tune\" the burners periodically to maintain low values for O2 and combustibles in the furnace flue gases"},"Do you measure oxygen (O2) and Carbon Monoxide CO or combustible in flue gases and \"tune\" the burners periodically to maintain low values for O2 and combustibles in the furnace flue gases","Проводятся ли у Вас замеры содержания кислорода (O2) и окиси углерода СО или же горючих веществ в дымовых газах и периодическая наладка горелок для обеспечения низких значений содержания О2 и горючих веществ в дымовых газах печи","Чи проводите Ви вимірювання вмісту кисню (O2) та окису вуглецю CO або ж  займистих речовин в димових газах та періодичне налаштування пальників "]
[{"$f":"IF(Disclaimer!$C$2=\"English\",B447,IF(Disclaimer!$C$2=\"Russian\",C447,D447))","v":"Have you sealed openings in furnaces and repaired cracks, and damaged insulation in furnace walls, doors etc.?"},"Have you sealed openings in furnaces and repaired cracks, and damaged insulation in furnace walls, doors etc.?","Проводили ли вы герметизацию проемов в печах, ремонт трещин, поврежденной изоляции на стенках, дверях печей?","Чи маєте Ви загерметизовані отвори в печах, зароблені тріщини та ушкоджену ізоляцію в стінках та дверях печей, тощо?"]
[{"$f":"IF(Disclaimer!$C$2=\"English\",B448,IF(Disclaimer!$C$2=\"Russian\",C448,D448))","v":"Do you regularly clean heat transfer surfaces to avoid build up of soot, scale or other material? "},"Do you regularly clean heat transfer surfaces to avoid build up of soot, scale or other material? ","Проводится ли у Вас регулярна очистка передающих тепло поверхностей для предупреждения накопления сажи, окалины или других материалов?","Чи проводите Ви регулярне очищення поверхонь передавання тепла для запобігання накопиченню сажі, окалини або інших матеріалів? "]
[{"$f":"IF(Disclaimer!$C$2=\"English\",B449,IF(Disclaimer!$C$2=\"Russian\",C449,D449))","v":"Do you have a program for calibration/adjustment of sensors (i.e. thermocouples), controllers, valve operators etc.?"},"Do you have a program for calibration/adjustment of sensors (i.e. thermocouples), controllers, valve operators etc.?","Есть ли у Вас программа калибровки/наладки датчиков (например, термопар), контрольных приборов, сервоприводов и т.п.?","Чи маєте Ви програму калібрування/налаштування датчиків (наприклад, термопар), контрольних приладів, сервоприводів, тощо?"]
[{"$f":"IF(Disclaimer!$C$2=\"English\",B450,IF(Disclaimer!$C$2=\"Russian\",C450,D450))","v":"Do you operate the furnace at or close to design load by proper furnace scheduling and loading, and avoid delays, waits between production?"},"Do you operate the furnace at or close to design load by proper furnace scheduling and loading, and avoid delays, waits between production?","Эксплуатируются ли у Вас печи под нагрузкой, равной или близкой паспортным данным за счет тщательного планирования ее работы и нагрузки, а также предупреждения задержек и простоев между производственными циклами?","Чи експлуатуєте Ви піч під навантаженням, яке дорівнює або наближається до паспортних даних шляхом належного планування її роботи та завантаження, а також уникнення затримок та простоїв між виробничими циклами?"]
[{"$f":"IF(Disclaimer!$C$2=\"English\",B451,IF(Disclaimer!$C$2=\"Russian\",C451,D451))","v":"Do you maintain proper (balanced or slightly positive) pressure in furnaces to avoid air leakage in the furnace?"},"Do you maintain proper (balanced or slightly positive) pressure in furnaces to avoid air leakage in the furnace?","Поддерживаете ли Вы поддув (уравненное или немного положительное давление) в печах для предупреждения утечек воздуха в печах?","Чи використовуєте ви піддув (врівноважений або трохи позитивний) тиск в печах на запобігання витоків в них?"]
[{"$f":"IF(Disclaimer!$C$2=\"English\",B452,IF(Disclaimer!$C$2=\"Russian\",C452,D452))","v":"Do you have heat recovery system?"},"Do you have heat recovery system?","есть ли у Вас система возврата тепла?","Чи маєте Ви систему повернення тепла?"]
[{"$f":"IF(Disclaimer!$C$2=\"English\",B453,IF(Disclaimer!$C$2=\"Russian\",C453,D453))","v":"If yes :"},"If yes :","Если есть:","Якщо маєте:"]
[{"$f":"IF(Disclaimer!$C$2=\"English\",B454,IF(Disclaimer!$C$2=\"Russian\",C454,D454))","v":"Do you use design of fixtures, trays and other material handling system components with minimum weight and proper material?"},"Do you use design of fixtures, trays and other material handling system components with minimum weight and proper material?","Используются ли у Вас арматура, поддоны и другие компоненты транспортировки материалов, конструкция которых имеет минимальный вес и выполнена из наиболее пригодных материалов?","Чи використовуєте Ви арматуру, піддони та інші компоненти транспортування матеріалів, конструкція яких має мінімальну вагу та виконана з належного матеріалу?"]
[{"$f":"IF(Disclaimer!$C$2=\"English\",B455,IF(Disclaimer!$C$2=\"Russian\",C455,D455))","v":"Do you use proper insulation for (or minimize use of) water or air cooled parts such as rolls, load supports etc. used in furnace?"},"Do you use proper insulation for (or minimize use of) water or air cooled parts such as rolls, load supports etc. used in furnace?","Используется ли у Вас надежная изоляция (или минимальное применение) компонентов, охлаждаемых водой или воздухом, таких как вальцы, опорные кронштейны и т.п., являющихся частью конструкции печи?","Чи використовуєте Ви належну ізоляцію (або ж зводите до мінімуму використання) компонентів, які охолоджуються водою або повітрям, як-от, валки, опорні кронштейни, тощо, які належать до конструкції печі?"]
[{"$f":"IF(Disclaimer!$C$2=\"English\",B456,IF(Disclaimer!$C$2=\"Russian\",C456,D456))","v":"Are you using oxygen enriched air or oxy-fuel fired burners for high temperature processes? "},"Are you using oxygen enriched air or oxy-fuel fired burners for high temperature processes? ","Применяются ли у Вас горелки с использованием обогащенного  кислородом воздуха или кислородного топлива для технологических процессов с высокой температурой?","Чи використовуєте Ви пальники з використанням збагаченого киснем повітря кисневого пального для технологічних процесів з високою температурою? "]
[{"$f":"IF(Disclaimer!$C$2=\"English\",B457,IF(Disclaimer!$C$2=\"Russian\",C457,D457))","v":"Are you using the most cost effective source of heat for processes where it is possible use alternate energy sources (i.e. steam vs. electricity vs. fuel firing) where applicable? "},"Are you using the most cost effective source of heat for processes where it is possible use alternate energy sources (i.e. steam vs. electricity vs. fuel firing) where applicable? ","Используется ли у Вас наиболее экономный источник тепла в тех технологических процессах, где существует возможность использовать альтернативные источники энергии (например, пар вместо электроэнергии или вместо огневого подвода тепла? ","Чи використовуєте Ви найбільш економічне джерело тепла в тих технологічних процесах, де є можливість скористатися альтернативними джерелами енергії (наприклад, пара замість електроенергії або замість вогньового підведення тепла)? "]
[{"$f":"IF(Disclaimer!$C$2=\"English\",B458,IF(Disclaimer!$C$2=\"Russian\",C458,D458))","v":"Do your heating equipment and other heated parts use cost effective type and thickness of insulation? "},"Do your heating equipment and other heated parts use cost effective type and thickness of insulation? ","Используется ли на Вашем тепловом оборудовании и на других нагреваемых компонентах изоляция надлежащей толщины, дающая наибольшую экономию?","Чи застосовується на вашому тепловому обладнанні та на інших компонентах, які піддаються нагріванню, ізоляцію, що є економною та має належну товщину? "]
[{"$f":"IF(Disclaimer!$C$2=\"English\",B459,IF(Disclaimer!$C$2=\"Russian\",C459,D459))","v":"Other comments or information  related to Process Heating, energy use, operations etc. "},"Other comments or information  related to Process Heating, energy use, operations etc. ","Другие комментарии или информация относительно технологического тепла, использования энергии, рабочих операций и т.п. ","Інші коментарі або інформація стосовно технологічного тепла, використання енергії, робочих операцій, тощо. "]
[{"$f":"IF(Disclaimer!$C$2=\"English\",B460,IF(Disclaimer!$C$2=\"Russian\",C460,D460))","v":"Calcining"},"Calcining","Отжиг ","Випал"]
[{"$f":"IF(Disclaimer!$C$2=\"English\",B461,IF(Disclaimer!$C$2=\"Russian\",C461,D461))","v":"Metal Melting"},"Metal Melting","Плавка металлов","Плавлення металів"]
[{"$f":"IF(Disclaimer!$C$2=\"English\",B462,IF(Disclaimer!$C$2=\"Russian\",C462,D462))","v":"Non-metal (i.e. glass) melting"},"Non-metal (i.e. glass) melting","Плавка неметаллов (напр., стекла)","Плавлення не металів (як-от, скла)"]
[{"$f":"IF(Disclaimer!$C$2=\"English\",B463,IF(Disclaimer!$C$2=\"Russian\",C463,D463))","v":"Drying (food, wood, ceramic, etc.)"},"Drying (food, wood, ceramic, etc.)","Сушка (продукты питания, дерево, керамика и т.д.)","Сушіння (харчові продукти, деревина, кераміка, тощо)"]
[{"$f":"IF(Disclaimer!$C$2=\"English\",B464,IF(Disclaimer!$C$2=\"Russian\",C464,D464))","v":"Curing (rubber, plastic, paint, etc.)"},"Curing (rubber, plastic, paint, etc.)","Выдерживание (резина, пластмасса, краски и т.п.)","Витримування гума, пластмаса, фарби, тощо)"]
[{"$f":"IF(Disclaimer!$C$2=\"English\",B465,IF(Disclaimer!$C$2=\"Russian\",C465,D465))","v":"Metal heat treating"},"Metal heat treating","Тепловая обработка металлов","Теплова обробка металів"]
[{"$f":"IF(Disclaimer!$C$2=\"English\",B466,IF(Disclaimer!$C$2=\"Russian\",C466,D466))","v":"Fluid heating (liquid, crude oil, etc.)"},"Fluid heating (liquid, crude oil, etc.)","Нагрев жидкостей (жидкость, нефть-сырец и т.п.)","Нагрів рідин (рідина, сира нафта, тощо)"]
[{"$f":"IF(Disclaimer!$C$2=\"English\",B467,IF(Disclaimer!$C$2=\"Russian\",C467,D467))","v":"Non-metal heating (ceramics, glass, etc.)"},"Non-metal heating (ceramics, glass, etc.)","Нагрев неметаллов (керамика, стекло и т.п.)","Нагрів неметалів (кераміка, скло, тощо)"]
[{"$f":"IF(Disclaimer!$C$2=\"English\",B468,IF(Disclaimer!$C$2=\"Russian\",C468,D468))","v":"Incineration - thermal oxidizing"},"Incineration - thermal oxidizing","Сжигание - термическое окисление","Спалювання - термічне окислювання"]
[{"$f":"IF(Disclaimer!$C$2=\"English\",B469,IF(Disclaimer!$C$2=\"Russian\",C469,D469))","v":"Other, please specify:"},"Other, please specify:","Другое - укажите","Інше - зазначити:"]
[{"$f":"IF(Disclaimer!$C$2=\"English\",B470,IF(Disclaimer!$C$2=\"Russian\",C470,D470))","v":"Coal"},"Coal","Уголь","Вугілля"]
[{"$f":"IF(Disclaimer!$C$2=\"English\",B471,IF(Disclaimer!$C$2=\"Russian\",C471,D471))","v":"Fuel Oil"},"Fuel Oil","Тяжелое жидкое топливо","Важке рідке пальне"]
[{"$f":"IF(Disclaimer!$C$2=\"English\",B472,IF(Disclaimer!$C$2=\"Russian\",C472,D472))","v":"Natural Gas"},"Natural Gas","Природный газ","Природний газ"]
[{"$f":"IF(Disclaimer!$C$2=\"English\",B473,IF(Disclaimer!$C$2=\"Russian\",C473,D473))","v":"Electricity"},"Electricity","Электроэнергия","Електроенергія"]
[{"$f":"IF(Disclaimer!$C$2=\"English\",B474,IF(Disclaimer!$C$2=\"Russian\",C474,D474))","v":"Other, please specify:"},"Other, please specify:","Другое - укажите:","Інше - зазначити:"]
[{"$f":"IF(Disclaimer!$C$2=\"English\",B475,IF(Disclaimer!$C$2=\"Russian\",C475,D475))","v":"Heat of flue gases from the furnace or air preheater is used to heat charge material, fixtures etc."},"Heat of flue gases from the furnace or air preheater is used to heat charge material, fixtures etc.","Тепло дымовых газов от печи или нагревателя воздуха используется для нагрева шихты, арматуры и т.п.","Тепло димових газів від печі або підігрівача повітря використовується для нагріву шихти,  арматури, тощо."]
[{"$f":"IF(Disclaimer!$C$2=\"English\",B476,IF(Disclaimer!$C$2=\"Russian\",C476,D476))","v":"A heat recovery system (i.e. recuperator, regenerator, water or heating etc.) is used to recover heat from the furnace flue gases."},"A heat recovery system (i.e. recuperator, regenerator, water or heating etc.) is used to recover heat from the furnace flue gases.","Система возврата тепла (например, рекуператор, регенератор, горячая вода или отопление и т.д.) используется для возврата тепла дымовых газов печи.","Система  повернення тепла (як-от, рекуператор, регенератор, гаряча вода або опалення, тощо) використовується для повернення тепла від димових газів печі."]
[{"$f":"IF(Disclaimer!$C$2=\"English\",B477,IF(Disclaimer!$C$2=\"Russian\",C477,D477))","v":"Heat of flue gases from the furnace or air preheater is used for lower temperature processes such as steam generation, water heating or air heating for the plant or other application"},"Heat of flue gases from the furnace or air preheater is used for lower temperature processes such as steam generation, water heating or air heating for the plant or other application","тепло дымовых газов от печи или нагревателя воздуха используется для технологических процессов более низкой температуры, например, генерация пара, подогрев воды или воздуха для установки или других потребностей","Тепло димових газів печі або підігрівача повітря використовується для технологічних процесів нижчої температури, як-от, генерація пари, підігрівання води або повітря для установки або ж для інших потреб"]
[{"$f":"IF(Disclaimer!$C$2=\"English\",B478,IF(Disclaimer!$C$2=\"Russian\",C478,D478))","v":"Process Cooling and Refrigeration (Scorecard)"},"Process Cooling and Refrigeration (Scorecard)","Технологическое охлаждение и замораживание (карточка оценок)","Технологічне охолодження та заморожування (картка оцінок)"]
[{"$f":"IF(Disclaimer!$C$2=\"English\",B479,IF(Disclaimer!$C$2=\"Russian\",C479,D479))","v":"Please respond to the following questions on Process Cooling and Refrigeration "},"Please respond to the following questions on Process Cooling and Refrigeration ","Просим дать ответы на следующие вопросы по технологическому охлаждению и замораживанию. ","Просимо відповісти на наступні запитання щодо технологічного охолодження та заморожування."]
[{"$f":"IF(Disclaimer!$C$2=\"English\",B480,IF(Disclaimer!$C$2=\"Russian\",C480,D480))","v":"Includes chillers, refrigeration equipment, cooling towers and any other devices used for refrigeration and process cooling"},"Includes chillers, refrigeration equipment, cooling towers and any other devices used for refrigeration and process cooling","Суда относятся охладители, холодильное оборудование, охладительные башни и все остальные устройства, используемые для технологического охлаждения.","Сюди відносяться охолоджувачі, холодильне обладнання, охолоджувальні вежі та всі інші пристрої, що застосовуються для технологічного охолодження."]
[{"$f":"IF(Disclaimer!$C$2=\"English\",B481,IF(Disclaimer!$C$2=\"Russian\",C481,D481))","v":"How old is your refrigeration system?"},"How old is your refrigeration system?","Сколько лет Вашей системе охлаждения?","Скільки років Вашій системі охолодження?"]
[{"$f":"IF(Disclaimer!$C$2=\"English\",B482,IF(Disclaimer!$C$2=\"Russian\",C482,D482))","v":"When was the last time your refrigerator system was audited?"},"When was the last time your refrigerator system was audited?","Когда в последний раз проводился аудит Вашей системы?","Коли Ваша холодильна система востаннє піддавалася аудиту?"]
[{"$f":"IF(Disclaimer!$C$2=\"English\",B483,IF(Disclaimer!$C$2=\"Russian\",C483,D483))","v":"How often do you monitor refrigeration costs? "},"How often do you monitor refrigeration costs? ","Как часто вы отслеживаете расходов на охлаждение? ","Наскільки часто Ви відстежуєте витрати на охолодження? "]
[{"$f":"IF(Disclaimer!$C$2=\"English\",B484,IF(Disclaimer!$C$2=\"Russian\",C484,D484))","v":"Do you monitor compressor efficiencies? "},"Do you monitor compressor efficiencies? ","Отслеживаете ли Вы к.п.д. компрессоров? ","Чи відстежуєте Ви к.к.д. компресорів? "]
[{"$f":"IF(Disclaimer!$C$2=\"English\",B485,IF(Disclaimer!$C$2=\"Russian\",C485,D485))","v":"Do you have regular maintenance program"},"Do you have regular maintenance program","Есть ли у Вас программа периодического технического обслуживания?","Чи є у Вас програма періодичного технічного обслуговування?"]
[{"$f":"IF(Disclaimer!$C$2=\"English\",B486,IF(Disclaimer!$C$2=\"Russian\",C486,D486))","v":"How often do you inspect the refrigerant charge level"},"How often do you inspect the refrigerant charge level","Как часто Вы проверяете уровни охлаждающих жидкостей?","Наскільки часто Ви перевіряєте рівень охолоджувальних рідин?"]
[{"$f":"IF(Disclaimer!$C$2=\"English\",B487,IF(Disclaimer!$C$2=\"Russian\",C487,D487))","v":"How often  do you inspect the compressor?"},"How often  do you inspect the compressor?","Как часто Вы инспектируете компрессор?","Наскільки часто Ви перевіряєте компресор?"]
[{"$f":"IF(Disclaimer!$C$2=\"English\",B488,IF(Disclaimer!$C$2=\"Russian\",C488,D488))","v":"How often  do you inspect the condensers and evaporators for fouling? "},"How often  do you inspect the condensers and evaporators for fouling? ","Как часто Вы проверяете наличие накипи на конденсаторах и испарителях?","Наскільки часто Ви перевіряєте наявність накипу на конденсаторах та випаровувачах? "]
[{"$f":"IF(Disclaimer!$C$2=\"English\",B489,IF(Disclaimer!$C$2=\"Russian\",C489,D489))","v":"What is the average refrigeration compressor load factor versus design (typical/ estimated)?"},"What is the average refrigeration compressor load factor versus design (typical/ estimated)?","Каков средний коэффициент загрузки компрессора в сравнении с паспортными (типовыми/оценочными) данными?","Яким є середній коефіцієнт завантаження компресора в порівнянні з паспортними (типовими/оціночними) даними?"]
[{"$f":"IF(Disclaimer!$C$2=\"English\",B490,IF(Disclaimer!$C$2=\"Russian\",C490,D490))","v":"What % of operating time do you spend at less than 50% load? "},"What % of operating time do you spend at less than 50% load? ","Какой процент рабочего времени оборудование работает под нагрузкой менее 50%?","Який відсоток часу роботи обладнання працює з навантаженням менше 50% "]
[{"$f":"IF(Disclaimer!$C$2=\"English\",B491,IF(Disclaimer!$C$2=\"Russian\",C491,D491))","v":"Select the method used to unload compressor"},"Select the method used to unload compressor","Выберите метод разгрузки компрессора","Виберіть метод розвантаження компресору"]
[{"$f":"IF(Disclaimer!$C$2=\"English\",B492,IF(Disclaimer!$C$2=\"Russian\",C492,D492))","v":"What is the typical Suction Pressure?"},"What is the typical Suction Pressure?","Каково типовое давление всасывания?","Яким є типовий тиск всмоктування?"]
[{"$f":"IF(Disclaimer!$C$2=\"English\",B493,IF(Disclaimer!$C$2=\"Russian\",C493,D493))","v":"What is the typical Discharge  Pressure?"},"What is the typical Discharge  Pressure?","Каково типовое давление на нагнетании?","Яким є типовий тиск на нагнітанні?"]
[{"$f":"IF(Disclaimer!$C$2=\"English\",B494,IF(Disclaimer!$C$2=\"Russian\",C494,D494))","v":"What is the typical Temperature Difference between evaporator refrigerant and process steam outlet?"},"What is the typical Temperature Difference between evaporator refrigerant and process steam outlet?","Каков типовой перепад температур между охлаждающей жидкостью испарителя и выпускного отверстия технологического пара?","Яким є типовий перепад температур між охолоджувальною рідиною випарювача та випускного отвору технологічної пари?"]
[{"$f":"IF(Disclaimer!$C$2=\"English\",B495,IF(Disclaimer!$C$2=\"Russian\",C495,D495))","v":"Do you have condenser performance problem?"},"Do you have condenser performance problem?","Бывают ли у Вас проблемы с качеством работы конденсатора?","Чи є у Вас проблеми з якістю роботи конденсатора?"]
[{"$f":"IF(Disclaimer!$C$2=\"English\",B496,IF(Disclaimer!$C$2=\"Russian\",C496,D496))","v":"How old is your refrigeration system?"},"How old is your refrigeration system?","Сколько лет Вашей системе замораживания?","Скільки років Вашій системі заморожування?"]
[{"$f":"IF(Disclaimer!$C$2=\"English\",B497,IF(Disclaimer!$C$2=\"Russian\",C497,D497))","v":"Have you ever performed Pinch analysis to check if refrigeration loads have been minimized?"},"Have you ever performed Pinch analysis to check if refrigeration loads have been minimized?","Проводился ли когда-либо у Вас пинч-анализ для подтверждения того, что расход холода является минимально возможным?","Чи проводили Ви коли-небудь пінч-аналіз для того, щоб перевірити, чи є витрати холоду мінімально можливими?"]
[{"$f":"IF(Disclaimer!$C$2=\"English\",B498,IF(Disclaimer!$C$2=\"Russian\",C498,D498))","v":"Please input the following information :"},"Please input the following information :","Просим предоставить следующие данные:","Просимо ввести наступні відомості:"]
[{"$f":"IF(Disclaimer!$C$2=\"English\",B499,IF(Disclaimer!$C$2=\"Russian\",C499,D499))","v":"What % of your refrigeration compressor HP is delivered via the following drive types? (Total must be less than or equal to 100%)"},"What % of your refrigeration compressor HP is delivered via the following drive types? (Total must be less than or equal to 100%)","Какой % высокого давления от Вашего холодильного компрессора подается через указанные типы приводов? (Общая сумма должна быть 100% или меньше)","Який % високого тиску від вашого холодильного компресора подається через наступні типи приводів? Загальна сума має бути меншою або дорівнювати 100%)"]
[{"$f":"IF(Disclaimer!$C$2=\"English\",B500,IF(Disclaimer!$C$2=\"Russian\",C500,D500))","v":"How are cooling tower fans controlled?"},"How are cooling tower fans controlled?","Каким образом осуществляется управление вентиляторами башен охлаждения?","Як здійснюється управління вентиляторами веж охолодження?"]
[{"$f":"IF(Disclaimer!$C$2=\"English\",B501,IF(Disclaimer!$C$2=\"Russian\",C501,D501))","v":"How is Blow down controlled?"},"How is Blow down controlled?","Каким образом осуществляется управление продувками?","Як здійснюється управління продувками?"]
[{"$f":"IF(Disclaimer!$C$2=\"English\",B502,IF(Disclaimer!$C$2=\"Russian\",C502,D502))","v":"Select one or more what is continuously monitored "},"Select one or more what is continuously monitored ","Выберите один или больше элементов, которые постоянно контролируются","Виберіть один або декілька елементів, які знаходяться під постійним контролем "]
[{"$f":"IF(Disclaimer!$C$2=\"English\",B503,IF(Disclaimer!$C$2=\"Russian\",C503,D503))","v":"Are all over cooling water flow rates above or below design?"},"Are all over cooling water flow rates above or below design?","Выберите один или больше элементов, которые постоянно контролируются","Чи є всі значення напору охолоджувальної води вище або нижче паспортних?"]
[{"$f":"IF(Disclaimer!$C$2=\"English\",B504,IF(Disclaimer!$C$2=\"Russian\",C504,D504))","v":"Do you have uneven water distribution problem in cooling towers?"},"Do you have uneven water distribution problem in cooling towers?","Являются ли все значения напору охлаждающей воды выше или ниже паспортных?","Чи маєте Ви проблему нерівномірного розподілу води в охолоджувальних вежах?"]
[{"$f":"IF(Disclaimer!$C$2=\"English\",B505,IF(Disclaimer!$C$2=\"Russian\",C505,D505))","v":"How close are basin temperature approaches to wet bulb temp?"},"How close are basin temperature approaches to wet bulb temp?","Существует ли у Вас проблема неравномерного распределения воды в охлаждающих башнях?","Якою мірою температура басейну наближається до температури за вологим термометром?"]
[{"$f":"IF(Disclaimer!$C$2=\"English\",B506,IF(Disclaimer!$C$2=\"Russian\",C506,D506))","v":"Do you have any of the following discharge pressure problem?"},"Do you have any of the following discharge pressure problem?","В какой степени температура бассейна приближается к температуре по влажному термометру?","Чи маєте Ви одну з наступних проблем з тиском нагнітання?"]
[{"$f":"IF(Disclaimer!$C$2=\"English\",B507,IF(Disclaimer!$C$2=\"Russian\",C507,D507))","v":"Do you monitor cooling water exchanger fouling rates and/or pressure drop?"},"Do you monitor cooling water exchanger fouling rates and/or pressure drop?","Существует ли у Вас одна из указанных проблема с давлением нагнетания?","Чи відстежуєте ви показники осаду в обміннику охолоджувальної води та/або падіння тиску?"]
[{"$f":"IF(Disclaimer!$C$2=\"English\",B508,IF(Disclaimer!$C$2=\"Russian\",C508,D508))","v":"Do you have the following cooling water distribution problems in the process units? "},"Do you have the following cooling water distribution problems in the process units? ","Отслеживаете ли Вы показатели осадка в обменнике охлаждающей воды и/или падение давления?","Чи маєте Ви наступні проблеми розподілу охолоджувальної води в технологічних блоках?"]
[{"$f":"IF(Disclaimer!$C$2=\"English\",B509,IF(Disclaimer!$C$2=\"Russian\",C509,D509))","v":"Do you have sludge or sediment problems in cooling tower basins? "},"Do you have sludge or sediment problems in cooling tower basins? ","Существуют ли у Вас указанные проблемы распределения охлаждающей воды в технологических блоках?","Чи маєте ви проблему накопичення шлаку або осаду в басейнах охолоджувальних веж? "]
[{"$f":"IF(Disclaimer!$C$2=\"English\",B510,IF(Disclaimer!$C$2=\"Russian\",C510,D510))","v":"Have you optimized water vs air cooling loads?"},"Have you optimized water vs air cooling loads?","Оптимизировали ли Вы подачу воды с учетом тепловых нагрузок?","Чи оптимізували Ви подачу води з огляду на теплові навантаження?"]
[{"$f":"IF(Disclaimer!$C$2=\"English\",B511,IF(Disclaimer!$C$2=\"Russian\",C511,D511))","v":"% of Cooling load supplied by the following (Total must be less than or equal to 100%) "},"% of Cooling load supplied by the following (Total must be less than or equal to 100%) ","% тепловой нагрузки, обеспечиваемой указанными элементами  (Общая сумма должна быть 100% или меньше ","% теплового навантаження, що забезпечується наступними елементами (загальна сума має дорівнювати 100% або бути меншою) "]
[{"$f":"IF(Disclaimer!$C$2=\"English\",B512,IF(Disclaimer!$C$2=\"Russian\",C512,D512))","v":"Estimate the percentage of cooling water distribution pump HP delivered by the following (Total must be less than or equal to 100%) "},"Estimate the percentage of cooling water distribution pump HP delivered by the following (Total must be less than or equal to 100%) ","Оцените доли объемов охлаждающей воды от распределительного насоса, подаваемые указанными системами (Общая сумма должна быть 100% или меньше) ","Оцініть частки об'ємів охолоджувальної води з розподільного насосу, які подаються зазначеними системами (сума має бути менше або дорівнювати 100%) "]
[{"$f":"IF(Disclaimer!$C$2=\"English\",B513,IF(Disclaimer!$C$2=\"Russian\",C513,D513))","v":"How many pumps used for cooling and refrigeration process?"},"How many pumps used for cooling and refrigeration process?","Какое количество насосов обеспечивает процессы технологического охлаждения?","Яка кількість насосів використовується для процесів технологічного охолодження?"]
[{"$f":"IF(Disclaimer!$C$2=\"English\",B514,IF(Disclaimer!$C$2=\"Russian\",C514,D514))","v":"Are you running the minimum number of pumps? "},"Are you running the minimum number of pumps? ","Держите ли Вы в работе минимально необходимое число насосов?","Чи тримаєте Ви в роботі мінімальну кількість насосів? "]
[{"$f":"IF(Disclaimer!$C$2=\"English\",B515,IF(Disclaimer!$C$2=\"Russian\",C515,D515))","v":"If not Select why "},"If not Select why ","Если не выбрано ничего - укажите причины","В разі відсутності вибору - причини цього"]
[{"$f":"IF(Disclaimer!$C$2=\"English\",B516,IF(Disclaimer!$C$2=\"Russian\",C516,D516))","v":"Type of cooling"},"Type of cooling","Тип охлаждения","Тип охолодження"]
[{"$f":"IF(Disclaimer!$C$2=\"English\",B517,IF(Disclaimer!$C$2=\"Russian\",C517,D517))","v":"Do the cooling tower fans have adjustable pitch blades?"},"Do the cooling tower fans have adjustable pitch blades?","Имеют ли лопасти вентиляторов охладительных башен регулируемый шаг?","Чи мають вентилятори охолоджувальних веж лопаті з регульованим кроком?"]
[{"$f":"IF(Disclaimer!$C$2=\"English\",B518,IF(Disclaimer!$C$2=\"Russian\",C518,D518))","v":"Does the cooling tower have adjustable speed drive?"},"Does the cooling tower have adjustable speed drive?","Имеются ли в охладительной башне привод регулируемой скорости?","Чи має охолоджувальне вежа привід регульованої швидкості?"]
[{"$f":"IF(Disclaimer!$C$2=\"English\",B519,IF(Disclaimer!$C$2=\"Russian\",C519,D519))","v":"Condition of cooling Towers"},"Condition of cooling Towers","Состояние охладительных башен","Стан охолоджувальних веж"]
[{"$f":"IF(Disclaimer!$C$2=\"English\",B520,IF(Disclaimer!$C$2=\"Russian\",C520,D520))","v":"Other comments or information  related to Process Cooling and Refrigeration , operations etc. "},"Other comments or information  related to Process Cooling and Refrigeration , operations etc. ","Другие комментарии или информация относительно технологического охлаждения и замораживания, рабочих операций и т.п. ","Інші коментарі або інформація стосовно технологічного охолодження та заморожування, робочих операцій, тощо. "]
[{"$f":"IF(Disclaimer!$C$2=\"English\",B521,IF(Disclaimer!$C$2=\"Russian\",C521,D521))","v":"<10 Years "},"<10 Years ","<10 лет ","<10 років "]
[{"$f":"IF(Disclaimer!$C$2=\"English\",B522,IF(Disclaimer!$C$2=\"Russian\",C522,D522))","v":"10- 20 years"},"10- 20 years","10- 20 лет","10- 20 років"]
[{"$f":"IF(Disclaimer!$C$2=\"English\",B523,IF(Disclaimer!$C$2=\"Russian\",C523,D523))","v":">20 Years"},">20 Years",">20 лет",">20 років"]
[{"$f":"IF(Disclaimer!$C$2=\"English\",B524,IF(Disclaimer!$C$2=\"Russian\",C524,D524))","v":"1 year or less"},"1 year or less","1 год или меньше","1 рік або менше"]
[{"$f":"IF(Disclaimer!$C$2=\"English\",B525,IF(Disclaimer!$C$2=\"Russian\",C525,D525))","v":">2 years ago"},">2 years ago",">2 года тому назад",">2 років тому"]
[{"$f":"IF(Disclaimer!$C$2=\"English\",B526,IF(Disclaimer!$C$2=\"Russian\",C526,D526))","v":">5 years ago "},">5 years ago ",">5 лет тому назад",">5 років тому"]
[{"$f":"IF(Disclaimer!$C$2=\"English\",B527,IF(Disclaimer!$C$2=\"Russian\",C527,D527))","v":">=100%"},">=100%",">=100%",">=100%"]
[{"$f":"IF(Disclaimer!$C$2=\"English\",B528,IF(Disclaimer!$C$2=\"Russian\",C528,D528))","v":">50%"},">50%",">50%",">50%"]
[{"$f":"IF(Disclaimer!$C$2=\"English\",B529,IF(Disclaimer!$C$2=\"Russian\",C529,D529))","v":"Don’t know"},"Don’t know","Нет данных","Невідомо"]
[{"$f":"IF(Disclaimer!$C$2=\"English\",B530,IF(Disclaimer!$C$2=\"Russian\",C530,D530))","v":"30% or less"},"30% or less","30% или меньше","30% або менше"]
[{"$f":"IF(Disclaimer!$C$2=\"English\",B531,IF(Disclaimer!$C$2=\"Russian\",C531,D531))","v":"60% or more"},"60% or more","60% или больше","60% або більше"]
[{"$f":"IF(Disclaimer!$C$2=\"English\",B532,IF(Disclaimer!$C$2=\"Russian\",C532,D532))","v":"Don’t know"},"Don’t know","Нет данных","Невідомо"]
[{"$f":"IF(Disclaimer!$C$2=\"English\",B533,IF(Disclaimer!$C$2=\"Russian\",C533,D533))","v":"Variable speed drives"},"Variable speed drives","Приводы с изменяемой скоростью","Приводи з перемінною швидкістю"]
[{"$f":"IF(Disclaimer!$C$2=\"English\",B534,IF(Disclaimer!$C$2=\"Russian\",C534,D534))","v":"Cylinder unloading (reciprocating)/ Slide valves (screw)/ Variable inlet guide vanes (centrifugal)"},"Cylinder unloading (reciprocating)/ Slide valves (screw)/ Variable inlet guide vanes (centrifugal)","Разгрузка цилиндра (для поршневых)/ Регулируемые клапаны (для винтовых)/ Регулируемое направляющее устройство на впуске (для центрифужных)","Розвантаження циліндру (для поршньових)/ Регульовані клапани (гвинтові)/ Регульований апарат спрямування на вході (центрифужні)"]
[{"$f":"IF(Disclaimer!$C$2=\"English\",B535,IF(Disclaimer!$C$2=\"Russian\",C535,D535))","v":"Automated compressor on/off control "},"Automated compressor on/off control ","Включение/отключение автоматического управления","Вимкнення/увімкнення автоматичного управління"]
[{"$f":"IF(Disclaimer!$C$2=\"English\",B536,IF(Disclaimer!$C$2=\"Russian\",C536,D536))","v":"Manual Compressor on/ off Control"},"Manual Compressor on/ off Control","Включение/отключение ручного управления","Вимкнення/увімкнення ручного управління"]
[{"$f":"IF(Disclaimer!$C$2=\"English\",B537,IF(Disclaimer!$C$2=\"Russian\",C537,D537))","v":"Suction Throttling "},"Suction Throttling ","Дросселирование на всасывании","Дроселювання всмоктування "]
[{"$f":"IF(Disclaimer!$C$2=\"English\",B538,IF(Disclaimer!$C$2=\"Russian\",C538,D538))","v":"Hot gas bypass"},"Hot gas bypass","Байпас горячих газов","Байпас гарячих газів"]
[{"$f":"IF(Disclaimer!$C$2=\"English\",B539,IF(Disclaimer!$C$2=\"Russian\",C539,D539))","v":"Near design pressure"},"Near design pressure","Давление, близкое к паспортному","Близький до паспортного тиск"]
[{"$f":"IF(Disclaimer!$C$2=\"English\",B540,IF(Disclaimer!$C$2=\"Russian\",C540,D540))","v":"< design pressure by more than 15%"},"< design pressure by more than 15%","< паспортного давления больше чем на 15%","< паспортного тиску більш ніж на 15%"]
[{"$f":"IF(Disclaimer!$C$2=\"English\",B541,IF(Disclaimer!$C$2=\"Russian\",C541,D541))","v":"Don’t know"},"Don’t know","Нет данных","Невідомо"]
[{"$f":"IF(Disclaimer!$C$2=\"English\",B542,IF(Disclaimer!$C$2=\"Russian\",C542,D542))","v":"Near design pressure"},"Near design pressure","Близкое к паспортному давление","Близький до паспортного тиску"]
[{"$f":"IF(Disclaimer!$C$2=\"English\",B543,IF(Disclaimer!$C$2=\"Russian\",C543,D543))","v":"> design pressure by more than 10%"},"> design pressure by more than 10%","> паспортного давления больше чем на  10%","> паспортного тиску більш ніж на  10%"]
[{"$f":"IF(Disclaimer!$C$2=\"English\",B544,IF(Disclaimer!$C$2=\"Russian\",C544,D544))","v":"Don’t know"},"Don’t know","Нет данных","Невідомо"]
[{"$f":"IF(Disclaimer!$C$2=\"English\",B545,IF(Disclaimer!$C$2=\"Russian\",C545,D545))","v":"Within 5 °F  of design "},"Within 5 °F  of design ","В пределах 5 °F от паспортной","В межах 5 °F від паспортної"]
[{"$f":"IF(Disclaimer!$C$2=\"English\",B546,IF(Disclaimer!$C$2=\"Russian\",C546,D546))","v":"> 5 °F  of design "},"> 5 °F  of design ","> 5 °F  от паспортной","> 5 °F  від паспортної"]
[{"$f":"IF(Disclaimer!$C$2=\"English\",B547,IF(Disclaimer!$C$2=\"Russian\",C547,D547))","v":"Don’t know"},"Don’t know","Нет данных","Невідомо"]
[{"$f":"IF(Disclaimer!$C$2=\"English\",B548,IF(Disclaimer!$C$2=\"Russian\",C548,D548))","v":"Not at all"},"Not at all","Никогда","Ніколи"]
[{"$f":"IF(Disclaimer!$C$2=\"English\",B549,IF(Disclaimer!$C$2=\"Russian\",C549,D549))","v":"Only periodically in summer months"},"Only periodically in summer months","Иногда в летние месяцы","Іноді в літні місяці"]
[{"$f":"IF(Disclaimer!$C$2=\"English\",B550,IF(Disclaimer!$C$2=\"Russian\",C550,D550))","v":"Throughout summer"},"Throughout summer","Все лето","Все літо"]
[{"$f":"IF(Disclaimer!$C$2=\"English\",B551,IF(Disclaimer!$C$2=\"Russian\",C551,D551))","v":"Continuously"},"Continuously","Постоянно","Постійно"]
[{"$f":"IF(Disclaimer!$C$2=\"English\",B552,IF(Disclaimer!$C$2=\"Russian\",C552,D552))","v":"Backpressure (extraction ) steam turbines"},"Backpressure (extraction ) steam turbines","Паровые турбины обратного давления","Парові турбіни зворотного тиску"]
[{"$f":"IF(Disclaimer!$C$2=\"English\",B553,IF(Disclaimer!$C$2=\"Russian\",C553,D553))","v":"Variable Speed Electric Motor"},"Variable Speed Electric Motor","Электродвигатель переменной скорости","Електродвигун перемінної швидкості"]
[{"$f":"IF(Disclaimer!$C$2=\"English\",B554,IF(Disclaimer!$C$2=\"Russian\",C554,D554))","v":"Electric motor w/o variable speed drives"},"Electric motor w/o variable speed drives","Электродвигатель без приводов переменной скорости","Електродвигун без приводів перемінної швидкості"]
[{"$f":"IF(Disclaimer!$C$2=\"English\",B555,IF(Disclaimer!$C$2=\"Russian\",C555,D555))","v":"Condensing steam turbines"},"Condensing steam turbines","Конденсационные паровые турбины","Конденсаційні парові турбіни"]
[{"$f":"IF(Disclaimer!$C$2=\"English\",B556,IF(Disclaimer!$C$2=\"Russian\",C556,D556))","v":"Always on"},"Always on","Всегда включены","Завжди увімкнені"]
[{"$f":"IF(Disclaimer!$C$2=\"English\",B557,IF(Disclaimer!$C$2=\"Russian\",C557,D557))","v":"Manual on/off control"},"Manual on/off control","Включение/отключение ручного управления","Вимкнення/увімкнення ручного управління"]
[{"$f":"IF(Disclaimer!$C$2=\"English\",B558,IF(Disclaimer!$C$2=\"Russian\",C558,D558))","v":"Fan pitch control"},"Fan pitch control","Контроль шага лопастей вентилятора","Контроль кроку вентилятора"]
[{"$f":"IF(Disclaimer!$C$2=\"English\",B559,IF(Disclaimer!$C$2=\"Russian\",C559,D559))","v":"Automated on / off control"},"Automated on / off control","Включение/отключение автоматического управления","Вимкнення/увімкнення автоматичного управління"]
[{"$f":"IF(Disclaimer!$C$2=\"English\",B560,IF(Disclaimer!$C$2=\"Russian\",C560,D560))","v":"Combination of above"},"Combination of above","Комбинация указанного","Поєднання наведеного вище"]
[{"$f":"IF(Disclaimer!$C$2=\"English\",B561,IF(Disclaimer!$C$2=\"Russian\",C561,D561))","v":"Automatically"},"Automatically","Автоматически","Автоматично"]
[{"$f":"IF(Disclaimer!$C$2=\"English\",B562,IF(Disclaimer!$C$2=\"Russian\",C562,D562))","v":"Manually "},"Manually ","Вручную","Вручну "]
[{"$f":"IF(Disclaimer!$C$2=\"English\",B563,IF(Disclaimer!$C$2=\"Russian\",C563,D563))","v":"Combination of above"},"Combination of above","И то, и другое","Поєднання обох"]
[{"$f":"IF(Disclaimer!$C$2=\"English\",B564,IF(Disclaimer!$C$2=\"Russian\",C564,D564))","v":"Ambient air temperature profile for the year"},"Ambient air temperature profile for the year","Кривая температур атмосферного воздуха на протяжении года","Крива температур повітря довкілля протягом року"]
[{"$f":"IF(Disclaimer!$C$2=\"English\",B565,IF(Disclaimer!$C$2=\"Russian\",C565,D565))","v":"Ambient air wet bulb temperature profile for year"},"Ambient air wet bulb temperature profile for year","Годичная кривая температур по влажному термометру","Річна крива температур за вологим термометром"]
[{"$f":"IF(Disclaimer!$C$2=\"English\",B566,IF(Disclaimer!$C$2=\"Russian\",C566,D566))","v":"Cooling tower blowdown cycle "},"Cooling tower blowdown cycle ","Цикл охладительной башни","Охолоджувальний цикл вежі "]
[{"$f":"IF(Disclaimer!$C$2=\"English\",B567,IF(Disclaimer!$C$2=\"Russian\",C567,D567))","v":"Cooling water flow demand"},"Cooling water flow demand","Потребность в напоре охлаждающей воды","Потреба у водному потоці"]
[{"$f":"IF(Disclaimer!$C$2=\"English\",B568,IF(Disclaimer!$C$2=\"Russian\",C568,D568))","v":"Delta T across towers"},"Delta T across towers","Дельта T между вежами","Дельта T між вежами"]
[{"$f":"IF(Disclaimer!$C$2=\"English\",B569,IF(Disclaimer!$C$2=\"Russian\",C569,D569))","v":"Cycles of concentration "},"Cycles of concentration ","Циклы концентраций","Цикли концентрацій"]
[{"$f":"IF(Disclaimer!$C$2=\"English\",B570,IF(Disclaimer!$C$2=\"Russian\",C570,D570))","v":"Above"},"Above","Выше","Вище"]
[{"$f":"IF(Disclaimer!$C$2=\"English\",B571,IF(Disclaimer!$C$2=\"Russian\",C571,D571))","v":"Below"},"Below","Ниже","Нижче"]
[{"$f":"IF(Disclaimer!$C$2=\"English\",B572,IF(Disclaimer!$C$2=\"Russian\",C572,D572))","v":"Around 5°F"},"Around 5°F","Около 5°F","Близько 5°F"]
[{"$f":"IF(Disclaimer!$C$2=\"English\",B573,IF(Disclaimer!$C$2=\"Russian\",C573,D573))","v":">5° F"},">5° F",">5° F",">5° F"]
[{"$f":"IF(Disclaimer!$C$2=\"English\",B574,IF(Disclaimer!$C$2=\"Russian\",C574,D574))","v":"Distribution piping fouling "},"Distribution piping fouling ","Осадок на распределяющих трубопроводах","Осад на розподільних трубопроводах"]
[{"$f":"IF(Disclaimer!$C$2=\"English\",B575,IF(Disclaimer!$C$2=\"Russian\",C575,D575))","v":"Cooling water exchanger fouling "},"Cooling water exchanger fouling ","Осадок на обменнике охлаждающей воды","Осад на обміннику води охолодження"]
[{"$f":"IF(Disclaimer!$C$2=\"English\",B576,IF(Disclaimer!$C$2=\"Russian\",C576,D576))","v":"Higher than design cooling loads"},"Higher than design cooling loads","Выше проектных нагрузок охлаждения","Вище ніж проекті навантаження охолодження"]
[{"$f":"IF(Disclaimer!$C$2=\"English\",B577,IF(Disclaimer!$C$2=\"Russian\",C577,D577))","v":"Capacity Problem"},"Capacity Problem","Проблема емкости","Проблема ємності"]
[{"$f":"IF(Disclaimer!$C$2=\"English\",B578,IF(Disclaimer!$C$2=\"Russian\",C578,D578))","v":"Starving some user"},"Starving some user","Нехватка для отдельных потребителей","Нестача для деяких користувачів"]
[{"$f":"IF(Disclaimer!$C$2=\"English\",B579,IF(Disclaimer!$C$2=\"Russian\",C579,D579))","v":"Mechanical Draft Towers"},"Mechanical Draft Towers","Башни с механической тягой","Вежі з механічною тягою"]
[{"$f":"IF(Disclaimer!$C$2=\"English\",B580,IF(Disclaimer!$C$2=\"Russian\",C580,D580))","v":"Natural Draft Towers"},"Natural Draft Towers","Башни с естественной тягой","Вежі з природною тягою"]
[{"$f":"IF(Disclaimer!$C$2=\"English\",B581,IF(Disclaimer!$C$2=\"Russian\",C581,D581))","v":"Cooling ponds"},"Cooling ponds","Пруды-охладители","Пруди охолодження"]
[{"$f":"IF(Disclaimer!$C$2=\"English\",B582,IF(Disclaimer!$C$2=\"Russian\",C582,D582))","v":"Spray Ponds"},"Spray Ponds","Пруды распыления","Пруди розприскування"]
[{"$f":"IF(Disclaimer!$C$2=\"English\",B583,IF(Disclaimer!$C$2=\"Russian\",C583,D583))","v":"Backpressure turbine drives"},"Backpressure turbine drives","Приводы турбин обратного давления","Приводи турбін зворотного тиску"]
[{"$f":"IF(Disclaimer!$C$2=\"English\",B584,IF(Disclaimer!$C$2=\"Russian\",C584,D584))","v":"Variable speed drives"},"Variable speed drives","Приводы изменяемой скорости","Приводи перемінної швидкості"]
[{"$f":"IF(Disclaimer!$C$2=\"English\",B585,IF(Disclaimer!$C$2=\"Russian\",C585,D585))","v":"Motor drives"},"Motor drives","Приводы двигателей","Приводи двигунів"]
[{"$f":"IF(Disclaimer!$C$2=\"English\",B586,IF(Disclaimer!$C$2=\"Russian\",C586,D586))","v":"Condensing turbine drives"},"Condensing turbine drives","Приводы конденсационных турбин","Приводи конденсаційних турбін"]
[{"$f":"IF(Disclaimer!$C$2=\"English\",B587,IF(Disclaimer!$C$2=\"Russian\",C587,D587))","v":"Emergency on-line backup supply criteria"},"Emergency on-line backup supply criteria","Критерии резервного аварийного снабжения контура","Критерії резервного аварійного постачання контуру"]
[{"$f":"IF(Disclaimer!$C$2=\"English\",B588,IF(Disclaimer!$C$2=\"Russian\",C588,D588))","v":"System capacity (High discharge pressure)"},"System capacity (High discharge pressure)","Мощность системы (высокое давление на нагнетании)","Потужність системи (високий тиск на нагнітанні)"]
[{"$f":"IF(Disclaimer!$C$2=\"English\",B589,IF(Disclaimer!$C$2=\"Russian\",C589,D589))","v":"Ease of operation "},"Ease of operation ","простота эксплуатации","простота експлуатації"]
[{"$f":"IF(Disclaimer!$C$2=\"English\",B590,IF(Disclaimer!$C$2=\"Russian\",C590,D590))","v":"N/A"},"N/A","N/A","N/A"]
[{"$f":"IF(Disclaimer!$C$2=\"English\",B591,IF(Disclaimer!$C$2=\"Russian\",C591,D591))","v":"Splash Film "},"Splash Film ","Ограждающая пленка","Плівка огородження"]
[{"$f":"IF(Disclaimer!$C$2=\"English\",B592,IF(Disclaimer!$C$2=\"Russian\",C592,D592))","v":"Film Fill"},"Film Fill","Пленочный наполнитель","Плівковий заповнювач"]
[{"$f":"IF(Disclaimer!$C$2=\"English\",B593,IF(Disclaimer!$C$2=\"Russian\",C593,D593))","v":"All"},"All","Все","Всі"]
[{"$f":"IF(Disclaimer!$C$2=\"English\",B594,IF(Disclaimer!$C$2=\"Russian\",C594,D594))","v":"Some"},"Some","Некоторые","Деякі"]
[{"$f":"IF(Disclaimer!$C$2=\"English\",B595,IF(Disclaimer!$C$2=\"Russian\",C595,D595))","v":"None"},"None","Ни в одном","Жодна не має"]
[{"$f":"IF(Disclaimer!$C$2=\"English\",B596,IF(Disclaimer!$C$2=\"Russian\",C596,D596))","v":"All"},"All","На всех","Всі"]
[{"$f":"IF(Disclaimer!$C$2=\"English\",B597,IF(Disclaimer!$C$2=\"Russian\",C597,D597))","v":"Some"},"Some","На некоторых","Деякі"]
[{"$f":"IF(Disclaimer!$C$2=\"English\",B598,IF(Disclaimer!$C$2=\"Russian\",C598,D598))","v":"None"},"None","Ни на одной","Жодна не має"]
[{"$f":"IF(Disclaimer!$C$2=\"English\",B599,IF(Disclaimer!$C$2=\"Russian\",C599,D599))","v":"Excellent "},"Excellent ","Отличное","Чудовий "]
[{"$f":"IF(Disclaimer!$C$2=\"English\",B600,IF(Disclaimer!$C$2=\"Russian\",C600,D600))","v":"Adequate"},"Adequate","Адекватное","Адекватний"]
[{"$f":"IF(Disclaimer!$C$2=\"English\",B601,IF(Disclaimer!$C$2=\"Russian\",C601,D601))","v":"In need of replacement"},"In need of replacement","Требуют замены","Потребують заміни"]
[{"$f":"IF(Disclaimer!$C$2=\"English\",B602,IF(Disclaimer!$C$2=\"Russian\",C602,D602))","v":"Pumps (Scorecard)"},"Pumps (Scorecard)","Насосы (карточка оценок)","Насоси (карта оцінок)"]
[{"$f":"IF(Disclaimer!$C$2=\"English\",B603,IF(Disclaimer!$C$2=\"Russian\",C603,D603))","v":"Please respond to the following questions on pumps"},"Please respond to the following questions on pumps"," Просим дать ответы на следующие вопросы по насосам.","Просимо відповісти на наступні запитання щодо насосів."]
[{"$f":"IF(Disclaimer!$C$2=\"English\",B604,IF(Disclaimer!$C$2=\"Russian\",C604,D604))","v":"Pumps include machine-driven pump systems"},"Pumps include machine-driven pump systems","К насосам относятся насосные системы с механическим приводом.","До насосів відносяться також насосні системи з механічним приводом."]
[{"$f":"IF(Disclaimer!$C$2=\"English\",B605,IF(Disclaimer!$C$2=\"Russian\",C605,D605))","v":"For system in which flow is controlled or regulated, estimate the percentage that are controlled by:        (Total must be less than or equal to 100%)"},"For system in which flow is controlled or regulated, estimate the percentage that are controlled by:        (Total must be less than or equal to 100%)","Оцените доли в процентах тех элементов системы, имеющей контроль или регулировку напора, управление которыми осуществляется с помощью:  (Общая сумма должна быть 100% или меньше)","В системі з контролем або регулюванням напору оцініть частки, які контролюються за допомогою:        (Загальна сума має бути 100% або менше)"]
[{"$f":"IF(Disclaimer!$C$2=\"English\",B606,IF(Disclaimer!$C$2=\"Russian\",C606,D606))","v":"Estimate the percentage of pumping systems for which the answer to the following questions is YES."},"Estimate the percentage of pumping systems for which the answer to the following questions is YES.","Укажите долю тех насосных систем,  для которых ответы на приведенные вопросы будут утвердительными.","Оцініть частку тих насосних систем, для яких відповіді на подані тут запитання будуть ствердними."]
[{"$f":"IF(Disclaimer!$C$2=\"English\",B607,IF(Disclaimer!$C$2=\"Russian\",C607,D607))","v":"What percentage of your systems have permanently installed flow meters? "},"What percentage of your systems have permanently installed flow meters? ","Какой процент Ваших систем оборудован постоянно работающими объемными счетчиками? ","Який відсоток Ваших систем мають постійно встановлені об'ємні лічильники? "]
[{"$f":"IF(Disclaimer!$C$2=\"English\",B608,IF(Disclaimer!$C$2=\"Russian\",C608,D608))","v":"Do you purchase energy efficient or premium efficiency motors as standard practice?"},"Do you purchase energy efficient or premium efficiency motors as standard practice?","Является ли закупка энергоэффективных или премиум-энергоэффективных двигателей Вашей обычной практикой?","Чи є частиною вашої стандартної практики закупівля енергоефективних або преміум-енергоефективних двигунів?"]
[{"$f":"IF(Disclaimer!$C$2=\"English\",B609,IF(Disclaimer!$C$2=\"Russian\",C609,D609))","v":"Do you have motor repair/ replacement decision policy in place?"},"Do you have motor repair/ replacement decision policy in place?","Есть ли у Вас установленная процедура принятия решений о необходимости ремонта/замены двигателя?","Чи існують у Вас прийняті правила щодо прийняття рішень про необхідність ремонту/заміни двигуна?"]
[{"$f":"IF(Disclaimer!$C$2=\"English\",B610,IF(Disclaimer!$C$2=\"Russian\",C610,D610))","v":"Do you include energy efficiency guidelines in pump purchase specification?"},"Do you include energy efficiency guidelines in pump purchase specification?","Включаете ли Вы в свои закупочные спецификации требования по энергоэффективности насоса?","Чи включаєте Ви до закупівельних специфікацій для насосів вимоги щодо енергоефективності?"]
[{"$f":"IF(Disclaimer!$C$2=\"English\",B611,IF(Disclaimer!$C$2=\"Russian\",C611,D611))","v":"Are energy factor a primary consideration when repairing or replacing an existing pump that has failed?"},"Are energy factor a primary consideration when repairing or replacing an existing pump that has failed?","Является ли коэффициент энергии решающим фактором при принятии решения о ремонте или замене отказавшего насоса?","Are energy factor a primary consideration when repairing or replacing an existing pump that has failed?"]
[{"$f":"IF(Disclaimer!$C$2=\"English\",B612,IF(Disclaimer!$C$2=\"Russian\",C612,D612))","v":"Percentage of operator that could explain how to read and use a pump head-capacity curve?"},"Percentage of operator that could explain how to read and use a pump head-capacity curve?","Доля операторов, способных объяснить, как считывается и используется кривая напорной мощности насоса?","Percentage of operator that could explain how to read and use a pump head-capacity curve?"]
[{"$f":"IF(Disclaimer!$C$2=\"English\",B613,IF(Disclaimer!$C$2=\"Russian\",C613,D613))","v":"% of understanding of the pump performance curves: head, power, efficiency, and NPSHR (Net Positive Suction Head)?"},"% of understanding of the pump performance curves: head, power, efficiency, and NPSHR (Net Positive Suction Head)?","% понимания эксплуатационных характеристик насоса: напор, мощность, к.п.д. и эффективный положительный напор на всасывании?","% розуміння експлуатаційних характеристик насосу: напір, потужність, к.к.д. та ефективний додатній напір на всмоктуванні?"]
[{"$f":"IF(Disclaimer!$C$2=\"English\",B614,IF(Disclaimer!$C$2=\"Russian\",C614,D614))","v":"Other comments or information  related to Pumps, operations etc. "},"Other comments or information  related to Pumps, operations etc. ","Другие комментарии или информация относительно насосов, рабочих операций и т.п.","Інші коментарі або інформація щодо насосів, робочих операцій, тощо. "]
[{"$f":"IF(Disclaimer!$C$2=\"English\",B615,IF(Disclaimer!$C$2=\"Russian\",C615,D615))","v":"Valve throttling or bypass flow regulation "},"Valve throttling or bypass flow regulation ","Дросселирование клапанов или регулировка потока во втором контуре","Дроселювання клапанів або регулювання потоку в другому контурі"]
[{"$f":"IF(Disclaimer!$C$2=\"English\",B616,IF(Disclaimer!$C$2=\"Russian\",C616,D616))","v":"Turning pumps on and off to match speed"},"Turning pumps on and off to match speed","Включение и отключение насосов соответственно скорости","Увімкнення та вимкнення двигунів для узгодження швидкості"]
[{"$f":"IF(Disclaimer!$C$2=\"English\",B617,IF(Disclaimer!$C$2=\"Russian\",C617,D617))","v":"Constant Load-Pump matched to meet need at pump best efficiency point "},"Constant Load-Pump matched to meet need at pump best efficiency point ","Постоянное обеспечение оптимальной нагрузки на насос для достижения  оптимальной нагрузки на насос для достижения максимального к.п.д. ","Постійне забезпечення оптимального навантаження на насос для досягнення максимального к.к.д. "]
[{"$f":"IF(Disclaimer!$C$2=\"English\",B618,IF(Disclaimer!$C$2=\"Russian\",C618,D618))","v":"Adjustable speed drives"},"Adjustable speed drives","Приводы с регулировкой скорости","Приводи з регулюванням швидкості"]
[{"$f":"IF(Disclaimer!$C$2=\"English\",B619,IF(Disclaimer!$C$2=\"Russian\",C619,D619))","v":"Combination of above or don’t know"},"Combination of above or don’t know","Комбинация указанного или отсутствие данных","Поєднання наведеного вище або відсутність інформації"]
[{"$f":"IF(Disclaimer!$C$2=\"English\",B620,IF(Disclaimer!$C$2=\"Russian\",C620,D620))","v":"Are the pump performance curve readily available?"},"Are the pump performance curve readily available?","Есть ли у Вас постоянно доступные эксплуатационные характеристики насоса?","Чи маєте в наявності експлуатаційні характеристики насосу?"]
[{"$f":"IF(Disclaimer!$C$2=\"English\",B621,IF(Disclaimer!$C$2=\"Russian\",C621,D621))","v":"Are the Systems head-capacity curves well understood?"},"Are the Systems head-capacity curves well understood?","Хорошо ли Вы разбираетесь в кривых зависимости подачи от напора?","Чи маєте Ви добре розуміння кривих залежності подачі від напору?"]
[{"$f":"IF(Disclaimer!$C$2=\"English\",B622,IF(Disclaimer!$C$2=\"Russian\",C622,D622))","v":"Are the pumps tested at installation to compare performance with manufacture's curve?"},"Are the pumps tested at installation to compare performance with manufacture's curve?","Проводятся ли испытания насосов на установке для сравнения их характеристик с данными производителя?","Чи проводяться випробування насосів на установці для порівняння їхніх характеристик з тими, що надані виробником?"]
[{"$f":"IF(Disclaimer!$C$2=\"English\",B623,IF(Disclaimer!$C$2=\"Russian\",C623,D623))","v":"Is motor power or current measurement and pump efficiency estimated as part of installation test?"},"Is motor power or current measurement and pump efficiency estimated as part of installation test?","Производятся ли в рамках пусковых испытаний измерения мощности двигателя или силы тока и к.п.д. насоса для оценки этих параметров?","Чи проводяться в рамках пускових випробувань вимірювання потужності двигуна або струму, а також оцінка к.к.д. насосу?"]
[{"$f":"IF(Disclaimer!$C$2=\"English\",B624,IF(Disclaimer!$C$2=\"Russian\",C624,D624))","v":"Are pumps periodically tested or measures trended to check for performance degradation?"},"Are pumps periodically tested or measures trended to check for performance degradation?","Осуществляются ли периодические испытания насосов или мероприятия для выявления ухудшения их эксплуатационных характеристик?","Чи проводяться періодичні випробування насосів або ж заходи для встановлення погіршення їхніх експлуатаційних характеристик?"]
[{"$f":"IF(Disclaimer!$C$2=\"English\",B625,IF(Disclaimer!$C$2=\"Russian\",C625,D625))","v":"Do you evaluate the potential energy cost savings (compared to optimal commercially available equipment operating at the existing head and flow rates)? "},"Do you evaluate the potential energy cost savings (compared to optimal commercially available equipment operating at the existing head and flow rates)? ","Проводится ли у Вас оценка потенциальной экономии на стоимости энергии (в сравнении с параметрами оптимального оборудования, доступного на рынке, которое эксплуатируется при аналогичном Вашему соотношении динамического напора к статическому? ","Чи проводите Ви оцінку потенційних заощаджень на вартості енергії (в порівнянні з параметрами оптимального обладнання, що пропонується на ринку та експлуатується з наявним у Вас відношенням динамічного напору до статичного)? "]
[{"$f":"IF(Disclaimer!$C$2=\"English\",B626,IF(Disclaimer!$C$2=\"Russian\",C626,D626))","v":"Steam Generation Equipment (Scorecard)"},"Steam Generation Equipment (Scorecard)","Оборудование парогенерации (карточка оценки)","Паровиробне обладнання (картка оцінки)"]
[{"$f":"IF(Disclaimer!$C$2=\"English\",B627,IF(Disclaimer!$C$2=\"Russian\",C627,D627))","v":"The complete steam system, including boilers, steam distribution lines, steam traps, and final delivery of steam to the process (e.g., heat exchangers)"},"The complete steam system, including boilers, steam distribution lines, steam traps, and final delivery of steam to the process (e.g., heat exchangers)"," К этому оборудованию относятся все паровые системы, включая котлы, парораспределительные линии, конденсационные горшки, а также устройства конечной доставки пара в технологические системы (например, в теплообменники).","Паровиробне обладнання включає в себе повноцінні парові системи, включаючи котли, паророзподільні лінії,   конденсаційні горшки, а також пристрої кінцевої доставки пари в технологічні системи (наприклад, в теплообмінювачі)."]
[{"$f":"IF(Disclaimer!$C$2=\"English\",B628,IF(Disclaimer!$C$2=\"Russian\",C628,D628))","v":"Please respond to the following questions on steam generation equipment "},"Please respond to the following questions on steam generation equipment ","Просим дать ответы на следующие вопросы по оборудованию парогенерации. "," Просимо відповісти на наступні запитання щодо паровиробного обладнання."]
[{"$f":"IF(Disclaimer!$C$2=\"English\",B629,IF(Disclaimer!$C$2=\"Russian\",C629,D629))","v":"Do  you monitor your Fuel Cost to generate Steam in terms of ($)/(1000lbs of steam produced)"},"Do  you monitor your Fuel Cost to generate Steam in terms of ($)/(1000lbs of steam produced)","Отслеживаются ли у Вас затраты на топливо для производства пара в виде отношения ($)/(1000 фунтов произведенного пара)","Чи відстежуєте Ви витрати на пальне для вироблення пари з точки зору ($)/(1000 фунтів виробленої пари)"]
[{"$f":"IF(Disclaimer!$C$2=\"English\",B630,IF(Disclaimer!$C$2=\"Russian\",C630,D630))","v":"How often do you calculate and trend your fuel cost to generate steam?"},"How often do you calculate and trend your fuel cost to generate steam?","Как часто у Вам производятся расчеты для оценки затрат на топливо для парогенерации?","Як часто ВИ робите розрахунки для оцінки витрат на пальне для вироблення пари?"]
[{"$f":"IF(Disclaimer!$C$2=\"English\",B631,IF(Disclaimer!$C$2=\"Russian\",C631,D631))","v":"Do you measure Steam /Product Benchmark-in terms of  (Lbs. of steam needed/ unit of product produced)? "},"Do you measure Steam /Product Benchmark-in terms of  (Lbs. of steam needed/ unit of product produced)? ","Измеряется ли у Вас отношение \"пар / контрольный показатель производительности\" с точки зрения потребностей в паре в фунтах для производства единицы продукции? Если да - с какой частотой?","Чи вимірюєте Ви співвідношення \"пара / контрольний показник продукції\" з точки зору потре у парі у фунтах для вироблення одиниці продукції? "]
[{"$f":"IF(Disclaimer!$C$2=\"English\",B632,IF(Disclaimer!$C$2=\"Russian\",C632,D632))","v":"How often do you measure Steam /Product Benchmark-in terms of  (Lbs. of steam needed/ unit of product produced)"},"How often do you measure Steam /Product Benchmark-in terms of  (Lbs. of steam needed/ unit of product produced)","Как часто Вы проводите измерения контрольного соотношения пар/продукт, которое рассчитывается как (потребность пара в фунтах/количество единиц произведенного продукта)","Як часто ви проводите вимірювання контрольного співвідношення пара / продукт, яке розраховується як (потреба в парі у фунтах / кількість одиниць виробленого продукту)"]
[{"$f":"IF(Disclaimer!$C$2=\"English\",B633,IF(Disclaimer!$C$2=\"Russian\",C633,D633))","v":"Please select the following Critical Energy parameters that are measured"},"Please select the following Critical Energy parameters that are measured","Выберите те критические энергетические параметры, которые у Вас измеряются","Виберіть критичні енергетичні параметри, які у Вас вимірюються"]
[{"$f":"IF(Disclaimer!$C$2=\"English\",B634,IF(Disclaimer!$C$2=\"Russian\",C634,D634))","v":"How intensely do you meter your steam flow?"},"How intensely do you meter your steam flow?","Насколько активно Вы измеряете паровые потоки?","Наскільки інтенсивно Ви вимірюєте потоки пари?"]
[{"$f":"IF(Disclaimer!$C$2=\"English\",B635,IF(Disclaimer!$C$2=\"Russian\",C635,D635))","v":"Please select if any one of the following Steam Trap maintenance program is carried out"},"Please select if any one of the following Steam Trap maintenance program is carried out","Выберите те программы обслуживания конденсационных горшков, которые у Вас реализуются","Виберіть ті програми обслуговування конденсаційних горшків, які ви реалізуєте"]
[{"$f":"IF(Disclaimer!$C$2=\"English\",B636,IF(Disclaimer!$C$2=\"Russian\",C636,D636))","v":"Please select how often the water chemical treatment system is functioning properly?"},"Please select how often the water chemical treatment system is functioning properly?","Выберите частоту, с которой система химической очистки воды работает нормально","Виберіть значення  частоти,  з якою система хімічного очищення води працює належним чином"]
[{"$f":"IF(Disclaimer!$C$2=\"English\",B637,IF(Disclaimer!$C$2=\"Russian\",C637,D637))","v":"How often do you measure conductivity ( total dissolved solids) in your boiler and determine what your steam and mud drum blowdown rate (or top and bottom boiler blowdown rate) should be? "},"How often do you measure conductivity ( total dissolved solids) in your boiler and determine what your steam and mud drum blowdown rate (or top and bottom boiler blowdown rate) should be? ","Как часто Вы измеряете удельную электропроводность (солесодержание) в котле и определяете значения необходимой скорости продувок в барабанах для пара и шлама (или же самую высокую и самую низкую скорости продувки котла)? ","Як часто Ви вимірюєте  питому електропровідність  ( солевміст) в котлі та визначаєте значення необхідної швидкості продувки в барабанах для пари та для шламу (або ж найвищу та найнижчу швидкість продувки котла)? "]
[{"$f":"IF(Disclaimer!$C$2=\"English\",B638,IF(Disclaimer!$C$2=\"Russian\",C638,D638))","v":"How often do you NEED to clean fireside or waterside deposit in boilers?"},"How often do you NEED to clean fireside or waterside deposit in boilers?","Как часто вам приходится очищать от осадка огневую или водяную части котла?","Наскільки часто Ви ЗМУШЕНІ очищувати від осаду вогньову або водяну частини котлів?"]
[{"$f":"IF(Disclaimer!$C$2=\"English\",B639,IF(Disclaimer!$C$2=\"Russian\",C639,D639))","v":"Is your boiler plant equipment and piping system insulation (refractory, piping, valves, flanges, vessels, etc.) maintained and in good condition? "},"Is your boiler plant equipment and piping system insulation (refractory, piping, valves, flanges, vessels, etc.) maintained and in good condition? ","Поддерживаются ли у Вас в хорошем состоянии котловое оборудование и изоляция трубопроводов (огнеупоры, трубы, клапаны, фланцы, сосуды и т.п.)?","Чи підтримується в доброму стані ізоляція обладнання розподілу пари, її доставки до споживача та збирання конденсату (трубопроводи, клапани, фланці, теплообмінники, тощо)? "]
[{"$f":"IF(Disclaimer!$C$2=\"English\",B640,IF(Disclaimer!$C$2=\"Russian\",C640,D640))","v":"Is your steam distribution, end use, and condensate recovery equipment insulation (piping, valves, flanges, heat exchangers, etc.) maintained and in good condition? "},"Is your steam distribution, end use, and condensate recovery equipment insulation (piping, valves, flanges, heat exchangers, etc.) maintained and in good condition? ","Поддерживается ли в хорошем состоянии изоляция оборудования парораспределения, доставки пара потребителю и сбора конденсата (трубопроводы, клапаны, фланцы, теплообменники, и т.п.)? ","Чи підтримується в доброму стані ізоляція обладнання розподілу пари, її доставки до споживача та збирання конденсату (трубопроводи, клапани, фланці, теплообмінники, тощо)? "]
[{"$f":"IF(Disclaimer!$C$2=\"English\",B641,IF(Disclaimer!$C$2=\"Russian\",C641,D641))","v":"How  would you characterize steam leaks in steam system"},"How  would you characterize steam leaks in steam system","Как бы вы охарактеризовали утечки пара в паровой системе?","Як ви охарактеризували б витоки пари в паровій системі?"]
[{"$f":"IF(Disclaimer!$C$2=\"English\",B642,IF(Disclaimer!$C$2=\"Russian\",C642,D642))","v":"How often do you detect noticeable water hammer in your steam system and condensate recovery system?"},"How often do you detect noticeable water hammer in your steam system and condensate recovery system?","Как часто Вы обнаруживаете значительные гидравлические удары в паровой системе и в системе сбора конденсата?","Наскільки часто Ви виявляєте істотні гідравлічні удари в паровій системі та системі збирання конденсату?"]
[{"$f":"IF(Disclaimer!$C$2=\"English\",B643,IF(Disclaimer!$C$2=\"Russian\",C643,D643))","v":"Are the following inspected once a year?"},"Are the following inspected once a year?","Проводится ли у Вас инспектирование указанных элементов один раз в год?","Чи здійснюєте Ви інспектування наведених елементів раз на рік?"]
[{"$f":"IF(Disclaimer!$C$2=\"English\",B644,IF(Disclaimer!$C$2=\"Russian\",C644,D644))","v":"Boiler plant equipment - boiler, deaerator, feed water tank, chemical treatment equipment, blowdown equipment, economizer, combustion air preheater, insulation, etc."},"Boiler plant equipment - boiler, deaerator, feed water tank, chemical treatment equipment, blowdown equipment, economizer, combustion air preheater, insulation, etc.","Оборудование котельной: котел, деаэратор, бак для воды, оборудование химической очистки, оборудование продувки, экономайзер, подогреватель топочного воздуха, изоляция и т.п.","Обладнання котельної: котел, деаератор, бак для води, обладнання хімічного очищення, обладнання продувки, економайзер, підігрівач топкового повітря, ізоляція, тощо."]
[{"$f":"IF(Disclaimer!$C$2=\"English\",B645,IF(Disclaimer!$C$2=\"Russian\",C645,D645))","v":"Distribution system equipment - piping (including design), steam traps (types, sizes, locations), air vents, valves, pressure reducing stations, insulation, etc. "},"Distribution system equipment - piping (including design), steam traps (types, sizes, locations), air vents, valves, pressure reducing stations, insulation, etc. ","Оборудование распределяющей системы - трубопроводы (включая конструкцию), конденсационные горшки (по типам, размерам, местам монтажа), проемы для воздуха, клапаны, устройства понижения давления, изоляция и т.п. ","Обладнання системи розподілу - трубопроводи (включаючи конструкцію), конденсаційні горшки (за типами, розмірами, місцем розташування), отвори для повітря, клапани, установки зменшення тиску, ізоляція, тощо. "]
[{"$f":"IF(Disclaimer!$C$2=\"English\",B646,IF(Disclaimer!$C$2=\"Russian\",C646,D646))","v":"End use system equipment - turbines, piping (including design), heat exchangers, coils, jacketed kettles, steam traps (types, sizes, locations), air vents, vacuum breakers, pressure reducing valves, insulation, etc. "},"End use system equipment - turbines, piping (including design), heat exchangers, coils, jacketed kettles, steam traps (types, sizes, locations), air vents, vacuum breakers, pressure reducing valves, insulation, etc. ","Оборудование конечного потребления - турбины, трубопроводы (включая их конструкцию), теплообменники,  котлоагрегаты в кожухе, змеевики, конденсационные горшки (по типам, размерам, местам монтажа), воздушных проемов, вакуумные прерыватели, клапаны-редукторы давления, изоляция и т.п. ","Обладнання кінцевого використання: турбіни, труби (включаючи конструкцію), теплообмінники, змійовики, посудини в кожухах, конденсаційні горшки (за типами, розмірами та місцями монтажу), повітродувки, вакуумні вимикачі, клапани зменшення тиску, ізоляція, тощо. "]
[{"$f":"IF(Disclaimer!$C$2=\"English\",B647,IF(Disclaimer!$C$2=\"Russian\",C647,D647))","v":"Recovery system equipment - piping (including design), valves, fittings, flash tanks, condensate pumps, condensate meters, insulation, etc.?"},"Recovery system equipment - piping (including design), valves, fittings, flash tanks, condensate pumps, condensate meters, insulation, etc.?","Оборудование системы рекуперации - - трубопроводы (включая конструкцию), клапаны, фитинги, расширители, конденсатные насосы , счетчики конденсата, изоляция и т.п.","Обладнання системи рекуперації - трубопроводи (включаючи конструкцію), клапани, фітинги,  розширювачі, конденсаційні насоси, лічильники конденсату, ізоляція, тощо."]
[{"$f":"IF(Disclaimer!$C$2=\"English\",B648,IF(Disclaimer!$C$2=\"Russian\",C648,D648))","v":"If you have heat recovery system , please select the kind"},"If you have heat recovery system , please select the kind","При наличии системы возврата тепла - выберите ее тип","В разі наявності системи повернення тепла - виберіть її тип"]
[{"$f":"IF(Disclaimer!$C$2=\"English\",B649,IF(Disclaimer!$C$2=\"Russian\",C649,D649))","v":"How often do you check the quality of steam that is output from your boiler to the distribution system, and ensure that you are generating Dry steam?"},"How often do you check the quality of steam that is output from your boiler to the distribution system, and ensure that you are generating Dry steam?","Как часто у Вас проверяется качество пара, выдаваемого из котла в распределительную систему, чтобы убедиться в том, что производится именно сухой пар?","Як часто Ви перевіряєте якість пари, яка видається з котла до розподільної системи та переконуєтеся тому, що виробляється саме суха пара?"]
[{"$f":"IF(Disclaimer!$C$2=\"English\",B650,IF(Disclaimer!$C$2=\"Russian\",C650,D650))","v":"Do you have operational automatic blowdown controller on your boiler?"},"Do you have operational automatic blowdown controller on your boiler?","Есть ли у Вас работоспособный автоматический контроллер продувок на котле?","Чи маєте Ви працездатний автоматичний контролер продувок на котлі"]
[{"$f":"IF(Disclaimer!$C$2=\"English\",B651,IF(Disclaimer!$C$2=\"Russian\",C651,D651))","v":"What is the frequency of High Level Alarms(possible indicating boiler undersize ) or Low Alarm(possible indicating boiler oversize) for your boiler?"},"What is the frequency of High Level Alarms(possible indicating boiler undersize ) or Low Alarm(possible indicating boiler oversize) for your boiler?","Как часто срабатывает сигнализация высшего уровня (возможный выход котла за нижний предел параметров) или нижнего уровня (возможный выход котла за высший предел параметров)?","Наскільки часто спрацьовує аварійна сигналізація вищого рівня (можливий вихід котла за нижню межу параметрів) або ж нижчого рівня (можливий вихід котла за вищу межу параметрів)?"]
[{"$f":"IF(Disclaimer!$C$2=\"English\",B652,IF(Disclaimer!$C$2=\"Russian\",C652,D652))","v":"How often do you experience steam pressure fluctuation of greater than 10% of your boiler operating pressure?"},"How often do you experience steam pressure fluctuation of greater than 10% of your boiler operating pressure?","Как часто у Вас наблюдаются колебания давления пара больше чем не 10% рабочего давления котла?","Наскільки часто Ви спостерігаєте коливання тиску пару більше ніж на 10% від робочого тиску Вашого котла?"]
[{"$f":"IF(Disclaimer!$C$2=\"English\",B653,IF(Disclaimer!$C$2=\"Russian\",C653,D653))","v":"Please select a method used to reduce steam pressure in your steam system?"},"Please select a method used to reduce steam pressure in your steam system?","Выберите метод понижения давления пара в Вашей паровой системе","Виберіть метод зменшення тиску пари у Вашій паровій системі?"]
[{"$f":"IF(Disclaimer!$C$2=\"English\",B654,IF(Disclaimer!$C$2=\"Russian\",C654,D654))","v":"How much of your available condensate do you recover and utilize?"},"How much of your available condensate do you recover and utilize?","Какие объемы формируемого конденсата Вы собираете и используете?","Який обсяг наявного конденсату Ви відбираєте та використовуєте?"]
[{"$f":"IF(Disclaimer!$C$2=\"English\",B655,IF(Disclaimer!$C$2=\"Russian\",C655,D655))","v":"If you have flash steam available do you recover and use?"},"If you have flash steam available do you recover and use?","В случае наличия пара в расширителе, производится ли его сбор и использование?","Якщо  маєте пару з розширювача, чи Ви збираєте та використовуєте її?"]
[{"$f":"IF(Disclaimer!$C$2=\"English\",B656,IF(Disclaimer!$C$2=\"Russian\",C656,D656))","v":"How often do you measure over-all boiler efficiency (Heat absorbed to create Steam/Energy input from fuel)"},"How often do you measure over-all boiler efficiency (Heat absorbed to create Steam/Energy input from fuel)","Как часто Вы измеряете общий к.п.д. котла (тепло, поглощенное для формирования подачи пара/энергии за счет топлива)?","Наскільки часто Ви вимірюєте загальний к.к.д. котла (тепло, поглинене для створення подачі пари/енергії за рахунок пального)?"]
[{"$f":"IF(Disclaimer!$C$2=\"English\",B657,IF(Disclaimer!$C$2=\"Russian\",C657,D657))","v":"Please select the parameters that are measured"},"Please select the parameters that are measured","Выберите измеряемые у Вас параметры","Виберіть параметри, які Ви вимірюєте"]
[{"$f":"IF(Disclaimer!$C$2=\"English\",B658,IF(Disclaimer!$C$2=\"Russian\",C658,D658))","v":"How do you control excess air in your boiler to maximize boiler efficiency"},"How do you control excess air in your boiler to maximize boiler efficiency","Каким образом осуществляется контроль избытка воздуха в котле для достижения максимального к.п.д.?","Яким чином Ви контролюєте надлишок повітря в котлі для досягнення максимального к.к.д.?"]
[{"$f":"IF(Disclaimer!$C$2=\"English\",B659,IF(Disclaimer!$C$2=\"Russian\",C659,D659))","v":"Other comments or information  related to Steam generation Equipment, operations etc. "},"Other comments or information  related to Steam generation Equipment, operations etc. ","Другие комментарии или информация относительно оборудования парогенерации, рабочих операций и т.п.","Інші коментарі або інформація стосовно паровиробного обладнання, робочих операцій, тощо. "]
[{"$f":"IF(Disclaimer!$C$2=\"English\",B660,IF(Disclaimer!$C$2=\"Russian\",C660,D660))","v":"at least quarterly"},"at least quarterly","не реже одного раза в квартал","принаймні раз на квартал"]
[{"$f":"IF(Disclaimer!$C$2=\"English\",B661,IF(Disclaimer!$C$2=\"Russian\",C661,D661))","v":"at least annually"},"at least annually","не реже одного раза в год","принаймні раз на рік"]
[{"$f":"IF(Disclaimer!$C$2=\"English\",B662,IF(Disclaimer!$C$2=\"Russian\",C662,D662))","v":"less than annually"},"less than annually","реже чем раз в год","рідше аніж раз на рік"]
[{"$f":"IF(Disclaimer!$C$2=\"English\",B663,IF(Disclaimer!$C$2=\"Russian\",C663,D663))","v":"Steam Production rate"},"Steam Production rate","Объем производства пара","Обсяг вироблення пари"]
[{"$f":"IF(Disclaimer!$C$2=\"English\",B664,IF(Disclaimer!$C$2=\"Russian\",C664,D664))","v":"Fuel flow rate "},"Fuel flow rate ","Затраты топлива","Витрати пального "]
[{"$f":"IF(Disclaimer!$C$2=\"English\",B665,IF(Disclaimer!$C$2=\"Russian\",C665,D665))","v":"Feed water flow rate"},"Feed water flow rate","Затраты питающей систему воды","Витрати води живлення системи"]
[{"$f":"IF(Disclaimer!$C$2=\"English\",B666,IF(Disclaimer!$C$2=\"Russian\",C666,D666))","v":"Makeup water flow rate"},"Makeup water flow rate","Затраты добавляемой воды","Витрати води, що додається"]
[{"$f":"IF(Disclaimer!$C$2=\"English\",B667,IF(Disclaimer!$C$2=\"Russian\",C667,D667))","v":"Blowdown flow rate"},"Blowdown flow rate","Скорость продувки","Швидкість продувки"]
[{"$f":"IF(Disclaimer!$C$2=\"English\",B668,IF(Disclaimer!$C$2=\"Russian\",C668,D668))","v":"Chemical Input flow rate"},"Chemical Input flow rate","Затраты добавляемых химикатов","Витрати хімікатів, що додаються"]
[{"$f":"IF(Disclaimer!$C$2=\"English\",B669,IF(Disclaimer!$C$2=\"Russian\",C669,D669))","v":"By major equipment"},"By major equipment","В элементах основного оборудования","В елементах основного обладнання"]
[{"$f":"IF(Disclaimer!$C$2=\"English\",B670,IF(Disclaimer!$C$2=\"Russian\",C670,D670))","v":"By process unit"},"By process unit","В каждой технологической единице","В кожній технологічній одиниці"]
[{"$f":"IF(Disclaimer!$C$2=\"English\",B671,IF(Disclaimer!$C$2=\"Russian\",C671,D671))","v":"By area or building"},"By area or building","На каждом участке или сооружении","На кожній ділянці або будівлі"]
[{"$f":"IF(Disclaimer!$C$2=\"English\",B672,IF(Disclaimer!$C$2=\"Russian\",C672,D672))","v":"By plant as a whole(i.e., total boiler output)"},"By plant as a whole(i.e., total boiler output)","По общей производительности котла","За загальною продуктивністю котла"]
[{"$f":"IF(Disclaimer!$C$2=\"English\",B673,IF(Disclaimer!$C$2=\"Russian\",C673,D673))","v":"Not at all"},"Not at all","Не измеряем вообще","Взагалі не вимірюємо"]
[{"$f":"IF(Disclaimer!$C$2=\"English\",B674,IF(Disclaimer!$C$2=\"Russian\",C674,D674))","v":"Proper trap selection for application"},"Proper trap selection for application","Правильный выбор горшка для данного контура","Належний вибір грошика для даного застосування"]
[{"$f":"IF(Disclaimer!$C$2=\"English\",B675,IF(Disclaimer!$C$2=\"Russian\",C675,D675))","v":"At least Annual testing of all Traps"},"At least Annual testing of all Traps","Испытания всех горшков не реже одного раза в год","Випробування всіх горшків принаймні раз на рік"]
[{"$f":"IF(Disclaimer!$C$2=\"English\",B676,IF(Disclaimer!$C$2=\"Russian\",C676,D676))","v":"Maintaining a steam Trap database"},"Maintaining a steam Trap database","Ведение базы данных конденсационных горшков","Ведення бази даних конденсаційних горшків"]
[{"$f":"IF(Disclaimer!$C$2=\"English\",B677,IF(Disclaimer!$C$2=\"Russian\",C677,D677))","v":"Repair/ replacing defective Traps"},"Repair/ replacing defective Traps","Ремонт/замена дефектных горшков","Ремонт/заміна дефектних горшків"]
[{"$f":"IF(Disclaimer!$C$2=\"English\",B678,IF(Disclaimer!$C$2=\"Russian\",C678,D678))","v":"at least daily"},"at least daily","не реже одного раза в сутки","принаймні раз на день"]
[{"$f":"IF(Disclaimer!$C$2=\"English\",B679,IF(Disclaimer!$C$2=\"Russian\",C679,D679))","v":"at least weekly"},"at least weekly","не реже одного раза в неделю","принаймні раз на тиждень"]
[{"$f":"IF(Disclaimer!$C$2=\"English\",B680,IF(Disclaimer!$C$2=\"Russian\",C680,D680))","v":"less than weekly"},"less than weekly","реже чем раз в неделю","рідше аніж раз на тиждень"]
[{"$f":"IF(Disclaimer!$C$2=\"English\",B681,IF(Disclaimer!$C$2=\"Russian\",C681,D681))","v":"Continuously or at least once/ shift"},"Continuously or at least once/ shift","Постоянно или не реже одного раза в смену","Постійно або принаймні раз у зміну"]
[{"$f":"IF(Disclaimer!$C$2=\"English\",B682,IF(Disclaimer!$C$2=\"Russian\",C682,D682))","v":"Once/day"},"Once/day","Один раз в день","Раз на день"]
[{"$f":"IF(Disclaimer!$C$2=\"English\",B683,IF(Disclaimer!$C$2=\"Russian\",C683,D683))","v":"Once/week or less"},"Once/week or less","Один раз в неделю","Раз на тиждень "]
[{"$f":"IF(Disclaimer!$C$2=\"English\",B684,IF(Disclaimer!$C$2=\"Russian\",C684,D684))","v":"every 5-10 years"},"every 5-10 years","Один раз в 5-10 лет","раз на 5-10 років"]
[{"$f":"IF(Disclaimer!$C$2=\"English\",B685,IF(Disclaimer!$C$2=\"Russian\",C685,D685))","v":"every 1-5 years"},"every 1-5 years","Один раз в 1-5 лет","раз на 1-5 років"]
[{"$f":"IF(Disclaimer!$C$2=\"English\",B686,IF(Disclaimer!$C$2=\"Russian\",C686,D686))","v":"Once a year or more"},"Once a year or more","Один раз в год или чаще","Раз на рік або частіше"]
[{"$f":"IF(Disclaimer!$C$2=\"English\",B687,IF(Disclaimer!$C$2=\"Russian\",C687,D687))","v":"Excellent "},"Excellent ","Состояние отличное","Стан відмінний "]
[{"$f":"IF(Disclaimer!$C$2=\"English\",B688,IF(Disclaimer!$C$2=\"Russian\",C688,D688))","v":"Good but can be improved"},"Good but can be improved","Состояние хорошее, но может быть улучшено","Стан добрий, але його можна поліпшити"]
[{"$f":"IF(Disclaimer!$C$2=\"English\",B689,IF(Disclaimer!$C$2=\"Russian\",C689,D689))","v":"Inadequate"},"Inadequate","Состояние неудовлетворительное","Стан неналежний"]
[{"$f":"IF(Disclaimer!$C$2=\"English\",B690,IF(Disclaimer!$C$2=\"Russian\",C690,D690))","v":"Excellent "},"Excellent ","Состояние отличное","Стан відмінний "]
[{"$f":"IF(Disclaimer!$C$2=\"English\",B691,IF(Disclaimer!$C$2=\"Russian\",C691,D691))","v":"Good but can be improved"},"Good but can be improved","Состояние хорошее, но может быть улучшено","Стан добрий, але його можна поліпшити"]
[{"$f":"IF(Disclaimer!$C$2=\"English\",B692,IF(Disclaimer!$C$2=\"Russian\",C692,D692))","v":"Inadequate"},"Inadequate","Состояние неудовлетворительное","Стан неналежний"]
[{"$f":"IF(Disclaimer!$C$2=\"English\",B693,IF(Disclaimer!$C$2=\"Russian\",C693,D693))","v":"None"},"None","Отсутствуют","Відсутні"]
[{"$f":"IF(Disclaimer!$C$2=\"English\",B694,IF(Disclaimer!$C$2=\"Russian\",C694,D694))","v":"Minor"},"Minor","Незначительные","Незначні"]
[{"$f":"IF(Disclaimer!$C$2=\"English\",B695,IF(Disclaimer!$C$2=\"Russian\",C695,D695))","v":"Moderate"},"Moderate","Умеренные","Помірні"]
[{"$f":"IF(Disclaimer!$C$2=\"English\",B696,IF(Disclaimer!$C$2=\"Russian\",C696,D696))","v":"Numerous"},"Numerous","Значительные","Значні"]
[{"$f":"IF(Disclaimer!$C$2=\"English\",B697,IF(Disclaimer!$C$2=\"Russian\",C697,D697))","v":"Daily "},"Daily ","Каждый день","Щоденно "]
[{"$f":"IF(Disclaimer!$C$2=\"English\",B698,IF(Disclaimer!$C$2=\"Russian\",C698,D698))","v":"Weekly/ monthly"},"Weekly/ monthly","Каждую неделю / месяц","Щотижнево/щомісячно"]
[{"$f":"IF(Disclaimer!$C$2=\"English\",B699,IF(Disclaimer!$C$2=\"Russian\",C699,D699))","v":"Less than once a month"},"Less than once a month","Реже одного раза в месяц","Рідше аніж раз на місяць"]
[{"$f":"IF(Disclaimer!$C$2=\"English\",B700,IF(Disclaimer!$C$2=\"Russian\",C700,D700))","v":"Feed water economizer and/or combustion air preheater"},"Feed water economizer and/or combustion air preheater","Экономайзер питающей води и/или подогреватель топочного воздуха","Економайзер води живлення та/або підігрівач топкового повітря"]
[{"$f":"IF(Disclaimer!$C$2=\"English\",B701,IF(Disclaimer!$C$2=\"Russian\",C701,D701))","v":"Blowdown heat recovery"},"Blowdown heat recovery","Возврат тепла продувки","Повернення тепла продувки"]
[{"$f":"IF(Disclaimer!$C$2=\"English\",B702,IF(Disclaimer!$C$2=\"Russian\",C702,D702))","v":"Less than 1/ month"},"Less than 1/ month","Реже одного раза в месяц","Рідше ніж раз на місяць"]
[{"$f":"IF(Disclaimer!$C$2=\"English\",B703,IF(Disclaimer!$C$2=\"Russian\",C703,D703))","v":"1-5 per month"},"1-5 per month","1-5 раз в месяц","1-5 разів на місяць"]
[{"$f":"IF(Disclaimer!$C$2=\"English\",B704,IF(Disclaimer!$C$2=\"Russian\",C704,D704))","v":"more than 5 per month"},"more than 5 per month","Чаще 5 раз в месяц","частіше ніж 5 разів на місяць"]
[{"$f":"IF(Disclaimer!$C$2=\"English\",B705,IF(Disclaimer!$C$2=\"Russian\",C705,D705))","v":"Steam generated at required pressure or PRVs appropriately applied"},"Steam generated at required pressure or PRVs appropriately applied","Пар производится под нужным давлением, либо применяется клапан-редуктор давления","Пара виробляється з необхідним тиском або належно використовується клапан скидання тиску"]
[{"$f":"IF(Disclaimer!$C$2=\"English\",B706,IF(Disclaimer!$C$2=\"Russian\",C706,D706))","v":"Backpressure turbines used in parallel with PRVs"},"Backpressure turbines used in parallel with PRVs","Параллельно с клапаном-редуктором давления применяются турбины обратного давления","паралельно з клапаном скидання тиску використовуються турбіни зворотного тиску"]
[{"$f":"IF(Disclaimer!$C$2=\"English\",B707,IF(Disclaimer!$C$2=\"Russian\",C707,D707))","v":"Boiler control used to reduce pressure"},"Boiler control used to reduce pressure","Для сокращения давления используется котел","Для зменшення тиску використовується котел"]
[{"$f":"IF(Disclaimer!$C$2=\"English\",B708,IF(Disclaimer!$C$2=\"Russian\",C708,D708))","v":"Excess steam vent "},"Excess steam vent ","Отверстие для избыточного пара","Отвір для надлишкової пари "]
[{"$f":"IF(Disclaimer!$C$2=\"English\",B709,IF(Disclaimer!$C$2=\"Russian\",C709,D709))","v":"Flue gas temperature"},"Flue gas temperature","Температура дымового газа","Температура димового газу"]
[{"$f":"IF(Disclaimer!$C$2=\"English\",B710,IF(Disclaimer!$C$2=\"Russian\",C710,D710))","v":"Flue gas oxygen content"},"Flue gas oxygen content","Содержание кислорода в дымовом газе","Вміст кисню в димовому газі"]
[{"$f":"IF(Disclaimer!$C$2=\"English\",B711,IF(Disclaimer!$C$2=\"Russian\",C711,D711))","v":"Flue gas CO content"},"Flue gas CO content","Содержание СО в дымовом газе ","Вміст СО в димовому газі"]
[{"$f":"IF(Disclaimer!$C$2=\"English\",B712,IF(Disclaimer!$C$2=\"Russian\",C712,D712))","v":"Automatically"},"Automatically","Автоматически ","Автоматично"]
[{"$f":"IF(Disclaimer!$C$2=\"English\",B713,IF(Disclaimer!$C$2=\"Russian\",C713,D713))","v":"Manually"},"Manually","Вручную","Вручну"]
[{"$f":"IF(Disclaimer!$C$2=\"English\",B714,IF(Disclaimer!$C$2=\"Russian\",C714,D714))","v":"Not at all"},"Not at all","Не контролируем вообще","Взагалі не контролюємо"]
[{"$f":"IF(Disclaimer!$C$2=\"English\",B715,IF(Disclaimer!$C$2=\"Russian\",C715,D715))","v":"Disclaimer"},"Disclaimer","отказ","відмова"]
[{"$f":"IF(Disclaimer!$C$2=\"English\",B716,IF(Disclaimer!$C$2=\"Russian\",C716,D716))","v":"This tool was prepared as an account of work sponsored by an agency of the United States Government. Neither the United States Government nor any agency thereof, nor any of their employees, makes any warranty, express or implied, or assumes any legal liability or responsibility for the accuracy, completeness, or usefulness of any information, apparatus, product, or process disclosed, or represents that its use would not infringe privately owned rights. Reference herein to any specific commercial product, process, or service by trade name, trademark, manufacturer, or otherwise, does not necessarily constitute or imply its endorsement, recommendation, or favoring by the United States Government or any agency thereof. The views and opinions of authors expressed herein do not necessarily state or reflect those of the United States Government or any agency thereof."},"This tool was prepared as an account of work sponsored by an agency of the United States Government. Neither the United States Government nor any agency thereof, nor any of their employees, makes any warranty, express or implied, or assumes any legal liability or responsibility for the accuracy, completeness, or usefulness of any information, apparatus, product, or process disclosed, or represents that its use would not infringe privately owned rights. Reference herein to any specific commercial product, process, or service by trade name, trademark, manufacturer, or otherwise, does not necessarily constitute or imply its endorsement, recommendation, or favoring by the United States Government or any agency thereof. The views and opinions of authors expressed herein do not necessarily state or reflect those of the United States Government or any agency thereof.","Данный инструмент был подготовлен для учета работ, выполняемых при поддержке государственного ведомства США. Ни правительство США, ни какое-либо из его ведомств и никто из их сотрудников не дает прямых или косвенных гарантий, не принимает на себя никакой юридической ответственности за точность, полноту или пользу любой заявленной здесь информации, аппаратуры, продукции или технологии и не заявляет от том, что их использование не нарушит каких-либо частных прав. Приведенные здесь ссылки на любой коммерческий продукт, технологию или услугу с указанием торговой марки, изготовителя или других данных не означает их обязательного утверждения, рекомендации или приоритетного принятия со стороны правительства США либо любого из его ведомств. Выраженные в данном инструменте точки зрения авторов не обязательно отражают точку зрения правительства США и любого его ведомства и не объявляются от их имени.","Цей інструмент був підготовлений для обліку робіт, що виконуються за підтримки державного відомства США. Ані уряд США, ані жодне з його відомств, ані жодний з їхніх співпрацівників не надає прямих або опосередкованих гарантій, не бере на себе жодної юридичної відповідальності за точність, повноту або корисність будь-якої заявленої тут інформації, апаратури, продукції та технології і не заявляє про те, що їх використання не порушить яких-небудь приватних прав. Наведені тут посилання на будь-який комерційний продукт, технологію або послугу із зазначенням торгівельної марки, виробника або інших даних не означає їх обов'язкового затвердження, рекомендації або пріоритетного прийняття з боку уряду США або будь-якого з його відомств. Висловлені в цьому інструменті точки зору авторів не обов'язково відбивають точку зору уряду США та будь-якого з його відомств та не оголошуються від його імені."]
[{"$f":"IF(Disclaimer!$C$2=\"English\",B717,IF(Disclaimer!$C$2=\"Russian\",C717,D717))","v":"Plant Energy Profiler Results"},"Plant Energy Profiler Results","Результаты обработки данных классификатором энергетики установки","Результати обробки даних класифікатором енергетики установки"]
[{"$f":"IF(Disclaimer!$C$2=\"English\",B718,IF(Disclaimer!$C$2=\"Russian\",C718,D718))","v":"The Plant Energy Profiler (PEP) tool helps industrial plant managers understand how energy is being purchased and consumed at their plant and identifies potential energy and cost savings. Once the user has entered the basic plant info, energy and production data, energy intensive equipment used in the plant the tools helps to breakdown the energy consumption for the equipment in the plant, the cost of energy associated to operate the equipment, and the potential energy saving  that can be achieved. The tool further gives the user a list of next steps or potential projects that might help the plant to reduce energy consumption. PEP is an excellent “first step” that industrial companies can use to identify opportunities for savings, improve their energy consumption , and help reduce the environmental emissions associated with energy production and use. \n\nTable 1 shows plant's contact information and industry type. "},"The Plant Energy Profiler (PEP) tool helps industrial plant managers understand how energy is being purchased and consumed at their plant and identifies potential energy and cost savings. Once the user has entered the basic plant info, energy and production data, energy intensive equipment used in the plant the tools helps to breakdown the energy consumption for the equipment in the plant, the cost of energy associated to operate the equipment, and the potential energy saving  that can be achieved. The tool further gives the user a list of next steps or potential projects that might help the plant to reduce energy consumption. PEP is an excellent “first step” that industrial companies can use to identify opportunities for savings, improve their energy consumption , and help reduce the environmental emissions associated with energy production and use. \n\nTable 1 shows plant's contact information and industry type. ","Инструмент \"Классификатор энергетики установки\" (PEP) помогает руководству промышленной установки разобраться в процессах закупки и потребления энергии на их установке и указывает на потенциальную экономию энергии и средств. После того как пользователь вводит базовые данные по установке, данные об энергопотреблении и производстве, энергозатратном оборудовании, используемом в установке, данный инструмент помогает выполнить разбивку значений потребления энергии оборудованием установки, стоимости энергии, необходимой для эксплуатации оборудования, и потенциальной экономии энергии, которой можно достичь. Кроме того, данный инструмент предлагает пользователю перечень последующих шагов или потенциальных проектов, которые могут способствовать сокращению потребления энергии установкой. PEP это прекрасный \"первый шаг\", которым могут воспользоваться промышленные компании для выявления возможностей экономии, оптимизации энергопотребления, а также сокращения связанных с с использованием энергии выбросов в окружающую среду. \nВ табл. 1 приведены контактные данные по установке и отрасль промышленности. ","Інструмент \"Класифікатор енергетики установки\" *(РЕР) допомагає керівництву промислової установки зрозуміти процеси закупівлі та споживання енергії на їхній установці та вказує на потенційне заощадження енергії та коштів. Після того як користувач вводить базові дані щодо установки, дані про енергоспоживання та виробництво, енергозатратне обладнання, що використовується в установці, цей інструмент допомагає виконати розбивання значень споживання енергії обладнанням установки, вартості енергії, необхідної для експлуатації обладнання та потенційних заощаджень енергії, які можуть бути досягнуті. Крім того, цей інструмент пропонує користувачеві перелік подальших кроків або ж потенційних проектів, які можуть сприяти скороченню споживання енергії установкою. РЕР - це удовий \"перший крок\", яким можуть скористатися промислові компанії для виявлення можливостей заощадження, оптимізації споживання енергії, а також скорочення пов'язаних з використанням енергії викидів в довкілля. \nВ табл. 1 зазначена контактна інформація установки та галузь промисловості. "]
[{"$f":"IF(Disclaimer!$C$2=\"English\",B719,IF(Disclaimer!$C$2=\"Russian\",C719,D719))","v":"Table 1: Plant Contact Information"},"Table 1: Plant Contact Information","Табл.1: контактные данные по установке","Табл. 1: контактні дані щодо установки"]
[{"$f":"IF(Disclaimer!$C$2=\"English\",B720,IF(Disclaimer!$C$2=\"Russian\",C720,D720))","v":"Table 2  shows the annual purchased (site) electricity , natural gas, steam, and other fuels consumption data; the cost of each energy stream and their source power consumption for the baseline year. "},"Table 2  shows the annual purchased (site) electricity , natural gas, steam, and other fuels consumption data; the cost of each energy stream and their source power consumption for the baseline year. ","В табл. 2 приведены данные по ежегодным закупкам электроэнергии, природного газа, пара и другие данные по потреблению топлива; стоимость каждого энергетического потока и потребление энергии источника на базовый год. ","В табл. 2 наведені дані щодо річним закупівлям електроенергії, природного газу, пари та інші дані щодо споживання пального; вартість кожного енергетичного потоку та споживання енергії джерела на базовий рік."]
[{"$f":"IF(Disclaimer!$C$2=\"English\",B721,IF(Disclaimer!$C$2=\"Russian\",C721,D721))","v":"Table 2: Annual Energy Use Summary"},"Table 2: Annual Energy Use Summary","Табл. 2: Сводные данные по ежегодному потреблению энергии","Табл. 2:Зведені дані щодо річного споживання енергії"]
[{"$f":"IF(Disclaimer!$C$2=\"English\",B722,IF(Disclaimer!$C$2=\"Russian\",C722,D722))","v":"Site Energy Use"},"Site Energy Use","Потребление энергии на объекте ","Споживання енергії на об'єкті "]
[{"$f":"IF(Disclaimer!$C$2=\"English\",B723,IF(Disclaimer!$C$2=\"Russian\",C723,D723))","v":"Energy Cost($)"},{"$f":"CONCATENATE(\"Energy Cost\", \"(\",List!$G$48,\")\")","v":"Energy Cost($)"},{"$f":"CONCATENATE(\"Стоимость энергии на объекте \", \"(\",List!$G$48,\")\")","v":"Стоимость энергии на объекте ($)"},{"$f":"CONCATENATE(\"Вартість енергії на об'єкті \", \"(\",List!$G$48,\")\")","v":"Вартість енергії на об'єкті ($)"}]
[{"$f":"IF(Disclaimer!$C$2=\"English\",B724,IF(Disclaimer!$C$2=\"Russian\",C724,D724))","v":"Site Energy Use (0)"},{"$f":"CONCATENATE(\"Site Energy Use \", \"(\",List!$G$44,\")\")","v":"Site Energy Use (0)"},{"$f":"CONCATENATE(\"Использование энергии источника\", \"(\",List!$G$44,\")\")","v":"Использование энергии источника(0)"},{"$f":"CONCATENATE(\"Використання енергії джерела \", \"(\",List!$G$44,\")\")","v":"Використання енергії джерела (0)"}]
[{"$f":"IF(Disclaimer!$C$2=\"English\",B725,IF(Disclaimer!$C$2=\"Russian\",C725,D725))","v":"Total Site Energy Use (0)"},{"$f":"CONCATENATE(\"Total Site Energy Use \", \"(\",List!$G$44,\")\")","v":"Total Site Energy Use (0)"},{"$f":"CONCATENATE(\"Итого Источник использование энергии\", \"(\",List!$G$44,\")\")","v":"Итого Источник использование энергии(0)"},{"$f":"CONCATENATE(\"3агальний Використання енергії джерела \", \"(\",List!$G$44,\")\")","v":"3агальний Використання енергії джерела (0)"}]
[{"$f":"IF(Disclaimer!$C$2=\"English\",B726,IF(Disclaimer!$C$2=\"Russian\",C726,D726))","v":"Source Energy Use (0)"},{"$f":"CONCATENATE(\"Source Energy Use \", \"(\",List!$G$44,\")\")","v":"Source Energy Use (0)"}]
[{"$f":"IF(Disclaimer!$C$2=\"English\",B727,IF(Disclaimer!$C$2=\"Russian\",C727,D727))","v":"Grand Total "},"Grand Total ","Итого","Загалом"]
[{"$f":"IF(Disclaimer!$C$2=\"English\",B728,IF(Disclaimer!$C$2=\"Russian\",C728,D728))","v":"Figures 1a and 1b show the annual site electricity , natural gas, steam, and other fuels consumption in mega joules; and the cost of each energy stream."},"Figures 1a and 1b show the annual site electricity , natural gas, steam, and other fuels consumption in mega joules; and the cost of each energy stream.","На рис. 1a и 1b представлены данные по годовому потреблению на объекте электроэнергии, природного газа, пара и других видов топлива в мегаджоулях; а также стоимость каждого энергетического потока.","На мал. 1a та 1b наведені дані щодо річного споживання електроенергії, природного газу, пари та інших видів пального в мегаджоулях; також, вартість кожного енергетичного потоку."]
[{"$f":"IF(Disclaimer!$C$2=\"English\",B729,IF(Disclaimer!$C$2=\"Russian\",C729,D729))","v":"Table 3 shows the annual production for the different products that are produced in the plant along with the energy intensity for the baseline year. "},"Table 3 shows the annual production for the different products that are produced in the plant along with the energy intensity for the baseline year. ","На табл. 3 представлены годовые объемы производства разных продуктов, производимых на установке параллельноданным по энергозатратности на базовый год. ","В табл. 3 надані річні обсяги виробництва різних продуктів, що виробляються на установці, паралельно з даними енергозатратності на базовий рік."]
[{"$f":"IF(Disclaimer!$C$2=\"English\",B730,IF(Disclaimer!$C$2=\"Russian\",C730,D730))","v":"Table 3: Production Energy Use"},"Table 3: Production Energy Use","Табл. 3: Использование энергии для производства","Табл. 3: Використання енергії для виробництва"]
[{"$f":"IF(Disclaimer!$C$2=\"English\",B731,IF(Disclaimer!$C$2=\"Russian\",C731,D731))","v":"Production Stream "},"Production Stream ","Производственный поток","Виробничий потік"]
[{"$f":"IF(Disclaimer!$C$2=\"English\",B732,IF(Disclaimer!$C$2=\"Russian\",C732,D732))","v":"Quantity"},"Quantity","Количество","Кількість"]
[{"$f":"IF(Disclaimer!$C$2=\"English\",B733,IF(Disclaimer!$C$2=\"Russian\",C733,D733))","v":"Energy Use (MJ)"},"Energy Use (MJ)","Использование энергии (МДж)","Використання енергії (МДж)"]
[{"$f":"IF(Disclaimer!$C$2=\"English\",B734,IF(Disclaimer!$C$2=\"Russian\",C734,D734))","v":"Energy Use per Unit of Production (MJ/unit)"},"Energy Use per Unit of Production (MJ/unit)","Использование энергии на единицу продукции (МДж/ед.)","Використання енергії на одиницю продукції (МДж/од.)"]
[{"$f":"IF(Disclaimer!$C$2=\"English\",B735,IF(Disclaimer!$C$2=\"Russian\",C735,D735))","v":"Product 1"},"Product 1","Продукт 1","Продукт 1"]
[{"$f":"IF(Disclaimer!$C$2=\"English\",B736,IF(Disclaimer!$C$2=\"Russian\",C736,D736))","v":"Product 2"},"Product 2","Продукт 2","Продукт 2"]
[{"$f":"IF(Disclaimer!$C$2=\"English\",B737,IF(Disclaimer!$C$2=\"Russian\",C737,D737))","v":"Product 3"},"Product 3","Продукт 3","Продукт 3"]
[{"$f":"IF(Disclaimer!$C$2=\"English\",B738,IF(Disclaimer!$C$2=\"Russian\",C738,D738))","v":"Fig. 2a shows the distribution of electricity , natural gas, and other fuel.  "},"Fig. 2a shows the distribution of electricity , natural gas, and other fuel.  ","На рис. 2a приведены данные месячного потребления энергии (электричество, природный газ, пар и другие виды топлива) установкой параллельно данным производства за месяц. На рис. 2b представлено распределение электроэнергии, природного газа и других видов топлива. ","Fна мал. 2 а наведені дані щодо місячного споживання енергії (електрика, природний газ, пара та інші види пального) установкою паралельно з даними виробництва за місяць. На мал. 2b показаний розподіл електроенергії, природного газу та інших видів пального. "]
[{"$f":"IF(Disclaimer!$C$2=\"English\",B739,IF(Disclaimer!$C$2=\"Russian\",C739,D739))","v":"Fig. 2b shows the monthly energy consumption (electricity, natural gas, steam, and other fuels) of the plant along with their monthly production data."},"Fig. 2b shows the monthly energy consumption (electricity, natural gas, steam, and other fuels) of the plant along with their monthly production data."]
[{"$f":"IF(Disclaimer!$C$2=\"English\",B740,IF(Disclaimer!$C$2=\"Russian\",C740,D740))","v":"Total annual consumption for baseline year was estimated at"},"Total annual consumption for baseline year was estimated at","Общее годовое потребление на базовый год было оценено как","Загальне річне споживання на базовий рік було оцінене як"]
[{"$f":"IF(Disclaimer!$C$2=\"English\",B741,IF(Disclaimer!$C$2=\"Russian\",C741,D741))","v":"with annual production of"},"with annual production of","при годовом производстве","за річного виробництва"]
[{"$f":"IF(Disclaimer!$C$2=\"English\",B742,IF(Disclaimer!$C$2=\"Russian\",C742,D742))","v":"Figure 2c shows the correlation between Energy Intensity and production. "},"Figure 2c shows the correlation between Energy Intensity and production. ","На рисунке 2c показана корреляция между энергетической Intenisty и производства. Можно видеть , что энергия intenisty ниже , когда производство является высоким , и наоборот.","\nНа малюнку 2c показана кореляція між енергетичної Intenisty і виробництва . Можна бачити , що енергія intenisty нижче , коли виробництво є високим , і навпаки ."]
[{"$f":"IF(Disclaimer!$C$2=\"English\",B743,IF(Disclaimer!$C$2=\"Russian\",C743,D743))","v":"Figure 3a. shows the different energy type used by each system type present in the plant. This helps the user to understand how much energy each system is using. "},"Figure 3a. shows the different energy type used by each system type present in the plant. This helps the user to understand how much energy each system is using. ","На рис. 3a показаны различные виды энергии, используемые каждым из типов систем установки. Это поможет пользователю понять, какие объемы энергии используются каждой из систем. ","На мал. 3a наведені різні види енергії, що використовуються кожним з типів систем установки. Це допоможе користувачеві зрозуміти, які обсяги енергії використовуються кожною з систем."]
[{"$f":"IF(Disclaimer!$C$2=\"English\",B744,IF(Disclaimer!$C$2=\"Russian\",C744,D744))","v":"Table 4. summarizes the source energy consumption of each system. The user can see score from the scorecard if they have filled the forms for the system present in the plant. The tool uses the score from the scorecard (if the user has filled the scorecard) or the input from the \"Energy saving opportunity\" tab  to categorize the energy saving opportunity and gives the energy saving that can be achieved."},"Table 4. summarizes the source energy consumption of each system. The user can see score from the scorecard if they have filled the forms for the system present in the plant. The tool uses the score from the scorecard (if the user has filled the scorecard) or the input from the \"Energy saving opportunity\" tab  to categorize the energy saving opportunity and gives the energy saving that can be achieved.","В табл. 4 подытожены данные по потреблению источников энергии каждой системой. Если пользователь заполнил формуляры карточек по системам установки, он имеет возможность подсчета баллов. В инструменте используются результаты карточек оценки (если пользователь эти карточки заполнил) или же данные таблицы \"Возможности экономии энергии\" для разбивки таких возможностей на категории, а также приводятся данные по экономии энергии, которая может быть достигнута.","В табл. 4 підсумовані дані про споживання джерел енергії кожною із систем. Якщо користувач заповнив формуляри карток за системами установки, він має можливість підрахувати бали. В інструменті використовуються результати карток оцінки (якщо користувач їх заповнив) або ж дані таблиці \"Можливості заощадження енергії\" для розбивання таких можливостей за категоріями, а також наводяться дані про заощадження енергії, які можуть бути досягнуті."]
[{"$f":"IF(Disclaimer!$C$2=\"English\",B745,IF(Disclaimer!$C$2=\"Russian\",C745,D745))","v":"The savings shown below correspond with the system and component recommendations shown in the suggested next steps table. The United Nations Industrial Development Organization Motor Systems Efficiency Supply Curves report shows that higher savings may be achievable for each system area."},"The savings shown below correspond with the system and component recommendations shown in the suggested next steps table. The United Nations Industrial Development Organization Motor Systems Efficiency Supply Curves report shows that higher savings may be achievable for each system area.","Приведенные ниже значения экономии соотнесены с рекомендациями по системам и компонентам, приведенными в таблице предлагаемых дальнейших шагов. Кривые эффективности работы двигательных установок Организации промышленного развития ООН указывают на возможности достижения более высоких значений экономии по каждому направлению систем.","Наведені далі значення заощадження є співвіднесеними з рекомендаціями за системами та компонентами, подані в таблиці подальших кроків, що пропонуються. Криві ефективності роботи силових установок Організації промислового розвитку ООН вказуються на можливості досягнення більш високих значень економії за кожним напрямком систем."]
[{"$f":"IF(Disclaimer!$C$2=\"English\",B746,IF(Disclaimer!$C$2=\"Russian\",C746,D746))","v":"Note:"},"Note:","Примечание:","Примітка:"]
[{"$f":"IF(Disclaimer!$C$2=\"English\",B747,IF(Disclaimer!$C$2=\"Russian\",C747,D747))","v":"Table 4: Potential Annual Energy Savings()"},{"$f":"CONCATENATE(\"Table 4: Potential Annual Energy Savings\",\"(\",'Energy & Production '!$F$12,\")\")","v":"Table 4: Potential Annual Energy Savings()"},{"$f":"CONCATENATE(\"Табл. 4: Потенциальная экономия энергии за год\",\"(\",'Energy & Production '!F12,\")\")","v":"Табл. 4: Потенциальная экономия энергии за год()"},{"$f":"CONCATENATE(\"Табл. 4: Потенціальні заощадження за рік\",\"(\",'Energy & Production '!F12,\")\")","v":"Табл. 4: Потенціальні заощадження за рік()"}]
[{"$f":"IF(Disclaimer!$C$2=\"English\",B748,IF(Disclaimer!$C$2=\"Russian\",C748,D748))","v":"System Name"},"System Name","Наименование системы","Найменування системи"]
[{"$f":"IF(Disclaimer!$C$2=\"English\",B749,IF(Disclaimer!$C$2=\"Russian\",C749,D749))","v":"Site Energy Consumption ()"},{"$f":"CONCATENATE(\"Site Energy Consumption\",\" (\",'Energy & Production '!$F$12,\")\")","v":"Site Energy Consumption ()"},{"$f":"CONCATENATE(\"Потребление энергии источника\",\n\"(\",'Energy & Production '!F12,\")\")","v":"Потребление энергии источника()"},{"$f":"CONCATENATE(\"Споживання енергії джерела\",\"(\",'Energy & Production '!F12,\")\")","v":"Споживання енергії джерела()"}]
[{"$f":"IF(Disclaimer!$C$2=\"English\",B750,IF(Disclaimer!$C$2=\"Russian\",C750,D750))","v":"Scorecard Score"},"Scorecard Score","Баллы по  карточке","Бали за карткою"]
[{"$f":"IF(Disclaimer!$C$2=\"English\",B751,IF(Disclaimer!$C$2=\"Russian\",C751,D751))","v":"Saving Opportunity "},"Saving Opportunity ","Возможности экономии","Можливості заощадження"]
[{"$f":"IF(Disclaimer!$C$2=\"English\",B752,IF(Disclaimer!$C$2=\"Russian\",C752,D752))","v":"Potential Energy Savings by System\n(%)"},"Potential Energy Savings by System\n(%)","Потенциальная экономия энергии \n(%)","Потенційні заощадження енергії \n(%)"]
[{"$f":"IF(Disclaimer!$C$2=\"English\",B753,IF(Disclaimer!$C$2=\"Russian\",C753,D753))","v":"Potential Site Energy Savings()"},{"$f":"CONCATENATE(\"Potential Site Energy Savings\",\"(\",'Energy & Production '!F12,\")\")","v":"Potential Site Energy Savings()"},{"$f":"CONCATENATE(\"Потенциальная экономия энергии\",\"(\",'Energy & Production '!F12,\")\")","v":"Потенциальная экономия энергии()"},{"$f":"CONCATENATE(\"Потенційні заощадження енергії\",\"(\",'Energy & Production '!F12,\")\")","v":"Потенційні заощадження енергії()"}]
[{"$f":"IF(Disclaimer!$C$2=\"English\",B754,IF(Disclaimer!$C$2=\"Russian\",C754,D754))","v":"Total"},"Total","Итого","Загалом"]
[{"$f":"IF(Disclaimer!$C$2=\"English\",B755,IF(Disclaimer!$C$2=\"Russian\",C755,D755))","v":"Fig 3b. shows the percentage energy consumption per system. "},"Fig 3b. shows the percentage energy consumption per system. ","На рис. 3b. показана доля потребления энергии по системам. ","На мал. 3b показана частка споживання енергії за системами"]
[{"$f":"IF(Disclaimer!$C$2=\"English\",B756,IF(Disclaimer!$C$2=\"Russian\",C756,D756))","v":"Fig. 4a shows the annual energy consumption and the potential energy saving for each system."},"Fig. 4a shows the annual energy consumption and the potential energy saving for each system.","На рис. 4a показано годовое потребление энергии и потенциальная экономия энергии по каждой системе.","На мал. 4b показане річне споживання енергії та потенційні заощадження енергії для кожної системи."]
[{"$f":"IF(Disclaimer!$C$2=\"English\",B757,IF(Disclaimer!$C$2=\"Russian\",C757,D757))","v":"Fig. 4b shows the annual energy consumption and the potential energy saving for each fuel source."},"Fig. 4b shows the annual energy consumption and the potential energy saving for each fuel source.","На рис. 4b показывает годовое потребление энергии и потенциальной экономии энергии для каждого источника топлива","На мал. 4b показує річне споживання енергії і потенційної економії енергії для кожного джерела палива"]
[{"$f":"IF(Disclaimer!$C$2=\"English\",B758,IF(Disclaimer!$C$2=\"Russian\",C758,D758))","v":"Figures 5a, 5b , 5c and 5d provide a breakdown of the annual energy consumption and the potential energy saving for each fuel source in its original units."},"Figures 5a, 5b , 5c and 5d provide a breakdown of the annual energy consumption and the potential energy saving for each fuel source in its original units.","Фигуры 5а, 5b, 5с и 5d приводится разбивка годового потребления энергии и потенциальной экономии энергии для каждого источника топлива в своих первоначальных единицах.","Фігури 5а, 5b, 5с і 5d наводиться розбивка річного споживання енергії і потенційної економії енергії для кожного джерела палива в своїх початкових одиницях."]
[{"$f":"IF(Disclaimer!$C$2=\"English\",B759,IF(Disclaimer!$C$2=\"Russian\",C759,D759))","v":"Electricity Use and Potential Savings by System "},"Electricity Use and Potential Savings by System ","Электричество Использование и Потенциальная экономия по системе","Електрика Використання і Потенційна економія по системі"]
[{"$f":"IF(Disclaimer!$C$2=\"English\",B760,IF(Disclaimer!$C$2=\"Russian\",C760,D760))","v":"Natural Gas Use and Potential Savings by System "},"Natural Gas Use and Potential Savings by System ","Естественное использование газа и Потенциальная экономия по системе","Природне використання газу і Потенційна економія по системі"]
[{"$f":"IF(Disclaimer!$C$2=\"English\",B761,IF(Disclaimer!$C$2=\"Russian\",C761,D761))","v":"Steam Use and Potential Savings by System "},"Steam Use and Potential Savings by System ","Паровой Использование и Потенциальная экономия по системе","Паровий Використання і Потенційна економія по системі"]
[{"$f":"IF(Disclaimer!$C$2=\"English\",B762,IF(Disclaimer!$C$2=\"Russian\",C762,D762))","v":"Other Fuel Usage and Potential Savings by System "},"Other Fuel Usage and Potential Savings by System ","Использование других источников топлива и Потенциальная экономия по системе","Використання інших джерел палива і Потенційна економія по системі"]
[{"$f":"IF(Disclaimer!$C$2=\"English\",B763,IF(Disclaimer!$C$2=\"Russian\",C763,D763))","v":"Electricity Consumption"},"Electricity Consumption","Использование электроэнергии","Використання електроенергії"]
[{"$f":"IF(Disclaimer!$C$2=\"English\",B764,IF(Disclaimer!$C$2=\"Russian\",C764,D764))","v":"Potential Electricity Savings"},"Potential Electricity Savings","Потенциальные сбережения электроэнергии","Потенційні заощадження електроенергії"]
[{"$f":"IF(Disclaimer!$C$2=\"English\",B765,IF(Disclaimer!$C$2=\"Russian\",C765,D765))","v":"Natural Gas Consumption"},"Natural Gas Consumption","Использование природного газа","Використання природного газу"]
[{"$f":"IF(Disclaimer!$C$2=\"English\",B766,IF(Disclaimer!$C$2=\"Russian\",C766,D766))","v":"Potential NG Savings"},"Potential NG Savings","Потенциальные NG Экономия","Потенційні NG Економія"]
[{"$f":"IF(Disclaimer!$C$2=\"English\",B767,IF(Disclaimer!$C$2=\"Russian\",C767,D767))","v":"Steam Consumption"},"Steam Consumption","Использование пара","Використання пара"]
[{"$f":"IF(Disclaimer!$C$2=\"English\",B768,IF(Disclaimer!$C$2=\"Russian\",C768,D768))","v":"Potential Steam Savings"},"Potential Steam Savings","Потенциальная экономия Паровые","Потенційна економія Парові"]
[{"$f":"IF(Disclaimer!$C$2=\"English\",B769,IF(Disclaimer!$C$2=\"Russian\",C769,D769))","v":"Other Fuel Consumption"},"Other Fuel Consumption","Другое Использование топлива","Інша Використання палива"]
[{"$f":"IF(Disclaimer!$C$2=\"English\",B770,IF(Disclaimer!$C$2=\"Russian\",C770,D770))","v":"Potential Other Fuel Savings"},"Potential Other Fuel Savings","Потенциальные Другие Экономия топлива","Потенційні Інші Економія палива"]
[{"$f":"IF(Disclaimer!$C$2=\"English\",B771,IF(Disclaimer!$C$2=\"Russian\",C771,D771))","v":"Figures 6a presents the breakdown of the annual electricity consumption a by system in a pie chart. "},"Figures 6a presents the breakdown of the annual electricity consumption a by system in a pie chart. ","6a цифры представлены разбивка годового потребления электроэнергии системой в круговой диаграмме.","Цифри 6a представляє пробою щорічним споживанням електроенергії за системою секторній діаграмі."]
[{"$f":"IF(Disclaimer!$C$2=\"English\",B772,IF(Disclaimer!$C$2=\"Russian\",C772,D772))","v":"Figures 7a presents the breakdown of the annual natural gas consumptionby system in a pie chart. "},"Figures 7a presents the breakdown of the annual natural gas consumptionby system in a pie chart. ","7a цифры представляет разбивка системы ежегодного consumptionby природного газа в виде круговой диаграммы.","Цифри 7a представляє пробою щорічний природний газ consumptionby системи секторній діаграмі."]
[{"$f":"IF(Disclaimer!$C$2=\"English\",B773,IF(Disclaimer!$C$2=\"Russian\",C773,D773))","v":"Figures 8a presents the breakdown of the annual steam consumption by system in a pie chart. The outher pie represents the total steam used while the inner pie represents the potential saings."},"Figures 8a presents the breakdown of the annual steam consumption by system in a pie chart. The outher pie represents the total steam used while the inner pie represents the potential saings.","8a цифры представляет разбивка годового потребления пара в круговой диаграмме системы. Наружный пирог представляет всего пара используется в то время как внутренний пирог представляет потенциальные saings.","Цифри 8a представляє пробою річним споживанням паровою системою секторній діаграмі. Яка outher пиріг представляє загальний парова використовували а внутрішнє секторній представляє потенційну saings."]
[{"$f":"IF(Disclaimer!$C$2=\"English\",B774,IF(Disclaimer!$C$2=\"Russian\",C774,D774))","v":"Figures 9a presents the breakdown of the annual consumption of miscellaneous fuel by system in a pie chart. "},"Figures 9a presents the breakdown of the annual consumption of miscellaneous fuel by system in a pie chart. ","9А цифры представляет разбивка годового потребления топлива прочее системой в круговой диаграмме.","Цифри 9a представляє пробою річним споживанням палива Різне, система секторній діаграмі."]
[{"$f":"IF(Disclaimer!$C$2=\"English\",B775,IF(Disclaimer!$C$2=\"Russian\",C775,D775))","v":"Figures 6b presents the breakdown of the annual electricity consumption and the potential electricity saving by system in a stacked bar chart. "},"Figures 6b presents the breakdown of the annual electricity consumption and the potential electricity saving by system in a stacked bar chart. ","На рисунках 6b представлены разбивка годового потребления электроэнергии и потенциальную экономию электроэнергии за счет системы в столбчатой ​​диаграмме.","На малюнках 6b представлені розбивка річного споживання електроенергії і потенційну економію електроенергії за рахунок системи в столбчатой ​​діаграмі."]
[{"$f":"IF(Disclaimer!$C$2=\"English\",B776,IF(Disclaimer!$C$2=\"Russian\",C776,D776))","v":"Figures 7b presents the breakdown of the annual natural gas consumption and the potential natural gas saving by system in a stacked bar chart. "},"Figures 7b presents the breakdown of the annual natural gas consumption and the potential natural gas saving by system in a stacked bar chart. ","На рисунках 7b представлены разбивка годового потребления природного газа и потенциальную экономию природного газа за счет системы в столбчатой ​​диаграмме.","На малюнках 7b представлені розбивка річного споживання природного газу і потенційну економію природного газу за рахунок системи в столбчатой ​​діаграмі."]
[{"$f":"IF(Disclaimer!$C$2=\"English\",B777,IF(Disclaimer!$C$2=\"Russian\",C777,D777))","v":"Figures 8b presents the breakdown of the annual steam consumption and the potential steam saving by system in a stacked bar chart. "},"Figures 8b presents the breakdown of the annual steam consumption and the potential steam saving by system in a stacked bar chart. ","На рисунках 8b представлены разбивка годового потребления пара и потенциальную экономию пара путем системы в столбчатой ​​диаграмме.","На малюнках 8b представлені розбивка річного споживання пара і потенційну економію пара шляхом системи в столбчатой ​​діаграмі."]
[{"$f":"IF(Disclaimer!$C$2=\"English\",B778,IF(Disclaimer!$C$2=\"Russian\",C778,D778))","v":"Figures 9b presents the breakdown of the annual  consumption and the potential electricity saving by system in a stacked bar chart. "},"Figures 9b presents the breakdown of the annual  consumption and the potential electricity saving by system in a stacked bar chart. ","Фигуры 9b представляет разбивка годового потребления и потенциальную экономию электроэнергии за счет системы в столбчатой ​​диаграмме.","Фігури 9b представляє розбивка річного споживання і потенційну економію електроенергії за рахунок системи в столбчатой ​​діаграмі."]
[{"$f":"IF(Disclaimer!$C$2=\"English\",B779,IF(Disclaimer!$C$2=\"Russian\",C779,D779))","v":"Potential Annual CO2 Emissions Savings"},"Potential Annual CO2 Emissions Savings","Потенциальное сокращение годовых выбросов СО2","Потенційне скороченні річних викидів СО2"]
[{"$f":"IF(Disclaimer!$C$2=\"English\",B780,IF(Disclaimer!$C$2=\"Russian\",C780,D780))","v":"Based on the potential energy savings identified above, your plant may be able to reduce emissions of CO2. The following potential annual CO2 emission savings numbers are broad estimates based on industry averages and are not meant to reflect actual realized savings at your plant. Factors such as CHP system or steam generator efficiency and primary fuel source for energy use systems such as furnaces and boilers make a large difference in the actual amount of CO2 emission saved. These numbers are presented as a broad estimate based on estimated savings and industry averages only.\nNOTE: Actual CO2 savings from fuel/steam energy savings are based on the primary fuel source. The exact breakdown of the individual primary fuels that are used at your plant for process heating, power generation and steam generation is beyond the scope of this tool. The table below shows a range of potential CO2 savings from fuel/steam use in your plant. The low end of the range is based on the use of fuels that contain relatively low amounts of carbon such as natural gas. The high end of the range is based on fuels that have a high amount of carbon such as coal (anthracite, bituminous or lignite). Your actual CO2 emission reduction will depend on the actual primary fuels that are used at your plant."},"Based on the potential energy savings identified above, your plant may be able to reduce emissions of CO2. The following potential annual CO2 emission savings numbers are broad estimates based on industry averages and are not meant to reflect actual realized savings at your plant. Factors such as CHP system or steam generator efficiency and primary fuel source for energy use systems such as furnaces and boilers make a large difference in the actual amount of CO2 emission saved. These numbers are presented as a broad estimate based on estimated savings and industry averages only.\nNOTE: Actual CO2 savings from fuel/steam energy savings are based on the primary fuel source. The exact breakdown of the individual primary fuels that are used at your plant for process heating, power generation and steam generation is beyond the scope of this tool. The table below shows a range of potential CO2 savings from fuel/steam use in your plant. The low end of the range is based on the use of fuels that contain relatively low amounts of carbon such as natural gas. The high end of the range is based on fuels that have a high amount of carbon such as coal (anthracite, bituminous or lignite). Your actual CO2 emission reduction will depend on the actual primary fuels that are used at your plant.","Исходя из приведенного выше значения потенциальной экономии, на вашей установке имеется возможность сокращения выбросов СО2. Приведенные далее цифры потенциального сокращения выбросов СО2 являются грубой оценкой, произведенной на основе средних данных по отрасли и не обязательно соответствуют реализованному на вашей установке сокращению выбросов. Такие факторы как система КВЭТ или к.п.д. системы выработки пара, равно как первичный источник использования энергии в таких системах как печи и котлы способны приводить к значительным расхождениям в фактических цифрах уменьшения выбросов СО2. Эти цифры приводятся исключительно как грубая оценка, произведенная на основе оценочной экономии и средних данных по отрасли.\nПРИМЕЧАНИЕ: Фактические данные по сокращению выбросов СО2 основываются на основном источнике топлива. Данный инструмент не предполагает разбивку по отдельным основным типам топлива, используемым на вашей установке для технологического тепла, выработки пара и электроэнергии. В приведенной ниже таблице указан интервал потенциального сокращения выбросов СО2 в результате использования топлива/пара на вашей установке. Нижняя сторона этого интервала основана на использовании топлива, содержащего относительно небольшие объемы углерода (например, природный газ). Верхняя сторона интервала основана на видах топлива, содержащих большие объемы углерода, как, например, уголь (антрацит, битум или лигнит). Фактическое значение сокращения выбросов СО2 будет зависеть от тех видов топлива, которые фактически используются на вашей установке.","Виходячи з поданих вище значень заощадження енергії, вага установка маж можливість скорочення викидів СО2. Подані далі цифри потенційного скорочення викидів СО2 є приблизною оцінкою, зробленою на основі середніх показників в галузі, і не обов'язково відповідають досягнутому на вашій установці скороченню викидів. Такі чинники як система КВЕТ або к.к.д. системи вироблення пари, так само як первинне джерело використання енергії в таких системах як печі та котли, здатні породжувати істотні розбіжності в фактичних цифрах зменшення викидів СО2. Дані цифри наводяться виключно як приблизна оцінка на основі оцінених заощаджень та середніх даних по галузі. \nПРИМІТКА: Фактичні дані щодо скорочення викидів СО2 базуються на основному джерелі пального. Цей інструмент не передбачає розбивання за окремими основними видами пального, що використовуються на вашій установці для технологічного тепла, вироблення пари та електроенергії. В поданій далі таблиці показаний інтервал потенційних скорочень викидів СО2 з огляду на пальне, що використовується на вашій установці. Нижній бік цього інтервалу спирається на використання типів пального, що містять відносно невеликі обсяги вуглецю, як-от, природний газ. Вищий бік цього інтервалу спирається на види пального, що мають високий вміст вуглецю, як-от, вугілля (Антрацит, бітум або лігніт). Фактичне скороченні викидів СО2 на установці залежатиме від тих основних видів пального, що фактично використовуються на ній."]
[{"$f":"IF(Disclaimer!$C$2=\"English\",B781,IF(Disclaimer!$C$2=\"Russian\",C781,D781))","v":"Potential Annual CO2 from Electricity"},"Potential Annual CO2 from Electricity","Потенциал сокращения выбросов СО2, связанных с электроэнергией","Потенціал скорочення викидів СО2, пов'язаних з електроенергією"]
[{"$f":"IF(Disclaimer!$C$2=\"English\",B782,IF(Disclaimer!$C$2=\"Russian\",C782,D782))","v":"Potential Annual CO2 from Natural gas"},"Potential Annual CO2 from Natural gas","Потенциал сокращения выбросов СО2, связанных с природным газом","Потенціал скорочення викидів СО2, пов'язаних з природним газом"]
[{"$f":"IF(Disclaimer!$C$2=\"English\",B783,IF(Disclaimer!$C$2=\"Russian\",C783,D783))","v":"Potential Annual CO2 from Coal"},"Potential Annual CO2 from Coal","Потенциальные ежегодной CO2 из угля","Потенційні щорічний СО2 від вугілля"]
[{"$f":"IF(Disclaimer!$C$2=\"English\",B784,IF(Disclaimer!$C$2=\"Russian\",C784,D784))","v":"Metric Ton"},"Metric Ton","Метрические тонны","Метричні тонни"]
[{"$f":"IF(Disclaimer!$C$2=\"English\",B785,IF(Disclaimer!$C$2=\"Russian\",C785,D785))","v":"Implemented Energy Efficiency Projects and Potential Opportunities "},"Implemented Energy Efficiency Projects and Potential Opportunities ","Реализованные проекты энергоэффективности и потенциальные возможности ","Реалізовані проекти енергоефективності та потенційні можливості"]
[{"$f":"IF(Disclaimer!$C$2=\"English\",B786,IF(Disclaimer!$C$2=\"Russian\",C786,D786))","v":"Plant's energy management team is actively identifying and implementing energy efficiency projects. The plant has implemented the following energy efficiency projects and initiatives recently."},"Plant's energy management team is actively identifying and implementing energy efficiency projects. The plant has implemented the following energy efficiency projects and initiatives recently.","Энергетическая рабочая группа объекта активно разрабатывает и реализует проекты энергоэффективности. За последнее время на установке были реализованы следующие проекты и инициативы энергоэффективности.","Енергетична робоча група об'єкту активно розробляє та реалізує проекти енергоефективності. За останній час на установці були реалізовані наступні проекти та ініціативи енергоефективності"]
[{"$f":"IF(Disclaimer!$C$2=\"English\",B787,IF(Disclaimer!$C$2=\"Russian\",C787,D787))","v":"Energy Efficiency Projects Identified or Potential Project Opportunities"},"Energy Efficiency Projects Identified or Potential Project Opportunities","Определенные проекты энергоэффективности или потенциальные возможности для таких проектов","Визначені проекти енергоефективності або потенційні можливості для таких проектів"]
[{"$f":"IF(Disclaimer!$C$2=\"English\",B788,IF(Disclaimer!$C$2=\"Russian\",C788,D788))","v":"System Type"},"System Type","Тип системы","Тип системи"]
[{"$f":"IF(Disclaimer!$C$2=\"English\",B789,IF(Disclaimer!$C$2=\"Russian\",C789,D789))","v":"Please provide short decription of Energy efficient project implemented in your plant"},"Please provide short decription of Energy efficient project implemented in your plant","Приведите краткое описание проекта энергоэффективности, реализованного у вас на установке","Наведіть короткий опис проекту енергоефективності, реалізованого у вас на установці"]
[{"$f":"IF(Disclaimer!$C$2=\"English\",B790,IF(Disclaimer!$C$2=\"Russian\",C790,D790))","v":"Name of the Project"},"Name of the Project","Наименование проекта","Найменування проекту"]
[{"$f":"IF(Disclaimer!$C$2=\"English\",B791,IF(Disclaimer!$C$2=\"Russian\",C791,D791))","v":"Description of the project "},"Description of the project ","Описание проекта","Опис проекту"]
[{"$f":"IF(Disclaimer!$C$2=\"English\",B792,IF(Disclaimer!$C$2=\"Russian\",C792,D792))","v":"Based on the scores of system specific scorecards and/or the user selection in the 'Energy Saving Opportunity' section a ranking has been given to each system. This ranking helped us to determine the possible next steps the plant can take to further reduce their energy consumption. "},"Based on the scores of system specific scorecards and/or the user selection in the 'Energy Saving Opportunity' section a ranking has been given to each system. This ranking helped us to determine the possible next steps the plant can take to further reduce their energy consumption. ","На основе баллов карточек по каждой отдельной системе и/или выбора пользователя в разделе \"Возможности экономии энергии\" каждой системе был присвоен определенный рейтинг. С помощью этого рейтинга определяются возможные следующие шаги, которые могут быть предприняты на установке для дальнейшего сокращения энергопотребления. ","На основі балів карток для кожної окремої системи та/або вибору користувача в розділі \"Можливості заощадження енергії\", кожній системі був наданий певний рейтинг. За допомогою цього рейтингу визначаються можливі подальші кроки, які можна здійснити на установці для подальшого скорочення енергоспоживання."]
[{"$f":"IF(Disclaimer!$C$2=\"English\",B793,IF(Disclaimer!$C$2=\"Russian\",C793,D793))","v":"Energy Efficiency Projects Identified or Potential Project Opportunities"},"Energy Efficiency Projects Identified or Potential Project Opportunities","Определенные или потенциальные проекты энергоэффективности","Визначені або потенційні проекти енергоефективності"]
[{"$f":"IF(Disclaimer!$C$2=\"English\",B794,IF(Disclaimer!$C$2=\"Russian\",C794,D794))","v":"Energy Efficiency Projects Identified or Potential Project Opportunities"},"Energy Efficiency Projects Identified or Potential Project Opportunities","Определенные или потенциальные проекты энергоэффективности","Визначені або потенційні проекти енергоефективності"]
[{"$f":"IF(Disclaimer!$C$2=\"English\",B795,IF(Disclaimer!$C$2=\"Russian\",C795,D795))","v":"Site Energy Use\n"},"Site Energy Use\n","Потребление энергии на объекте ","Споживання енергії на об'єкті "]
[{"$f":"IF(Disclaimer!$C$2=\"English\",B796,IF(Disclaimer!$C$2=\"Russian\",C796,D796))","v":"Site Energy Cost\n"},"Site Energy Cost\n","Стоимость энергии на объекте","Вартість енергії на об'єкті"]
[{"$f":"IF(Disclaimer!$C$2=\"English\",B797,IF(Disclaimer!$C$2=\"Russian\",C797,D797))","v":"Site Energy Use ()"},{"$f":"CONCATENATE(\"Site Energy Use\",\" (\",'Energy & Production '!$F$12,\")\")","v":"Site Energy Use ()"},{"$f":"CONCATENATE(\"Site Energy Use\",\" (\",'Energy & Production '!$F$12,\")\")","v":"Site Energy Use ()"},{"$f":"CONCATENATE(\"Site Energy Use\",\" (\",'Energy & Production '!$F$12,\")\")","v":"Site Energy Use ()"}]
[{"$f":"IF(Disclaimer!$C$2=\"English\",B798,IF(Disclaimer!$C$2=\"Russian\",C798,D798))","v":"Site Energy Cost ($)"},{"$f":"CONCATENATE(\"Site Energy Cost\",\" (\",List!G54,\")\")","v":"Site Energy Cost ($)"},{"$f":"CONCATENATE(\"Site Energy Cost\",\" (\",List!G54,\")\")","v":"Site Energy Cost ($)"},{"$f":"CONCATENATE(\"Site Energy Cost\",\" (\",List!G54,\")\")","v":"Site Energy Cost ($)"}]
[{"$f":"IF(Disclaimer!$C$2=\"English\",B799,IF(Disclaimer!$C$2=\"Russian\",C799,D799))","v":"Fig. 1a"},"Fig. 1a","Fig. 1a","Fig. 1a"]
[{"$f":"IF(Disclaimer!$C$2=\"English\",B800,IF(Disclaimer!$C$2=\"Russian\",C800,D800))","v":"Fig. 1b"},"Fig. 1b","\nFig. 1b","\nFig. 1b"]
[{"$f":"IF(Disclaimer!$C$2=\"English\",B801,IF(Disclaimer!$C$2=\"Russian\",C801,D801))","v":"Energy Consumption (/Month)"},{"$f":"CONCATENATE(\"Energy Consumption\",\" (\",'Energy & Production '!$F$12,\"/\",\"Month\",\")\")","v":"Energy Consumption (/Month)"},{"$f":"CONCATENATE(\"Потребление энергии\",\" (\",'Energy & Production '!$F$12,\"/\",\"Month\",\")\")","v":"Потребление энергии (/Month)"},{"$f":"CONCATENATE(\"Споживання енергії\",\" (\",'Energy & Production '!$F$12,\"/\",\"Month\",\")\")","v":"Споживання енергії (/Month)"}]
[{"$f":"IF(Disclaimer!$C$2=\"English\",B802,IF(Disclaimer!$C$2=\"Russian\",C802,D802))","v":"Month\n"},"Month\n","Месяц","місяць"]
[{"$f":"IF(Disclaimer!$C$2=\"English\",B803,IF(Disclaimer!$C$2=\"Russian\",C803,D803))","v":"Production"},"Production","Production","Production"]
[{"$f":"IF(Disclaimer!$C$2=\"English\",B804,IF(Disclaimer!$C$2=\"Russian\",C804,D804))","v":"Energy Use by Fuel Type"},"Energy Use by Fuel Type","Использование энергии по видам топлива","Використання енергії за видами палива"]
[{"$f":"IF(Disclaimer!$C$2=\"English\",B805,IF(Disclaimer!$C$2=\"Russian\",C805,D805))","v":"Fig. 2a"},"Fig. 2a","Fig. 2a","Fig. 2a"]
[{"$f":"IF(Disclaimer!$C$2=\"English\",B806,IF(Disclaimer!$C$2=\"Russian\",C806,D806))","v":"Fig. 2b"},"Fig. 2b","Fig. 2b","Fig. 2b"]
[{"$f":"IF(Disclaimer!$C$2=\"English\",B807,IF(Disclaimer!$C$2=\"Russian\",C807,D807))","v":"Fig. 2c"},"Fig. 2c","Fig. 2c","Fig. 2c"]
[{"$f":"IF(Disclaimer!$C$2=\"English\",B808,IF(Disclaimer!$C$2=\"Russian\",C808,D808))","v":"Fig. 5a"},"Fig. 5a","Fig. 5a","Fig. 5a"]
[{"$f":"IF(Disclaimer!$C$2=\"English\",B809,IF(Disclaimer!$C$2=\"Russian\",C809,D809))","v":"Fig. 5b"},"Fig. 5b","Fig. 5b","Fig. 5b"]
[{"$f":"IF(Disclaimer!$C$2=\"English\",B810,IF(Disclaimer!$C$2=\"Russian\",C810,D810))","v":"Fig. 5c"},"Fig. 5c","Fig. 5c","Fig. 5c"]
[{"$f":"IF(Disclaimer!$C$2=\"English\",B811,IF(Disclaimer!$C$2=\"Russian\",C811,D811))","v":"Fig. 5d"},"Fig. 5d","Fig. 5d","Fig. 5d"]
[{"$f":"IF(Disclaimer!$C$2=\"English\",B812,IF(Disclaimer!$C$2=\"Russian\",C812,D812))","v":"Fig. 6a"},"Fig. 6a","Fig. 6a","Fig. 6a"]
[{"$f":"IF(Disclaimer!$C$2=\"English\",B813,IF(Disclaimer!$C$2=\"Russian\",C813,D813))","v":"Fig. 6b"},"Fig. 6b","Fig. 6b","Fig. 6b"]
[{"$f":"IF(Disclaimer!$C$2=\"English\",B814,IF(Disclaimer!$C$2=\"Russian\",C814,D814))","v":"Fig. 7a"},"Fig. 7a","Fig. 7a","Fig. 7a"]
[{"$f":"IF(Disclaimer!$C$2=\"English\",B815,IF(Disclaimer!$C$2=\"Russian\",C815,D815))","v":"Fig. 7b"},"Fig. 7b","Fig. 7b","Fig. 7b"]
[{"$f":"IF(Disclaimer!$C$2=\"English\",B816,IF(Disclaimer!$C$2=\"Russian\",C816,D816))","v":"Fig. 8a"},"Fig. 8a","Fig. 8a","Fig. 8a"]
[{"$f":"IF(Disclaimer!$C$2=\"English\",B817,IF(Disclaimer!$C$2=\"Russian\",C817,D817))","v":"Fig. 8b"},"Fig. 8b","Fig. 8b","Fig. 8b"]
[{"$f":"IF(Disclaimer!$C$2=\"English\",B818,IF(Disclaimer!$C$2=\"Russian\",C818,D818))","v":"Fig. 9a"},"Fig. 9a","Fig. 9a","Fig. 9a"]
[{"$f":"IF(Disclaimer!$C$2=\"English\",B819,IF(Disclaimer!$C$2=\"Russian\",C819,D819))","v":"Fig. 9b"},"Fig. 9b","Fig. 9b","Fig. 9b"]
[{"$f":"IF(Disclaimer!$C$2=\"English\",B820,IF(Disclaimer!$C$2=\"Russian\",C820,D820))","v":"Fig. 10"},"Fig. 10","Fig. 11","Fig. 12"]
[{"$f":"IF(Disclaimer!$C$2=\"English\",B821,IF(Disclaimer!$C$2=\"Russian\",C821,D821))","v":"Energy Use by System Type"},"Energy Use by System Type","Energy Use by System Type","Energy Use by System Type"]
[{"$f":"IF(Disclaimer!$C$2=\"English\",B822,IF(Disclaimer!$C$2=\"Russian\",C822,D822))","v":"Energy Consumption ()"},{"$f":"CONCATENATE(\"Energy Consumption\",\" (\",'Energy & Production '!$F$12,\")\")","v":"Energy Consumption ()"},{"$f":"CONCATENATE(\"потребление энергии\",\" (\",'Energy & Production '!$F$12,\")\")","v":"потребление энергии ()"},{"$f":"CONCATENATE(\"споживання енергії\",\" (\",'Energy & Production '!$F$12,\")\")","v":"споживання енергії ()"}]
[{"$f":"IF(Disclaimer!$C$2=\"English\",B823,IF(Disclaimer!$C$2=\"Russian\",C823,D823))","v":"Fig. 3a"},"Fig. 3a","Fig. 3a","Fig. 3a"]
[{"$f":"IF(Disclaimer!$C$2=\"English\",B824,IF(Disclaimer!$C$2=\"Russian\",C824,D824))","v":"Potential Cost Saving($)"},{"$f":"CONCATENATE(\"Potential Cost Saving\",\"(\",List!$G$52,\")\")","v":"Potential Cost Saving($)"},{"$f":"CONCATENATE(\"Потенциал экономии затрат\",\"(\",List!$G$52,\")\")","v":"Потенциал экономии затрат($)"},{"$f":"CONCATENATE(\"Потенціал економії витрат\",\"(\",List!$G$52,\")\")","v":"Потенціал економії витрат($)"}]
[{"$f":"IF(Disclaimer!$C$2=\"English\",B825,IF(Disclaimer!$C$2=\"Russian\",C825,D825))","v":"Energy Use by System Type"},"Energy Use by System Type","Использование энергии по типу системы","Використання енергії за типом системи"]
[{"$f":"IF(Disclaimer!$C$2=\"English\",B826,IF(Disclaimer!$C$2=\"Russian\",C826,D826))","v":"Fig . 3b"},"Fig . 3b","Fig . 3b","Fig . 3b"]
[{"$f":"IF(Disclaimer!$C$2=\"English\",B827,IF(Disclaimer!$C$2=\"Russian\",C827,D827))","v":"Energy Consumption and Potential Savings for Each System"},"Energy Consumption and Potential Savings for Each System","Потребление энергии и Потенциальная экономия для каждой системы","Споживання енергії і Потенційна економія для кожної системи"]
[{"$f":"IF(Disclaimer!$C$2=\"English\",B828,IF(Disclaimer!$C$2=\"Russian\",C828,D828))","v":"Source Energy Consumption()"},{"$f":"CONCATENATE(\"Source Energy Consumption\",\"(\",'Energy & Production '!$F$12,\")\")","v":"Source Energy Consumption()"},{"$f":"CONCATENATE(\"\nПотребление энергии Источник\",\"(\",'Energy & Production '!$F$12,\")\")","v":"\nПотребление энергии Источник()"},{"$f":"CONCATENATE(\"\nСпоживання енергії Джерело\",\"(\",'Energy & Production '!$F$12,\")\")","v":"\nСпоживання енергії Джерело()"}]
[{"$f":"IF(Disclaimer!$C$2=\"English\",B829,IF(Disclaimer!$C$2=\"Russian\",C829,D829))","v":"Fig. 4a\n"},"Fig. 4a\n","Fig. 4a \n","Fig. 4a"]
[{"$f":"IF(Disclaimer!$C$2=\"English\",B830,IF(Disclaimer!$C$2=\"Russian\",C830,D830))","v":"Fig. 4b "},"Fig. 4b ","Fig. 4b ","Fig. 4b "]
[{"$f":"IF(Disclaimer!$C$2=\"English\",B831,IF(Disclaimer!$C$2=\"Russian\",C831,D831))","v":"Site Energy Use\n (MJ)"},"Site Energy Use\n (MJ)","Site Energy Use\n (MJ)","Site Energy Use\n (MJ)"]
[{"$f":"IF(Disclaimer!$C$2=\"English\",B832,IF(Disclaimer!$C$2=\"Russian\",C832,D832))","v":"Source Energy Use\n(MJ)"},"Source Energy Use\n(MJ)","Source Energy Use\n(MJ)","Source Energy Use\n(MJ)"]
[{"$f":"IF(Disclaimer!$C$2=\"English\",B833,IF(Disclaimer!$C$2=\"Russian\",C833,D833))","v":"Site Energy Cost\n($)"},"Site Energy Cost\n($)","Site Energy Cost\n($)","Site Energy Cost\n($)"]
[{"$f":"IF(Disclaimer!$C$2=\"English\",B834,IF(Disclaimer!$C$2=\"Russian\",C834,D834))","v":"Cost per System($)"},{"$f":"CONCATENATE(\"Cost per System\",\"(\",List!$G$54,\")\")","v":"Cost per System($)"},{"$f":"CONCATENATE(\"\nСтоимость за системы\",\"(\",List!$G$54,\")\")","v":"\nСтоимость за системы($)"},{"$f":"CONCATENATE(\"\nВартість за системи\",\"(\",List!$G$54,\")\")","v":"\nВартість за системи($)"}]
[{"$f":"IF(Disclaimer!$C$2=\"English\",B835,IF(Disclaimer!$C$2=\"Russian\",C835,D835))","v":"Energy Savings()"},{"$f":"CONCATENATE(\"Energy Savings\",\"(\",'Energy & Production '!$F$12,\")\")","v":"Energy Savings()"},{"$f":"CONCATENATE(\"Экономия энергии\",\"(\",'Energy & Production '!$F$12,\")\")","v":"Экономия энергии()"},{"$f":"CONCATENATE(\"економія енергії\",\"(\",'Energy & Production '!$F$12,\")\")","v":"економія енергії()"}]
[{"$f":"IF(Disclaimer!$C$2=\"English\",B836,IF(Disclaimer!$C$2=\"Russian\",C836,D836))","v":"Electricity Consumption()"},{"$f":"CONCATENATE(\"Electricity Consumption\",\"(\",'Energy & Production '!$B$10,\")\")","v":"Electricity Consumption()"},{"$f":"CONCATENATE(\"Потребление электроэнергии\",\"(\",'Energy & Production '!$B$10,\")\")","v":"Потребление электроэнергии()"},{"$f":"CONCATENATE(\"споживання електроенергії\",\"(\",'Energy & Production '!$B$10,\")\")","v":"споживання електроенергії()"}]
[{"$f":"IF(Disclaimer!$C$2=\"English\",B837,IF(Disclaimer!$C$2=\"Russian\",C837,D837))","v":"Units of Measurement:"},"Units of Measurement:","Меры измерения:","одиниці виміру:"]
[{"$f":"IF(Disclaimer!$C$2=\"English\",B838,IF(Disclaimer!$C$2=\"Russian\",C838,D838))","v":"Unit for Electricity"},"Unit for Electricity","Установка для электричества","Установка для електрики"]
[{"$f":"IF(Disclaimer!$C$2=\"English\",B839,IF(Disclaimer!$C$2=\"Russian\",C839,D839))","v":"Unit for Natural Gas"},"Unit for Natural Gas","Установка для природного газа","Установка для природного газу"]
[{"$f":"IF(Disclaimer!$C$2=\"English\",B840,IF(Disclaimer!$C$2=\"Russian\",C840,D840))","v":"Unit for Steam"},"Unit for Steam","Аппарат для пара","Апарат для пара"]
[{"$f":"IF(Disclaimer!$C$2=\"English\",B841,IF(Disclaimer!$C$2=\"Russian\",C841,D841))","v":"Other Fuel"},"Other Fuel","Другое Топливо","Інша Паливо"]
[{"$f":"IF(Disclaimer!$C$2=\"English\",B842,IF(Disclaimer!$C$2=\"Russian\",C842,D842))","v":"Unit for Other fuel"},"Unit for Other fuel","Аппарат для другого вида топлива","Апарат для іншого виду палива"]
[{"$f":"IF(Disclaimer!$C$2=\"English\",B843,IF(Disclaimer!$C$2=\"Russian\",C843,D843))","v":"Output Energy Metric"},"Output Energy Metric","Энергия выхода Метрика","Енергія виходу Метрика"]
[{"$f":"IF(Disclaimer!$C$2=\"English\",B844,IF(Disclaimer!$C$2=\"Russian\",C844,D844))","v":"Electricity"},"Electricity","Electricity","Electricity"]
[{"$f":"IF(Disclaimer!$C$2=\"English\",B845,IF(Disclaimer!$C$2=\"Russian\",C845,D845))","v":"Steam"},"Steam","Steam","Steam"]
[{"$f":"IF(Disclaimer!$C$2=\"English\",B846,IF(Disclaimer!$C$2=\"Russian\",C846,D846))","v":"Natural Gas"},"Natural Gas","Натуральный газ","Природний газ"]
[{"$f":"IF(Disclaimer!$C$2=\"English\",B847,IF(Disclaimer!$C$2=\"Russian\",C847,D847))","v":"Propane"},"Propane","Propane","Propane"]
[{"$f":"IF(Disclaimer!$C$2=\"English\",B848,IF(Disclaimer!$C$2=\"Russian\",C848,D848))","v":"Butane"},"Butane","Butane","Butane"]
[{"$f":"IF(Disclaimer!$C$2=\"English\",B849,IF(Disclaimer!$C$2=\"Russian\",C849,D849))","v":"LNG"},"LNG","LNG","LNG"]
[{"$f":"IF(Disclaimer!$C$2=\"English\",B850,IF(Disclaimer!$C$2=\"Russian\",C850,D850))","v":"Fuel_Oil_1"},"Fuel_Oil_1","Fuel_Oil_1","Fuel_Oil_1"]
[{"$f":"IF(Disclaimer!$C$2=\"English\",B851,IF(Disclaimer!$C$2=\"Russian\",C851,D851))","v":"Fuel_Oil_2"},"Fuel_Oil_2","Fuel_Oil_2","Fuel_Oil_2"]
[{"$f":"IF(Disclaimer!$C$2=\"English\",B852,IF(Disclaimer!$C$2=\"Russian\",C852,D852))","v":"Fuel_Oil_4"},"Fuel_Oil_4","Fuel_Oil_4","Fuel_Oil_4"]
[{"$f":"IF(Disclaimer!$C$2=\"English\",B853,IF(Disclaimer!$C$2=\"Russian\",C853,D853))","v":"Fuel_Oil_5"},"Fuel_Oil_5","Fuel_Oil_5","Fuel_Oil_5"]
[{"$f":"IF(Disclaimer!$C$2=\"English\",B854,IF(Disclaimer!$C$2=\"Russian\",C854,D854))","v":"Fuel_Oil_6_low_sulfer"},"Fuel_Oil_6_low_sulfer","Fuel_Oil_6_low_sulfer","Fuel_Oil_6_low_sulfer"]
[{"$f":"IF(Disclaimer!$C$2=\"English\",B855,IF(Disclaimer!$C$2=\"Russian\",C855,D855))","v":"Fuel_Oil_6_high_sulfer"},"Fuel_Oil_6_high_sulfer","Fuel_Oil_6_high_sulfer","Fuel_Oil_6_high_sulfer"]
[{"$f":"IF(Disclaimer!$C$2=\"English\",B856,IF(Disclaimer!$C$2=\"Russian\",C856,D856))","v":"Gasoline"},"Gasoline","Gasoline","Gasoline"]
[{"$f":"IF(Disclaimer!$C$2=\"English\",B857,IF(Disclaimer!$C$2=\"Russian\",C857,D857))","v":"Kerosene"},"Kerosene","Kerosene","Kerosene"]
[{"$f":"IF(Disclaimer!$C$2=\"English\",B858,IF(Disclaimer!$C$2=\"Russian\",C858,D858))","v":"Coal"},"Coal","Coal","Coal"]
[{"$f":"IF(Disclaimer!$C$2=\"English\",B859,IF(Disclaimer!$C$2=\"Russian\",C859,D859))","v":"Coke"},"Coke","Coke","Coke"]
[{"$f":"IF(Disclaimer!$C$2=\"English\",B860,IF(Disclaimer!$C$2=\"Russian\",C860,D860))","v":"Wood"},"Wood","Wood","Wood"]
[{"$f":"IF(Disclaimer!$C$2=\"English\",B861,IF(Disclaimer!$C$2=\"Russian\",C861,D861))","v":"Grand Total "},"Grand Total ","Общий итог","Загальний підсумок"]
[{"$f":"IF(Disclaimer!$C$2=\"English\",B862,IF(Disclaimer!$C$2=\"Russian\",C862,D862))","v":"MJ"},"MJ",null,"МДж"]
[{"$f":"IF(Disclaimer!$C$2=\"English\",B863,IF(Disclaimer!$C$2=\"Russian\",C863,D863))","v":"Carbon Dioxide Emissions (Metric ton)"},"Carbon Dioxide Emissions (Metric ton)","Выбросы двуокиси углерода (метрическая тонна)","Викиди діоксиду вуглецю (метрична тонна)"]
[{"$f":"IF(Disclaimer!$C$2=\"English\",B864,IF(Disclaimer!$C$2=\"Russian\",C864,D864))","v":"Energy Consumption vs Production"},"Energy Consumption vs Production","Энергоемкость против Производство","енергія інтенсивність проти Виробництво"]
[{"$f":"IF(Disclaimer!$C$2=\"English\",B865,IF(Disclaimer!$C$2=\"Russian\",C865,D865))","v":"Energy Consumption"},"Energy Consumption",{"$f":"CONCATENATE(\"Энергоемкость\",\"(\",EI_Metric,\"/Производство)\")","v":"Энергоемкость(/Производство)"},{"$f":"CONCATENATE(\"енергія інтенсивність\",\"(\",EI_Metric,\"/Виробництво)\")","v":"енергія інтенсивність(/Виробництво)"}]
[{"$f":"IF(Disclaimer!$C$2=\"English\",B866,IF(Disclaimer!$C$2=\"Russian\",C866,D866))","v":"Production"},"Production","Производство","Виробництво"]
[{"$f":"IF(Disclaimer!$C$2=\"English\",B867,IF(Disclaimer!$C$2=\"Russian\",C867,D867))","v":"Electricity"},{"$f":"'NAICS Data-Base'!B371","v":"Electricity"},{"$f":"'NAICS Data-Base'!C371","v":"Electricity"},{"$f":"'NAICS Data-Base'!D371","v":"Electricity"}]
[{"$f":"IF(Disclaimer!$C$2=\"English\",B868,IF(Disclaimer!$C$2=\"Russian\",C868,D868))","v":"Natural Gas"},{"$f":"'NAICS Data-Base'!B372","v":"Natural Gas"},{"$f":"'NAICS Data-Base'!C372","v":"Натуральный газ"},{"$f":"'NAICS Data-Base'!D372","v":"Натуральный газ"}]
[{"$f":"IF(Disclaimer!$C$2=\"English\",B869,IF(Disclaimer!$C$2=\"Russian\",C869,D869))","v":"Steam"},"Steam","Steam","Steam"]
[{"$f":"IFERROR(IF(Disclaimer!$C$2=\"English\",B870,IF(Disclaimer!$C$2=\"Russian\",C870,D870)),\"No Other Fuel\")","v":0},{"$f":"'NAICS Data-Base'!A374","v":0},{"$f":"'NAICS Data-Base'!C374","v":""},{"$f":"'NAICS Data-Base'!D374","v":""}]
[{"$f":"IF(Disclaimer!$C$2=\"English\",B871,IF(Disclaimer!$C$2=\"Russian\",C871,D871))","v":"Energy consumption and the potential energy saving for each fuel source"},"Energy consumption and the potential energy saving for each fuel source","Потребление энергии и потенциальной энергии, экономия для каждого источника топлива","Споживання енергії і потенціалу енергозбереження для кожного джерела палива"]
[{"$f":"IF(Disclaimer!$C$2=\"English\",B872,IF(Disclaimer!$C$2=\"Russian\",C872,D872))","v":"Usage"},"Usage","Использование","Використання"]
[{"$f":"IF(Disclaimer!$C$2=\"English\",B873,IF(Disclaimer!$C$2=\"Russian\",C873,D873))","v":"Potential Savings"},"Potential Savings","Потенциальная экономия","Потенційні заощадження"]
[{"$f":"IF(Disclaimer!$C$2=\"English\",B874,IF(Disclaimer!$C$2=\"Russian\",C874,D874))","v":"And"},"And","И","І"]
[]
["Chart Titles"]
[{"$f":"CONCATENATE('Translation '!$A$867,\" - \", 'Translation '!$A$872,\" \", 'Translation '!$A$874,\" \", 'Translation '!$A$873)","v":"Electricity - Usage And Potential Savings"},{"$f":"CONCATENATE('Translation '!$A$868,\" - \", 'Translation '!$A$872,\" \", 'Translation '!$A$874,\" \", 'Translation '!$A$873)","v":"Natural Gas - Usage And Potential Savings"},{"$f":"CONCATENATE('Translation '!$A$869,\" - \", 'Translation '!$A$872,\" \", 'Translation '!$A$874,\" \", 'Translation '!$A$873)","v":"Steam - Usage And Potential Savings"},{"$f":"CONCATENATE('Translation '!$A$870,\" - \", 'Translation '!$A$872,\" \", 'Translation '!$A$874,\" \", 'Translation '!$A$873)","v":"0 - Usage And Potential Savings"}]
[{"$f":"CONCATENATE('Translation '!$A$867,\" - \", 'Translation '!$A$872)","v":"Electricity - Usage"},{"$f":"CONCATENATE('Translation '!$A$868,\" - \", 'Translation '!$A$872)","v":"Natural Gas - Usage"},{"$f":"CONCATENATE('Translation '!$A$869,\" - \", 'Translation '!$A$872)","v":"Steam - Usage"},{"$f":"CONCATENATE('Translation '!$A$870,\" - \", 'Translation '!$A$872)","v":"0 - Usage"}]
[{"$f":"IF(Disclaimer!$C$2=\"English\",B879,IF(Disclaimer!$C$2=\"Russian\",C879,D879))","v":"Put together an energy management plan"},"Put together an energy management plan"]
[{"$f":"IF(Disclaimer!$C$2=\"English\",B880,IF(Disclaimer!$C$2=\"Russian\",C880,D880))","v":"Form a cross functional energy team"},"Form a cross functional energy team"]
[{"$f":"IF(Disclaimer!$C$2=\"English\",B881,IF(Disclaimer!$C$2=\"Russian\",C881,D881))","v":"Construct a formal methodolgy to communicate energy management practices to the emplyees"},"Construct a formal methodolgy to communicate energy management practices to the emplyees"]
[{"$f":"IF(Disclaimer!$C$2=\"English\",B882,IF(Disclaimer!$C$2=\"Russian\",C882,D882))","v":"Make use of life cycle cost analysis to evaluate the energy efficiecy projects"},"Make use of life cycle cost analysis to evaluate the energy efficiecy projects"]
[{"$f":"IF(Disclaimer!$C$2=\"English\",B883,IF(Disclaimer!$C$2=\"Russian\",C883,D883))","v":"Establish a suitable payback period for energy efficiency projects"},"Establish a suitable payback period for energy efficiency projects"]