{"text_format":"1","workbook":"xlsx","n_sheets":11,"sheets":["Course Costs","dropdown","Data Output","Org Codes","Reference","I. Organization Information","II. Mission Critical Need","III. Other Needs ","IV. Development Programs","V. Competency","VI. PMCDP-ACMP"],"not_rendered":{"charts":0,"images":0,"macros":1,"external_links":0,"defined_names":35,"comments":0,"pivot_tables":0},"unopened":[],"bounds":{"document_bytes":16777216,"sheet_cells":100000,"rows_first":2000,"rows_last":500,"rows_between":2000,"halvings":0,"cell_chars":16384,"cell_head_chars":4096},"cells_cut":0,"cells_raw":0,"read":"whole","date_system":"1900"}

{"sheet":"Course Costs","index":0,"n_rows":1621,"n_cols":2,"rows_kept":1621,"cut":false,"hidden":true,"merged":[]}
["Course"]
["ABA Environmental Law",1365.016212]
["ABA Water Law Class (MO)",541.67310000000009]
["Access 2007 Level I",107.25127380000001]
["Access 2007 Level II",150.5851218]
["Accident Investigator Training",2275.02702]
["Accidents, Incidents, Abnormal Environments and Test Experiences",0]
["Accountability for Federal Grants (Online)",835.46190000000001]
["Accountability for Federal Grants: Planning, Measuring and Reporting",807.63459209999996]
["Accounting for Business Operations In Government",784.45690000000002]
["Accounting I",449.31783645000002]
["Accounting II",449.31783645000002]
["Achieving Results",1706.2702650000001]
["ACQ 101 Fundamentals of Systems  Acquisition Management",0]
["ACQ 201B Intermediate Systems Acquisition",0]
{"$rows_left_out":1607}
{"sheet":"dropdown","index":1,"n_rows":284,"n_cols":19,"rows_kept":284,"cut":false,"hidden":true,"merged":[[8,15,9,15]]}
["updated 3/20/11",null,null,"updated 3/4/10",null,"updated 2/23/10",null,"updated 3/20/11",null,null,null,null,null,"updated 3/20/11",null,null,null,"Course","Cost"]
[null,null,null,"Professional Skills Courses",null,"TQP FAQS",null,"PMCDP",null,"ACMP",null,"Competencies (Comps)",null,"Section",null,"Priority",null,"Accountability for Federal Grants","$‎749.00"]
[null,"Introduction to Analytical Risk Management",null,null,null,null,null,null,null,null,null,null,null,null,null,null,null,"Accountability for Federal Grants (Online)","$‎819.00"]
["CIP100D","DOE/NNSA Asset Overview",null,"Acquisition Management for Technical Personnel",null,"Non-TQP participant",null,"Acquisition Managment for Technical Personnel",null,"Accountability for Federal Grants: Planning, Measuring and Reporting",null,"Accountability",null,"Section II. Mission Critical Training",null,1,null,"Accounting for Business Operations In Government","$‎769.00"]
["CIP101DW","Vehicle Bomb Search Methods",null,"Advanced Business Solutions for Contracting",null,"Aviation Manager",null,"Advanced Concepts in Project Management",null,"Advanced Cost Principles",null,"Acquisition Management",null,"Section III. Development Programs",null,2,null,"Acquisition I","$‎1,395.00"]
["CIP110DW","Weapons of Mass Destruction (WMD): Training",null,"Advanced Contract Administration",null,"Aviation Safety Officer",null,"Advanced Risk Management",null,"Advanced Property Management Seminar",null,"Budget Management",null,"Section IV. Competency Areas",null,3,null,"Acquisition of Commercial Items","$‎699.00"]
["CIP300DC","Weapons of Mass Destruction (WMD): Training Exercises",null,"Advanced Contracting for Mission Support",null,"Chemical Processing",null,"Capital Planning for DOE O 413.B Capital Asset Projects",null,"Appropriation Law for Financial Assistance",null,"Business Process Man/ Reengineering",null,"Section V. DOE Training",null,4,null,"Activity-Based Cost Management: Managing Costs And Performance","$‎769.00"]
["CIP400DC","Continuity of Operations Awareness",null,"Breaking the Code:  Understanding Project Management",null,"Civil/Structural Engineering",null,"Contract Officer Representative",null,"Audit of Federal Grants and Cooperative Agreements",null,"Computer Literacy",null,"Section VI. Other Needs Areas",null,"Training Priority",null,"Administration of Contractor-Held Property","$‎1,029.00"]
["COO101DW","Consequence Assessment Application",null,"Changing Dimensions in DOE",null,"Construction Management",null,"Cost & Schedule Estimation and Analysis",null,"CLC 003 Sealed Bidding",null,"Conflict Management",null,null,null,"Priority 1 - Training required by Federal, State, or Local law",null,"Administration of Cost-Reimbursement Contracts","$‎1,049.00"]
["ECA110","Consequence Based Emergency Decision Making",null,"Cost Principles Refresher",null,"Criticality Safety",null,"Effective Program and Project Communication",null,"CLC 004 Market Research",null,"Continual Learning",null,null,null,null,null,"Advanced COR/COTR Workshop","$‎1,049.00"]
["ECA201","Categorization and Classification Overview",null,"CSRS Retirement Preparation Seminar",null,"Deactivation and Decommissioning",null,"Environmental Laws and Regulations",null,"CLC 009 Service-Disabled Veteran-Owned Small Business Program",null,"Creativity and Innovation",null,null,null,"Priority 2 - Training required by Departmental Directives or other Government regulations or requirements",null,"Advanced Cost Principles","$‎589.00"]
["ECC101DW","Integrating Emergencies into the Occurrence Reporting System",null,"Diversity Awareness Training",null,"Electrical Systems and Safety Oversight",null,"Executive Communications",null,"CLC 015 Commercial Acquisitions",null,"Decisiveness",null,null,null,"Priority 3 - Training required by position-, organization-, or mission- specific requirements",null,"Advanced Federal Contract Law","$‎1,049.00"]
["ECC120D","Emergency Facilities and Equipment Overview",null,"DOE Complex Overview",null,"Emergency Management",null,"Facilitating Conflict Resolution",null,"CLC 020 Commercial Item Determination",null,"Desktop Software Applications",null,null,null,"Priority 4 - Training desired for personal growth and professional enhancement",null,"Advanced Leadership Skills and Techniques","$‎979.00"]
["EFE101DW","Introduction to DOE Emergency Management System",null,"DOE Program Planning",null,"Environmental Compliance",null,"Federal Budgeting Process in DOE",null,"CLC 022 Profit Policy Revisions",null,"Developing Others",null,null,null,null,null,"Advanced Simplified Acquisition Procedures","$‎1,049.00"]
["EMP170DW","Emergency Medical Support Introduction",null,"Facilities Information Management Systems",null,"Environmental Restoration",null,"Labor Management Relations",null,"CLC 023 Commercial Item Determination: Executive Overview",null,"Emotional Intelligence",null,null,null,null,null,"Agile Project Management for the Federal Environment","$‎1,439.00"]
{"$rows_left_out":270}
{"sheet":"Data Output","index":2,"n_rows":200,"n_cols":7,"rows_kept":200,"cut":false,"hidden":true,"merged":[[199,3,199,4],[199,5,199,6]]}
["Header","Job Title/Competency Name","Courses","# Empl","Course Cost","Total Cost","Priority"]
[{"$f":"'II. Mission Critical Need'!$B$2","v":"Section II. Mission Critical Training"},{"$f":"'II. Mission Critical Need'!B5","v":0},{"$f":"'II. Mission Critical Need'!C5","v":0},{"$f":"'II. Mission Critical Need'!D5","v":0},{"$f":"'II. Mission Critical Need'!E5","v":0},{"$f":"PRODUCT(D2:E2)","v":0},{"$f":"'II. Mission Critical Need'!G5","v":0}]
[{"$f":"'II. Mission Critical Need'!$B$2","v":"Section II. Mission Critical Training"},{"$f":"'II. Mission Critical Need'!B6","v":0},{"$f":"'II. Mission Critical Need'!C6","v":0},{"$f":"'II. Mission Critical Need'!D6","v":0},{"$f":"'II. Mission Critical Need'!E6","v":0},{"$f":"PRODUCT(D3:E3)","v":0},{"$f":"'II. Mission Critical Need'!G6","v":0}]
[{"$f":"'II. Mission Critical Need'!$B$2","v":"Section II. Mission Critical Training"},{"$f":"'II. Mission Critical Need'!B7","v":0},{"$f":"'II. Mission Critical Need'!C7","v":0},{"$f":"'II. Mission Critical Need'!D7","v":0},{"$f":"'II. Mission Critical Need'!E7","v":0},{"$f":"PRODUCT(D4:E4)","v":0},{"$f":"'II. Mission Critical Need'!G7","v":0}]
[{"$f":"'II. Mission Critical Need'!$B$2","v":"Section II. Mission Critical Training"},{"$f":"'II. Mission Critical Need'!B8","v":0},{"$f":"'II. Mission Critical Need'!C8","v":0},{"$f":"'II. Mission Critical Need'!D8","v":0},{"$f":"'II. Mission Critical Need'!E8","v":0},{"$f":"PRODUCT(D5:E5)","v":0},{"$f":"'II. Mission Critical Need'!G8","v":0}]
[{"$f":"'II. Mission Critical Need'!$B$2","v":"Section II. Mission Critical Training"},{"$f":"'II. Mission Critical Need'!B9","v":0},{"$f":"'II. Mission Critical Need'!C9","v":0},{"$f":"'II. Mission Critical Need'!D9","v":0},{"$f":"'II. Mission Critical Need'!E9","v":0},0,{"$f":"'II. Mission Critical Need'!G9","v":0}]
[{"$f":"'II. Mission Critical Need'!$B$2","v":"Section II. Mission Critical Training"},{"$f":"'II. Mission Critical Need'!B10","v":0},{"$f":"'II. Mission Critical Need'!C10","v":0},{"$f":"'II. Mission Critical Need'!D10","v":0},{"$f":"'II. Mission Critical Need'!E10","v":0},0,{"$f":"'II. Mission Critical Need'!G10","v":0}]
[{"$f":"'II. Mission Critical Need'!$B$2","v":"Section II. Mission Critical Training"},{"$f":"'II. Mission Critical Need'!B11","v":0},{"$f":"'II. Mission Critical Need'!C11","v":0},{"$f":"'II. Mission Critical Need'!D11","v":0},{"$f":"'II. Mission Critical Need'!E11","v":0},0,{"$f":"'II. Mission Critical Need'!G11","v":0}]
[{"$f":"'II. Mission Critical Need'!$B$2","v":"Section II. Mission Critical Training"},{"$f":"'II. Mission Critical Need'!B12","v":0},{"$f":"'II. Mission Critical Need'!C12","v":0},{"$f":"'II. Mission Critical Need'!D12","v":0},{"$f":"'II. Mission Critical Need'!E12","v":0},0,{"$f":"'II. Mission Critical Need'!G12","v":0}]
[{"$f":"'II. Mission Critical Need'!$B$2","v":"Section II. Mission Critical Training"},{"$f":"'II. Mission Critical Need'!B13","v":0},{"$f":"'II. Mission Critical Need'!C13","v":0},{"$f":"'II. Mission Critical Need'!D13","v":0},{"$f":"'II. Mission Critical Need'!E13","v":0},0,{"$f":"'II. Mission Critical Need'!G13","v":0}]
[{"$f":"'II. Mission Critical Need'!$B$2","v":"Section II. Mission Critical Training"},{"$f":"'II. Mission Critical Need'!B14","v":0},{"$f":"'II. Mission Critical Need'!C14","v":0},{"$f":"'II. Mission Critical Need'!D14","v":0},{"$f":"'II. Mission Critical Need'!E14","v":0},0,{"$f":"'II. Mission Critical Need'!G14","v":0}]
[{"$f":"'II. Mission Critical Need'!$B$2","v":"Section II. Mission Critical Training"},{"$f":"'II. Mission Critical Need'!B15","v":0},{"$f":"'II. Mission Critical Need'!C15","v":0},{"$f":"'II. Mission Critical Need'!D15","v":0},{"$f":"'II. Mission Critical Need'!E15","v":0},0,{"$f":"'II. Mission Critical Need'!G15","v":0}]
[{"$f":"'II. Mission Critical Need'!$B$2","v":"Section II. Mission Critical Training"},{"$f":"'II. Mission Critical Need'!B16","v":0},{"$f":"'II. Mission Critical Need'!C16","v":0},{"$f":"'II. Mission Critical Need'!D16","v":0},{"$f":"'II. Mission Critical Need'!E16","v":0},0,{"$f":"'II. Mission Critical Need'!G16","v":0}]
[{"$f":"'II. Mission Critical Need'!$B$2","v":"Section II. Mission Critical Training"},{"$f":"'II. Mission Critical Need'!B17","v":0},{"$f":"'II. Mission Critical Need'!C17","v":0},{"$f":"'II. Mission Critical Need'!D17","v":0},{"$f":"'II. Mission Critical Need'!E17","v":0},0,{"$f":"'II. Mission Critical Need'!G17","v":0}]
[{"$f":"'II. Mission Critical Need'!$B$2","v":"Section II. Mission Critical Training"},{"$f":"'II. Mission Critical Need'!B18","v":0},{"$f":"'II. Mission Critical Need'!C18","v":0},{"$f":"'II. Mission Critical Need'!D18","v":0},{"$f":"'II. Mission Critical Need'!E18","v":0},0,{"$f":"'II. Mission Critical Need'!G18","v":0}]
{"$rows_left_out":186}
{"sheet":"Org Codes","index":3,"n_rows":1587,"n_cols":2,"rows_kept":1587,"cut":false,"hidden":true,"merged":[[0,3,0,5]]}
["ORG_8TH_TIER_CODE","ORG_8TH_TIER_TITLE"]
["0100000000","OFFICE OF THE SECRETARY OF ENERGY"]
["0101000000","OFFICE OF THE SECRETARY OF ENERGY"]
["0102000000","OFFICE OF THE DEPUTY SECRETARY"]
["0103000000","OFFICE OF THE UNDER SECRETARY"]
["0104000000","IMMEDIATE OFFICE OF THE UNDER SECRETARY FOR SCIENCE"]
["0301000000","OFFICE OF THE GENERAL COUNSEL"]
["0302000000","DEPUTY  GENERAL COUNSEL FOR ENVIRONMENT AND COMPLIANCE"]
["0302600000","ASSISTANT GENERAL COUNSEL FOR INTERNATIONAL & NATIONAL SECURITY PRGMS"]
["0302800000","ASSISTANT GENERAL COUNSEL FOR ENVIRONMENT"]
["0302900000","OFFICE OF NEPA POLICY AND COMPLIANCE"]
["0302B00000","ASSISTANT GENERAL COUNSEL FOR GENERAL LAW"]
["0305000000","DEPUTY GENERAL COUNSEL FOR TRANSACTIONS, TECHNOLOGY & CONTRACTOR HR"]
["0305100000","ASSISTANT GENERAL COUNSEL FOR PROCUREMENT AND FINANCIAL ASSISTANCE"]
["0305200000","ASSISTANT GC FOR TECHNOLOGY TRANSFER & INTELLECTUAL PROPERTY"]
{"$rows_left_out":1573}
{"sheet":"Reference","index":4,"n_rows":24,"n_cols":3,"rows_kept":24,"cut":false,"hidden":false,"merged":[[5,1,5,3],[1,1,1,3],[14,1,14,3],[15,1,15,3],[2,1,2,3],[3,1,3,3],[6,2,6,3],[7,2,7,3],[8,2,8,3],[16,1,16,3],[9,2,9,3],[23,2,23,3],[19,2,19,3],[18,2,18,3],[20,2,20,3],[21,2,21,3],[19,1,20,1],[22,2,22,3],[10,2,10,3],[11,2,11,3]]}
[]
[null,"Contents"]
[null,"1. Glossary of Terms"]
[null,"2. Training Priority "]
[]
[null,"1. Glossary of Terms"]
[null,"Mission Critical Need","A critical training need of an employee to support the mission of the organization."]
[null,"Other Needs","Training not specified as \"Mission Critical\"; however, it is important to the mission of the organization or employee development."]
[null,"Competency","The measurable patterns of knowledge, skills, abilities, behaviors, and other characteristics that an individual needs to successfully perform work roles or occupational functions successfully."]
[null,"ACMP","DOE certification program for employees who are in the acquisition field.\n"]
[null,"PMCDP","DOE certification program for employees who are assigned as a Federal Project Director."]
[null,"Professional Skills","Courses that have been identified to support the organizations professional skills needs."]
[]
[null,"2. Training Priority"]
[null,"This table defines the Training Priority scale (1-4) that is used in the Assessment Tool. "]
{"$rows_left_out":10}
{"sheet":"I. Organization Information","index":5,"n_rows":8,"n_cols":3,"rows_kept":8,"cut":false,"hidden":false,"merged":[[1,1,2,2]]}
[]
[null,"Section I. Organization Information"]
[]
[null,"Ten Digit Organization Code"]
[null,"Organization Name",{"$f":"IF(ISNA(VLOOKUP(C4,'Org Codes'!$A$2:$B$3000,2,FALSE)),0,VLOOKUP(C4,'Org Codes'!$A$2:$B$3000,2,FALSE))","v":0}]
[null,"Training Point-of-Contact"]
[null,"Phone Number"]
[null,"Email"]

{"sheet":"II. Mission Critical Need","index":6,"n_rows":81,"n_cols":8,"rows_kept":81,"cut":false,"hidden":false,"merged":[[2,7,8,8],[1,3,1,6],[2,1,3,1]]}
[]
[null,"Section II. Mission Critical Training",null,"Please avoid changing the format of rows and columns"]
[null,"Job Title (Optional)","Course Identified -- Use Drop Down List (Click on Cell to Activate) -or- TYPE IN FULL COURSE NAME - NO ABBREVIATIONS\n*If a course name is typed in, a course cost is needed*                                                                                                                                                                                                    ","# Employees ","Course \nCost ","Total Cost","Priority\n1 -2 - 3 - 4","Scroll Down for additional space "]
[null,null,"Grand Totals:",{"$f":"SUM(D5:D81)","v":0},"N/A",{"$f":"SUM(F5:F81)","v":0},"N/A"]
[null,null,null,null,{"$f":"IF(ISNA(VLOOKUP(C5,'Course Costs'!A2:B1621,2,FALSE)),0, VLOOKUP(C5,'Course Costs'!A2:B1621,2,FALSE))","v":0},{"$f":"PRODUCT(D5:E5)","v":0}]
[null,null,null,null,{"$f":"IF(ISNA(VLOOKUP(C6,'Course Costs'!A2:B1621,2,FALSE)),0, VLOOKUP(C6,'Course Costs'!A2:B1621,2,FALSE))","v":0},{"$f":"PRODUCT(D6:E6)","v":0}]
[null,null,null,null,{"$f":"IF(ISNA(VLOOKUP(C7,'Course Costs'!A2:B1621,2,FALSE)),0, VLOOKUP(C7,'Course Costs'!A2:B1621,2,FALSE))","v":0},0]
[null,null,null,null,{"$f":"IF(ISNA(VLOOKUP(C8,'Course Costs'!A2:B1621,2,FALSE)),0, VLOOKUP(C8,'Course Costs'!A2:B1621,2,FALSE))","v":0},0]
[null,null,null,null,{"$f":"IF(ISNA(VLOOKUP(C9,'Course Costs'!A2:B1621,2,FALSE)),0, VLOOKUP(C9,'Course Costs'!A2:B1621,2,FALSE))","v":0},0]
[null,null,null,null,{"$f":"IF(ISNA(VLOOKUP(C10,'Course Costs'!A2:B1621,2,FALSE)),0, VLOOKUP(C10,'Course Costs'!A2:B1621,2,FALSE))","v":0},{"$f":"PRODUCT(D10:E10)","v":0}]
[null,null,null,null,{"$f":"IF(ISNA(VLOOKUP(C11,'Course Costs'!A2:B1621,2,FALSE)),0, VLOOKUP(C11,'Course Costs'!A2:B1621,2,FALSE))","v":0},0]
[null,null,null,null,{"$f":"IF(ISNA(VLOOKUP(C12,'Course Costs'!A2:B1621,2,FALSE)),0, VLOOKUP(C12,'Course Costs'!A2:B1621,2,FALSE))","v":0},0]
[null,null,null,null,{"$f":"IF(ISNA(VLOOKUP(C13,'Course Costs'!A2:B1621,2,FALSE)),0, VLOOKUP(C13,'Course Costs'!A2:B1621,2,FALSE))","v":0},0]
[null,null,null,null,{"$f":"IF(ISNA(VLOOKUP(C14,'Course Costs'!A2:B1621,2,FALSE)),0, VLOOKUP(C14,'Course Costs'!A2:B1621,2,FALSE))","v":0},0]
[null,null,null,null,{"$f":"IF(ISNA(VLOOKUP(C15,'Course Costs'!A2:B1621,2,FALSE)),0, VLOOKUP(C15,'Course Costs'!A2:B1621,2,FALSE))","v":0},0]
{"$rows_left_out":67}
{"sheet":"III. Other Needs ","index":7,"n_rows":81,"n_cols":8,"rows_kept":81,"cut":false,"hidden":false,"merged":[[2,7,8,8],[1,3,1,6],[2,1,3,1]]}
[]
[null,"Section III. Other Needs Training - Non Mission Critical",null,"Please avoid changing the format of rows and columns"]
[null,"Job Title (Optional)","Course Identified -- TYPE IN FULL COURSE NAME - NO ABBREVIATIONS                                                                                                                                                                                                    ","# Employees ","Course \nCost ","Total Cost","Priority\n1 -2 - 3 - 4","Scroll Down for additional space "]
[null,null,"Grand Totals:",{"$f":"SUM(D5:D81)","v":0},"N/A",{"$f":"SUM(F5:F81)","v":0},"N/A"]
[null,null,null,null,null,{"$f":"PRODUCT(D5:E5)","v":0}]
[null,null,null,null,null,{"$f":"PRODUCT(D6:E6)","v":0}]
[null,null,null,null,null,{"$f":"PRODUCT(D7:E7)","v":0}]
[null,null,null,null,null,0]
[null,null,null,null,null,0]
[null,null,null,null,null,0]
[null,null,null,null,null,0]
[null,null,null,null,null,0]
[null,null,null,null,null,0]
[null,null,null,null,null,0]
[null,null,null,null,null,0]
{"$rows_left_out":67}
{"sheet":"IV. Development Programs","index":8,"n_rows":28,"n_cols":6,"rows_kept":28,"cut":false,"hidden":false,"merged":[[1,2,1,5]]}
[]
[null,"Section IV. Development Programs","Please avoid changing the format of rows and columns"]
[null,"Program Description ","# Employees ","Course\nCost","Total Cost","Priority\n1 -2 - 3 - 4"]
[null,"Grand Totals:",{"$f":"SUM(C5:C71)","v":0},"N/A",{"$f":"SUM(E5:E71)","v":0},"N/A"]
[null,"Aspiring Leader Program (ALP)\nGS 5-7 federal employees\nEntry-level employees, GS 4-6 federal employees\nGraduate School\nTwo Month Program\nTuition: $2,645* ",null,0,{"$f":"PRODUCT(C5:D5)","v":0}]
[null,"New Leader Program (NLP) \nGS 7-11 federal employees; \nGraduate School\nSix Month Program\nTuition: $3,245*",null,0,{"$f":"PRODUCT(C6:D6)","v":0}]
[null,"Executive Leadership Program (ELP) \nGS 11-13 federal employees\nGraduate School\nNine Month Program\nTuition: $4,445*",null,0,0]
[null,"Executive Potential Program (EPP) \nSenior-level employees\nGS-13-15 federal employees\nGraduate School\nYear Long Program\nTuition: $6,525*",null,0,0]
[null,"Excellence in Government and e-Government Fellows\nSenior-level employees, GS-14-15 federal employees\nPartnership for Public Service\nYear Long Program\nTuition: $9,900, plus approximately\n$2,900 in estimated travel costs*",null,0,0]
[null,"Leadership for a Democratic Society \nSenior-level employees,GS 15-SES members\nOffice of Personnel Management\n*Call for organizational participation is typically done in\nmid- to late June annually\nOne Month Program\nTuition: $19,500*",null,0,0]
[null,"LEGIS Congressional Fellows Program\nSenior-level employees, GS-13 & above, 7+ years of management experience\nBrookings Institute\n7-month program: $4,525*\n12-month program: $6,135*",null,0,0]
[null,"U.S. Citizen; Current federal employee with 2+ years consecutive service immediately preceding the application deadline, (no grade restrictions necessarily apply)\n2-year service contract required; liability insurance required\nTwo Year Program\nCall for cost details",null,null,0]
[null,"Mansfield Fellowship Program\nU.S. Citizen; Current federal employee with 2+ years consecutive service immediately preceding the application deadline, (no grade restrictions necessarily apply)\n2-year service contract required; liability insurance required\nTwo Year Program\nCall for cost details",null,0,0]
[null,"National Security Studies Programs (NSSP)\n(Includes several programs) Senior-level employees, GS-14-15 federal employees\n10+ years of government service\nNational Defense University\nTen Month Residential Program\nNo direct training costs",null,0,0]
[null,"Industrial College of Armed Forces (ICAF)\nGS-14-15 federal employees\n10+ years of government service\nNational Defense University",null,0,0]
{"$rows_left_out":14}
{"sheet":"V. Competency","index":9,"n_rows":42,"n_cols":8,"rows_kept":42,"cut":false,"hidden":false,"merged":[[11,1,12,1],[1,1,1,2],[1,3,1,6],[2,1,3,1]]}
[]
[null,"Section V. General Competencies",null,"Please avoid changing the format of rows and columns"]
[null,"Fundamental Competencies ","Course Identified to Support Competency\n TYPE IN FULL COURSE NAME - NO ABBREVIATIONS   ","# Employees","Course \nCost ","Total Cost","Priority\n1 -2 - 3 - 4"," "]
[null,null,"Grand Totals:",{"$f":"SUM(D5:D10)","v":0},"N/A",{"$f":"SUM(F5:F10)","v":0},"N/A"]
[null,"Integrity/Honesty",null,null,null,{"$f":"PRODUCT(D5:E5)","v":0}]
[null,"Public Service Motivation",null,null,null,0]
[null,"Interpersonal Skills",null,null,null,0]
[null,"Oral Communication",null,null,null,0]
[null,"Written Communication",null,null,null,0]
[null,"Continual Learning",null,null,null,0]
[]
[null,"Leadership Qualifications","Course Identified to Support Competency\n TYPE IN FULL COURSE NAME - NO ABBREVIATIONS   ","# Employees ","Course \nCost ","Total Cost","Priority\n1 -2 - 3 - 4"]
[null,null,"Grand Totals:",{"$f":"SUM(D14:D91)","v":0},"N/A",{"$f":"SUM(F14:F91)","v":0},"N/A"]
[null,"Leading Change"]
[null,"Creativity and Innovation",null,null,null,{"$f":"PRODUCT(D15:E15)","v":0}]
{"$rows_left_out":28}
{"sheet":"VI. PMCDP-ACMP","index":10,"n_rows":15,"n_cols":2,"rows_kept":15,"cut":false,"hidden":false,"merged":[[12,1,12,5],[14,1,14,5],[1,1,1,5],[6,1,6,5],[3,1,3,5],[4,1,4,5],[7,1,7,5],[8,1,8,5],[9,1,9,5],[10,1,10,5],[11,1,11,5]]}
[]
[null,"DOE Certification Programs ***Internet Links***"]
[]
[null,"The Department of Energy (DOE) Acquisition Workforce consists of a broad range of professional and technical personnel including: Contract Specialists/Contracting Officers, Contracting Officer's Technical Representatives, Financial Assistance Personnel, Technical Project Officers, Personal Property Managers, Real Estate Contracting Officers, Federal Project Directors/Program Managers, as well as personnel who perform acquisition-related activities and functions within DOE."]
[null,"Acquisition Certifications Program - CLICK"]
[]
[null,"In 1998, DOE defined its acquisition workforce to include contract specialists/contacting officers, purchasing agents, financial assistance specialists, property managers, and project managers under DOE’s umbrella directive Program and Project Management for the Acquisition of Capital Assets, DOE O 413.3B, establishing training and certification requirements for the acquisition workforce. In 2001, the Deputy Secretary of Energy directed the DOE Office of Engineering and Construction Management (OECM) to establish the DOE Project Management Career Development Program (PMCDP). The PMCDP requirements are included in DOE O 361.1B, Acquisition Career Development Program (pdf), as a component of the DOE acquisition workforce career development program. The PMCDP Module establishes a well-defined career path that includes certification, minimum training and continuing education (CE) requirements, and project responsibilities commensurate with clearly defined qualifications. "]
[null,"Project Management Career Development Program - CLICK"]
[null,"Training"]
[null,"Certification Package"]
[null,"Certification"]
[null,"Newsletters"]
[null,"Federal Project Director Toolbox"]
[]
[null,"NOTE: A separate Needs Assessment is completed for these programs.  The FY16 courses will be posted in CHRIS the month of August, 2015. "]