{"text_format":"1","workbook":"xlsx","n_sheets":12,"sheets":["Info","Index","Inputs","MainModule","Outputs","EIA_Elec","EIA.NG","EIA.Oil","RefTables","SC.AC","MA.AC","PA.AC"],"not_rendered":{"charts":22,"images":2,"macros":1,"external_links":8,"defined_names":144,"comments":0,"pivot_tables":0},"unopened":[],"bounds":{"document_bytes":16777216,"sheet_cells":100000,"rows_first":2000,"rows_last":500,"rows_between":2000,"halvings":0,"cell_chars":16384,"cell_head_chars":4096},"cells_cut":0,"cells_raw":0,"read":"whole","date_system":"1900"}

{"sheet":"Info","index":0,"n_rows":39,"n_cols":4,"rows_kept":39,"cut":false,"hidden":false,"merged":[]}
[]
[null,null,null,"Cost-effectiveness Screening Tool"]
[null,null,null,"for Energy Efficiency Program Administrators "]
[null,null,null,"Benefit cost analysis of a new energy efficiency program promoting SEP projects"]
[]
[null,"Date Created:","2014-10-21"]
[null,"Created by:","Kenji Takahashi","617.453.7038"]
[null,null,"Synapse Energy Economics","ktakahashi@synapse-energy.com"]
[null,null,"for Lawrence Berkeley National Laboratory"]
[null,"Date Modified:","2015-06-18"]
{"$rows_left_out":30}
{"sheet":"Index","index":1,"n_rows":42,"n_cols":11,"rows_kept":42,"cut":false,"hidden":false,"merged":[[13,10,13,11],[2,4,8,5],[13,1,13,2],[13,4,13,5],[21,7,23,8]]}
[]
[null,"Purpose:","SEP program BC analysis",null,"Case Description:"]
[null,"Project:",null,null,"This is a draft version."]
[null,"Version:",7]
[null,"Case Name:"]
[null,"Utility:"]
[null,"State:",{"$f":"VLOOKUP(Inputs!E9,RefTables!$B$7:$C$57,2)","v":"Pennsylvania"}]
[null,"Date Created:"]
[null,"Author:","Synapse Energy Economics"]
[]
{"$rows_left_out":33}
{"sheet":"Inputs","index":2,"n_rows":269,"n_cols":37,"rows_kept":269,"cut":false,"hidden":false,"merged":[[193,6,195,12],[41,6,42,12],[2,5,2,10],[3,5,3,10],[4,5,4,10],[130,6,131,12],[132,6,133,12],[94,6,95,12],[119,6,119,11],[85,6,86,12],[11,6,11,12],[46,6,46,12],[47,6,47,12],[97,6,98,12],[101,6,101,12]]}
[]
[null,{"$f":"\"Inputs: \"&caseName","v":"Inputs: "},null,null,"Key"]
[null,null,null,null,"User input","   Users should enter their own data",null,null,null,null,null,null,"Back to Index Sheet"]
[null,null,null,null,"Default input","   Users can enter their own data if they have values more specific and relevant to their jurisdictions"]
[null,null,null,null,"Calculated data","   Formula should NOT be changed",null,null,null,null,null,null,"Go to Outputs Sheet"]
[null,null,"Variable:","Unit:"]
[]
[null,"1. Customer Load Input"]
[null,null,"State",null,"PA","↓"]
[]
{"$rows_left_out":260}
{"sheet":"MainModule","index":3,"n_rows":288,"n_cols":25,"rows_kept":288,"cut":false,"hidden":false,"merged":[[1,24,1,26],[3,24,3,26]]}
[]
[null,{"$f":"\"Main Module\"","v":"Main Module"},null,null,null,null,null,null,null,null,null,null,null,null,null,null,null,null,null,null,null,null,null,null,"Back to Index Sheet"]
[]
[null,null,null,null,null,null,null,2015,2016,2017,2018,2019,2020,2021,2022,2023,2024,2025,2026,2027,2028,2029,2030,null,"Go to Outputs Sheet"]
[]
[null,"Annual Incremental Savings",null,null,"Total","Total discounted savings"]
[null,null,"Savings persistence"]
[null,null,"Operational energy savings","1 or 0",null,null,null,{"$f":"IF((MainModule!H$4-MainModule!$H$4)=0,0,IF((MainModule!H$4-MainModule!$H$4)<(Inputs!$E$65+1),1,0))","v":0},{"$f":"IF((MainModule!I$4-MainModule!$H$4)=0,0,IF((MainModule!I$4-MainModule!$H$4)<(Inputs!$E$65+1),1,0))","v":1},{"$f":"IF((MainModule!J$4-MainModule!$H$4)=0,0,IF((MainModule!J$4-MainModule!$H$4)<(Inputs!$E$65+1),1,0))","v":1},{"$f":"IF((MainModule!K$4-MainModule!$H$4)=0,0,IF((MainModule!K$4-MainModule!$H$4)<(Inputs!$E$65+1),1,0))","v":1},{"$f":"IF((MainModule!L$4-MainModule!$H$4)=0,0,IF((MainModule!L$4-MainModule!$H$4)<(Inputs!$E$65+1),1,0))","v":0},{"$f":"IF((MainModule!M$4-MainModule!$H$4)=0,0,IF((MainModule!M$4-MainModule!$H$4)<(Inputs!$E$65+1),1,0))","v":0},{"$f":"IF((MainModule!N$4-MainModule!$H$4)=0,0,IF((MainModule!N$4-MainModule!$H$4)<(Inputs!$E$65+1),1,0))","v":0},{"$f":"IF((MainModule!O$4-MainModule!$H$4)=0,0,IF((MainModule!O$4-MainModule!$H$4)<(Inputs!$E$65+1),1,0))","v":0},{"$f":"IF((MainModule!P$4-MainModule!$H$4)=0,0,IF((MainModule!P$4-MainModule!$H$4)<(Inputs!$E$65+1),1,0))","v":0},{"$f":"IF((MainModule!Q$4-MainModule!$H$4)=0,0,IF((MainModule!Q$4-MainModule!$H$4)<(Inputs!$E$65+1),1,0))","v":0},{"$f":"IF((MainModule!R$4-MainModule!$H$4)=0,0,IF((MainModule!R$4-MainModule!$H$4)<(Inputs!$E$65+1),1,0))","v":0},{"$f":"IF((MainModule!S$4-MainModule!$H$4)=0,0,IF((MainModule!S$4-MainModule!$H$4)<(Inputs!$E$65+1),1,0))","v":0},{"$f":"IF((MainModule!T$4-MainModule!$H$4)=0,0,IF((MainModule!T$4-MainModule!$H$4)<(Inputs!$E$65+1),1,0))","v":0},{"$f":"IF((MainModule!U$4-MainModule!$H$4)=0,0,IF((MainModule!U$4-MainModule!$H$4)<(Inputs!$E$65+1),1,0))","v":0},{"$f":"IF((MainModule!V$4-MainModule!$H$4)=0,0,IF((MainModule!V$4-MainModule!$H$4)<(Inputs!$E$65+1),1,0))","v":0},{"$f":"IF((MainModule!W$4-MainModule!$H$4)=0,0,IF((MainModule!W$4-MainModule!$H$4)<(Inputs!$E$65+1),1,0))","v":0}]
[null,null,"Capital related energy savings","1 or 0",null,null,null,{"$f":"IF((MainModule!H$4-MainModule!$H$4)=0,0,IF((MainModule!H$4-MainModule!$H$4)<Inputs!$E$66+1,1,0))","v":0},{"$f":"IF((MainModule!I$4-MainModule!$H$4)=0,0,IF((MainModule!I$4-MainModule!$H$4)<Inputs!$E$66+1,1,0))","v":1},{"$f":"IF((MainModule!J$4-MainModule!$H$4)=0,0,IF((MainModule!J$4-MainModule!$H$4)<Inputs!$E$66+1,1,0))","v":1},{"$f":"IF((MainModule!K$4-MainModule!$H$4)=0,0,IF((MainModule!K$4-MainModule!$H$4)<Inputs!$E$66+1,1,0))","v":1},{"$f":"IF((MainModule!L$4-MainModule!$H$4)=0,0,IF((MainModule!L$4-MainModule!$H$4)<Inputs!$E$66+1,1,0))","v":1},{"$f":"IF((MainModule!M$4-MainModule!$H$4)=0,0,IF((MainModule!M$4-MainModule!$H$4)<Inputs!$E$66+1,1,0))","v":1},{"$f":"IF((MainModule!N$4-MainModule!$H$4)=0,0,IF((MainModule!N$4-MainModule!$H$4)<Inputs!$E$66+1,1,0))","v":1},{"$f":"IF((MainModule!O$4-MainModule!$H$4)=0,0,IF((MainModule!O$4-MainModule!$H$4)<Inputs!$E$66+1,1,0))","v":1},{"$f":"IF((MainModule!P$4-MainModule!$H$4)=0,0,IF((MainModule!P$4-MainModule!$H$4)<Inputs!$E$66+1,1,0))","v":1},{"$f":"IF((MainModule!Q$4-MainModule!$H$4)=0,0,IF((MainModule!Q$4-MainModule!$H$4)<Inputs!$E$66+1,1,0))","v":1},{"$f":"IF((MainModule!R$4-MainModule!$H$4)=0,0,IF((MainModule!R$4-MainModule!$H$4)<Inputs!$E$66+1,1,0))","v":1},{"$f":"IF((MainModule!S$4-MainModule!$H$4)=0,0,IF((MainModule!S$4-MainModule!$H$4)<Inputs!$E$66+1,1,0))","v":1},{"$f":"IF((MainModule!T$4-MainModule!$H$4)=0,0,IF((MainModule!T$4-MainModule!$H$4)<Inputs!$E$66+1,1,0))","v":1},{"$f":"IF((MainModule!U$4-MainModule!$H$4)=0,0,IF((MainModule!U$4-MainModule!$H$4)<Inputs!$E$66+1,1,0))","v":1},{"$f":"IF((MainModule!V$4-MainModule!$H$4)=0,0,IF((MainModule!V$4-MainModule!$H$4)<Inputs!$E$66+1,1,0))","v":1},{"$f":"IF((MainModule!W$4-MainModule!$H$4)=0,0,IF((MainModule!W$4-MainModule!$H$4)<Inputs!$E$66+1,1,0))","v":0}]
[null,null,"Operational energy savings"]
{"$rows_left_out":279}
{"sheet":"Outputs","index":4,"n_rows":145,"n_cols":16,"rows_kept":145,"cut":false,"hidden":false,"merged":[[1,15,1,17],[118,10,118,17],[69,1,69,8],[69,10,69,17],[98,10,98,17],[6,1,6,3],[8,1,8,3],[7,1,7,3],[12,1,12,8],[12,10,12,17],[31,1,31,8],[50,1,50,8],[50,10,50,17],[98,1,98,8],[118,1,118,8],[142,9,142,10],[143,9,143,10],[144,9,144,10],[143,1,143,2],[144,1,144,2]]}
[]
[null,{"$f":"\"Key Outputs - \"&Index!C7","v":"Key Outputs - Pennsylvania"},null,null,null,null,null,null,null,null,null,null,null,null,null,"Back to Index Sheet"]
[]
[null,"SEP Program Budget ($000)"]
[]
[null,"Program Year",null,null,"Year 1","Year 2","Year 3","Year 4","Year 5"]
[null,"SEP implementation cost",null,null,{"$f":"MainModule!H78","v":183.622292448},{"$f":"MainModule!I78","v":183.622292448},{"$f":"MainModule!J78","v":0},{"$f":"MainModule!K78","v":0},{"$f":"MainModule!L78","v":0}]
[null,"Maintenance cost",null,null,{"$f":"MainModule!H80","v":0},{"$f":"MainModule!I80","v":0},{"$f":"MainModule!J80","v":141},{"$f":"MainModule!K80","v":141},{"$f":"MainModule!L80","v":0}]
[null,"Capital improvement cost",null,null,{"$f":"MainModule!H79","v":0},{"$f":"MainModule!I79","v":2964.5663678569317},{"$f":"MainModule!J79","v":0},{"$f":"MainModule!K79","v":0},{"$f":"MainModule!L79","v":0}]
[null,"Administrative cost",null,null,{"$f":"MainModule!H81","v":0},{"$f":"MainModule!I81","v":0},{"$f":"MainModule!J81","v":0},{"$f":"MainModule!K81","v":0},{"$f":"MainModule!L81","v":0}]
{"$rows_left_out":136}
{"sheet":"EIA_Elec","index":5,"n_rows":1310,"n_cols":256,"rows_kept":1310,"cut":false,"hidden":false,"merged":[]}
["Year","Month","State","Residential Revenue (Thousand $)","Commercial Revenue (Thousand $)","Industrial Revenue (Thousand $)","Transportation Revenue (Thousand $)","Other                 Revenue (Thousand $)","All Sectors        Revenue             (Thousand $)","Residential Sales (MWh)","Commercial Sales (MWh)","Industrial Sales (MWh)","Transportation Sales (MWh)","Other           Sales  (MWh)","All Sector    Sales (MWh)","Average Retail Price Residential (c/kWh)","Average Retail Price Commercial (c/kWh)","Average Retail Price  Industrial (c/kWh)","Average Retail Price Transportation (c/kWh)","Average Retail Price           Other          (c/kWh)","Average Retail Price              All Sectors (c/kWh)"]
[1990,null,"AK Total",167998,177645,36308,0,21301,403247,1661309,1972116,459283,0,161130,4253839,10.112387280150772,9.0078372671790099,7.9053655371524743,null,13.219760441879227,9.4796018373050792]
[1990,null,"AL Total",1366083,738047,1199222,0,34241,3337594,20718679,10978788,27617687,0,610459,59925613,6.5934850383077031,6.7224815708254866,4.3422246041096777,null,5.6090581021821286,5.5695617164567013]
[1990,null,"AR Total",851685,422196,516152,0,42942,1832979,10557865,6075078,10126207,0,606143,27365296,8.066829799395995,6.9496391651267686,5.0971898954860393,null,7.0844668667294686,6.6981880992626577]
[1990,null,"AZ Total",1390115,1138694,560111,0,125807,3214725,15377684,13731291,10033741,0,2326872,41469585,9.0398203006382492,8.2926944014222705,5.5822748464406251,null,5.4067004974919115,7.7520066815233379]
[1990,null,"CA Total",6646479,7541253,4071492,0,404381,18663604,66574670,79691298,55891513,0,8935441,211092921,9.9834952242346819,9.4630821548420503,7.2846337153191758,null,4.5255852509126298,8.8414163353208792]
[1990,null,"CO Total",687084,768032,295788,0,63149,1814049,9787279,13553025,6586860,0,867424,30794589,7.0201738399406004,5.666867728791174,4.490576693599075,null,7.2800614232486076,5.8908043877448728]
[1990,null,"CT Total",1038460,942670,460626,0,47353,2489109,10375882,10342476,6099932,0,368947,27187240,10.008402177279965,9.1145485858512032,7.5513300804008967,null,12.834634784942011,9.1554310036620112]
[1990,null,"DC Total",90320,322119,153717,0,18427,584583,1480356,5073157,2976219,0,318713,9848445,6.1012351083117844,6.3494782440204389,5.1648417001571456,null,5.7816907374346203,5.9357898632728316]
[1990,null,"DE Total",222545,159717,147636,0,5179,535072,2651447,2310713,3271591,0,50114,8283868,8.3933414471418821,6.9120223930881943,4.5126667728331569,null,10.334437482539808,6.4592048062571736]
{"$rows_left_out":1301}
{"sheet":"EIA.NG","index":6,"n_rows":46,"n_cols":53,"rows_kept":46,"cut":false,"hidden":false,"merged":[]}
[]
[null,"Workbook Contents"]
[null,"Natural Gas Industrial Price "]
[]
[null,"Click worksheet name or tab at bottom for data"]
[null,"Worksheet Name","Description","# Of Series","Frequency","Latest Data for"]
[null,"Data 1","Natural Gas Industrial Price ",52,"Annual",2013,"6/30/1997"]
[]
[null,"Release Date:","7/31/2014"]
[null,"Next Release Date:","8/29/2014"]
{"$rows_left_out":37}
{"sheet":"EIA.Oil","index":7,"n_rows":194,"n_cols":15,"rows_kept":194,"cut":false,"hidden":false,"merged":[[63,0,72,0],[63,1,66,12],[67,1,69,3],[67,5,69,10],[67,11,69,11],[67,12,72,12],[70,3,72,3],[70,6,72,6],[70,9,72,9],[70,10,72,10],[132,0,141,0],[132,1,135,12],[136,1,138,3],[136,5,138,10],[136,11,138,11],[136,12,141,12],[139,3,141,3],[139,6,141,6],[139,9,141,9],[139,10,141,10],[3,8,5,8],[3,2,5,2],[3,4,5,4],[3,7,5,7],[3,0,5,0],[3,1,5,1],[3,3,5,3],[3,5,5,5],[3,6,5,6]]}
[]
["Industrial Oil Use Data excluding Transportation"]
[]
["State","Distillate fuel oil","LPG b","Residual fuel oil","Other d","Total use (Trillion Btu)","Total expenditure (million $)","Weighted average ($/Mmbtu)","All Oil ($/MMBtu)"]
[]
[]
["Alabama",{"$f":"(F143/F74)","v":30.334572490706318},{"$f":"(G143/G74)","v":3.8305322128851542},{"$f":"IFERROR(I143/I74,\" \")","v":4.855421686746987},{"$f":"(J143/J74)","v":33.980909601347562},{"$f":"SUM(B7:E7)","v":73.001435991686023},{"$f":"IFERROR(F143+G143+I143+J143,F143+G143+J143)","v":1474.9},{"$f":"G7/F7","v":20.20371215941524},{"$f":"K74","v":20.51}]
["Alaska",23.39351510685335,4.6554934823091247E-2,{"$f":"IFERROR(I144/I75,\" \")","v":" "},0.640279394644936,{"$f":"SUM(B8:E8)","v":24.080349436321377},{"$f":"IFERROR(F144+G144+I144+J144,F144+G144+J144)","v":646.9},{"$f":"G8/F8","v":26.864228100621091},{"$f":"K75","v":27.16}]
["Arizona",32.991882489369928,1.2314410480349345,{"$f":"IFERROR(I145/I76,\" \")","v":" "},17.626339969372125,{"$f":"SUM(B9:E9)","v":51.849663506776992},{"$f":"IFERROR(F145+G145+I145+J145,F145+G145+J145)","v":1111.9000000000001},21.444690761680057,21.96]
["Arkansas",29.696110210696919,2.1085164835164836,6.5050266114725017E-2,7.165160230073953,39.034837190402079,{"$f":"IFERROR(F146+G146+I146+J146,F146+G146+J146)","v":939.1},24.057997101904316,24.39]
{"$rows_left_out":185}
{"sheet":"RefTables","index":8,"n_rows":57,"n_cols":10,"rows_kept":57,"cut":false,"hidden":false,"merged":[]}
[]
[]
[null,null,"EMM Regions"]
[null,null,"Source: AEO2013 Reference Case. ",null,null,null,null,"Custom Inflator"]
[]
[null,"Abbrev.","State","EMM Region",null,null,null,"Ref Year","Index"]
[null,"AL","Alabama","SRSE",null,null,null,2015,{"$f":"VLOOKUP(H7,H25:I36,2)","v":110.02794959036405}]
[null,"AK","Alaska","USA",null,null,null,"Year","Inflator"]
[null,"AZ","Arizona","AZNM",null,null,null,2005,{"$f":"I$7/I25","v":1.1961119884154894}]
[null,"AR","Arkansas","SRDA",null,null,null,{"$f":"H26","v":2006},1.1604610035476202]
{"$rows_left_out":48}
{"sheet":"SC.AC","index":9,"n_rows":30,"n_cols":20,"rows_kept":30,"cut":false,"hidden":false,"merged":[]}
[]
[null,"South Carolina avoided cost data"]
[null,"Source"]
[null,"ACEEE (2009). South Carolina's Energy Future: Minding its Efficiency Resources"]
[]
[]
[]
[null,"South Carolina Avoided Electricity Cost (in constant 2013 dollars)"]
[null,"Case","SC Reference Case Draft - 9/16/09"]
[]
{"$rows_left_out":21}
{"sheet":"MA.AC","index":10,"n_rows":129,"n_cols":47,"rows_kept":129,"cut":false,"hidden":false,"merged":[[25,19,27,22],[27,6,28,6],[25,2,27,5],[25,6,26,8],[25,9,25,13],[25,14,25,18],[27,7,28,7],[27,8,28,8],[27,34,27,37],[25,25,25,32],[26,25,27,28],[26,29,27,30],[26,31,27,32],[78,33,78,46],[79,18,79,31],[79,33,79,46],[27,9,27,12],[26,9,26,13],[26,14,26,18],[27,14,27,17],[27,38,27,41],[77,32,77,46],[25,33,27,33],[25,34,25,37],[25,38,25,41],[26,34,26,37],[26,38,26,41],[77,2,77,15],[77,17,77,31],[80,3,81,14],[82,20,84,20],[78,18,78,31],[83,14,84,14],[83,22,83,25],[83,27,83,29],[83,31,84,31],[82,22,82,31],[82,35,84,35],[82,37,82,46],[83,5,83,8],[83,10,83,12],[83,37,83,40],[83,46,84,46],[83,42,83,44],[120,2,120,3],[120,17,120,18],[120,32,120,33],[125,3,127,3],[118,2,118,3],[118,17,118,18],[118,32,118,33],[119,2,119,3],[119,17,119,18],[119,32,119,33]]}
[]
[null,"MA avoided cost data"]
[null,"Source"]
[null,"Synapse 2013. AESC, appendix B workbook, \"MA\" sheet"]
[]
[null,"Summary table"]
[]
[null,"MA Avoided Cost Summary - Statewide (15 year levelized)",null,null,null,null,null,null,null,null,null,null,null,null,null,"Seasonal Time Allocation"]
[]
[null,null,"Electricity","Capacity","Energy DRIPE","Capacity DRIPE","Fuel","Fuel DRIPE",null,null,null,null,null,null,null,null,"Winter peak","Winter off-peak","Summer peak","Summer off-peak","Total"]
{"$rows_left_out":120}
{"sheet":"PA.AC","index":11,"n_rows":48,"n_cols":26,"rows_kept":48,"cut":false,"hidden":false,"merged":[[43,1,43,3],[47,1,47,3],[46,1,46,3],[45,1,45,3],[44,1,44,3]]}
[]
[null,"PA avoided cost data"]
[null,"Source"]
[null,"GDS Associates et al. (2015). Energy Efficiency Potential Study for Pennsylvania, Appendix B, February 2015"]
[]
[]
[]
[null,"First Energy - PECO",null,null,null,null,null,null,null,null,"First Energy - PECO"]
[null,"(nominal $)",null,null,null,null,null,null,null,null,"(2015 $)"]
[null,null,"Winter Peak","Winter Off-Peak","Summer Peak","Summer Off Peak","Avoided Capacity","Avoided T&D","Avoided Transmission Only",null,null,"Winter Peak","Winter Off-Peak","Summer Peak","Summer Off Peak","Annual Average","Avoided Capacity","Avoided T&D","Avoided Transmission Only"]
{"$rows_left_out":38}